Diagnosed failure
Parameters/TestRpc.TestCallWithChainCertAndChainCA/SSL_UnixSocket: /data0/somelongdirectorytoavoidrpathissues/src/kudu/src/kudu/rpc/rpc-test.cc:270: Failure
Failed
Bad status: Runtime error: could not verify certificate chain (error with cert: subject=CN = localhost, ST = sadfjas, C = AS, emailAddress = sdflkdsajf, O = lskdfjlsad, OU = sldfkja, issuer=C = AS, ST = ASDfkjdhf, L = lskdjf, O = saldfja, OU = skdjf, CN = localhost, emailAddress = sadjflkadsj): : certificate has expired
Google Test trace:
/data0/somelongdirectorytoavoidrpathissues/src/kudu/src/kudu/rpc/rpc-test.cc:267: Connecting to unix:/tmp/dist-test-taskhgjQna/test-tmp/rpc-test-29eee9d20e6c414eba10d553707406bb.sock
I20260929 02:01:23.325111 23354 test_util.cc:175] -----------------------------------------------
I20260929 02:01:23.325173 23354 test_util.cc:176] Had fatal failures, leaving test files at /tmp/dist-test-taskhgjQna/test-tmp/rpc-test.6.Parameters_TestRpc.TestCallWithChainCertAndChainCA_SSL_UnixSocket.1790647283272127-23354-0
Full log
Note: This is test shard 7 of 8.
[==========] Running 21 tests from 2 test suites.
[----------] Global test environment set-up.
[----------] 20 tests from Parameters/TestRpc
[ RUN ] Parameters/TestRpc.TestMessengerCreateDestroy/SSL_UnixSocket
WARNING: Logging before InitGoogleLogging() is written to STDERR
I20260929 02:01:23.290864 23354 rpc-test.cc:169] started messenger TestCreateDestroy
[ OK ] Parameters/TestRpc.TestMessengerCreateDestroy/SSL_UnixSocket (17 ms)
[ RUN ] Parameters/TestRpc.TestNegotiationDeadlock/SSL_UnixSocket
I20260929 02:01:23.308954 23375 acceptor_pool.cc:254] collecting diagnostics on the listening RPC socket unix:/tmp/dist-test-taskhgjQna/test-tmp/rpc-test-67aaa18d8e594d3a85cfbfc540f6ae46.sock every 8 connection(s)
I20260929 02:01:23.308954 23374 acceptor_pool.cc:254] collecting diagnostics on the listening RPC socket unix:/tmp/dist-test-taskhgjQna/test-tmp/rpc-test-67aaa18d8e594d3a85cfbfc540f6ae46.sock every 8 connection(s)
[ OK ] Parameters/TestRpc.TestNegotiationDeadlock/SSL_UnixSocket (23 ms)
[ RUN ] Parameters/TestRpc.TestCallWithChainCertAndChainCA/SSL_UnixSocket
I20260929 02:01:23.321144 23390 acceptor_pool.cc:254] collecting diagnostics on the listening RPC socket unix:/tmp/dist-test-taskhgjQna/test-tmp/rpc-test-29eee9d20e6c414eba10d553707406bb.sock every 8 connection(s)
I20260929 02:01:23.321152 23391 acceptor_pool.cc:254] collecting diagnostics on the listening RPC socket unix:/tmp/dist-test-taskhgjQna/test-tmp/rpc-test-29eee9d20e6c414eba10d553707406bb.sock every 8 connection(s)
/data0/somelongdirectorytoavoidrpathissues/src/kudu/src/kudu/rpc/rpc-test.cc:270: Failure
Failed
Bad status: Runtime error: could not verify certificate chain (error with cert: subject=CN = localhost, ST = sadfjas, C = AS, emailAddress = sdflkdsajf, O = lskdfjlsad, OU = sldfkja, issuer=C = AS, ST = ASDfkjdhf, L = lskdjf, O = saldfja, OU = skdjf, CN = localhost, emailAddress = sadjflkadsj): : certificate has expired
Google Test trace:
/data0/somelongdirectorytoavoidrpathissues/src/kudu/src/kudu/rpc/rpc-test.cc:267: Connecting to unix:/tmp/dist-test-taskhgjQna/test-tmp/rpc-test-29eee9d20e6c414eba10d553707406bb.sock
I20260929 02:01:23.325111 23354 test_util.cc:175] -----------------------------------------------
I20260929 02:01:23.325173 23354 test_util.cc:176] Had fatal failures, leaving test files at /tmp/dist-test-taskhgjQna/test-tmp/rpc-test.6.Parameters_TestRpc.TestCallWithChainCertAndChainCA_SSL_UnixSocket.1790647283272127-23354-0
[ FAILED ] Parameters/TestRpc.TestCallWithChainCertAndChainCA/SSL_UnixSocket, where GetParam() = (true, true) (9 ms)
[ RUN ] Parameters/TestRpc.TestCallWithPasswordProtectedKey/SSL_UnixSocket
I20260929 02:01:23.333457 23416 acceptor_pool.cc:254] collecting diagnostics on the listening RPC socket unix:/tmp/dist-test-taskhgjQna/test-tmp/rpc-test-8591e0bda2ca4d258491eab8119eab96.sock every 8 connection(s)
I20260929 02:01:23.333457 23415 acceptor_pool.cc:254] collecting diagnostics on the listening RPC socket unix:/tmp/dist-test-taskhgjQna/test-tmp/rpc-test-8591e0bda2ca4d258491eab8119eab96.sock every 8 connection(s)
W20260929 02:01:23.344594 23412 connection.cc:196] Error closing socket: Network error: TlsSocket::Close: Broken pipe
[ OK ] Parameters/TestRpc.TestCallWithPasswordProtectedKey/SSL_UnixSocket (20 ms)
[ RUN ] Parameters/TestRpc.TestCallToBadServer/SSL_UnixSocket
I20260929 02:01:23.363906 23354 rpc-test.cc:394] Status: Network error: Client connection negotiation failed: client connection to 0.0.0.0:0: connect: Connection refused (error 111)
I20260929 02:01:23.364250 23354 rpc-test.cc:394] Status: Network error: Client connection negotiation failed: client connection to 0.0.0.0:0: connect: Connection refused (error 111)
I20260929 02:01:23.364432 23354 rpc-test.cc:394] Status: Network error: Client connection negotiation failed: client connection to 0.0.0.0:0: connect: Connection refused (error 111)
I20260929 02:01:23.364574 23354 rpc-test.cc:394] Status: Network error: Client connection negotiation failed: client connection to 0.0.0.0:0: connect: Connection refused (error 111)
I20260929 02:01:23.364711 23354 rpc-test.cc:394] Status: Network error: Client connection negotiation failed: client connection to 0.0.0.0:0: connect: Connection refused (error 111)
[ OK ] Parameters/TestRpc.TestCallToBadServer/SSL_UnixSocket (19 ms)
[ RUN ] Parameters/TestRpc.TestWrongService/SSL_UnixSocket
I20260929 02:01:23.382637 23451 acceptor_pool.cc:254] collecting diagnostics on the listening RPC socket unix:/tmp/dist-test-taskhgjQna/test-tmp/rpc-test-683fe09bbddf4b2dbc5f776a7346112c.sock every 8 connection(s)
I20260929 02:01:23.382639 23450 acceptor_pool.cc:254] collecting diagnostics on the listening RPC socket unix:/tmp/dist-test-taskhgjQna/test-tmp/rpc-test-683fe09bbddf4b2dbc5f776a7346112c.sock every 8 connection(s)
I20260929 02:01:23.391060 23447 messenger.cc:345] service WrongServiceName not registered on TestServer
W20260929 02:01:23.391683 23447 connection.cc:196] Error closing socket: Network error: TlsSocket::Close: Broken pipe
[ OK ] Parameters/TestRpc.TestWrongService/SSL_UnixSocket (27 ms)
[ RUN ] Parameters/TestRpc.TestConnectionKeepalive/SSL_UnixSocket
I20260929 02:01:23.401697 23473 acceptor_pool.cc:254] collecting diagnostics on the listening RPC socket unix:/tmp/dist-test-taskhgjQna/test-tmp/rpc-test-8362ae0995494e3990f776406c116f07.sock every 8 connection(s)
I20260929 02:01:23.401734 23474 acceptor_pool.cc:254] collecting diagnostics on the listening RPC socket unix:/tmp/dist-test-taskhgjQna/test-tmp/rpc-test-8362ae0995494e3990f776406c116f07.sock every 8 connection(s)
I20260929 02:01:23.401930 23354 rpc-test.cc:488] Connecting to unix:/tmp/dist-test-taskhgjQna/test-tmp/rpc-test-8362ae0995494e3990f776406c116f07.sock
W20260929 02:01:23.893839 23486 connection.cc:196] Error closing socket: Network error: TlsSocket::Close: Broken pipe
[ OK ] Parameters/TestRpc.TestConnectionKeepalive/SSL_UnixSocket (1051 ms)
[ RUN ] Parameters/TestRpc.TestClientConnectionMetrics/SSL_UnixSocket
I20260929 02:01:24.459517 23498 acceptor_pool.cc:254] collecting diagnostics on the listening RPC socket unix:/tmp/dist-test-taskhgjQna/test-tmp/rpc-test-f17b47ea80f34f3bac4c2e57ff32adb2.sock every 8 connection(s)
I20260929 02:01:24.459548 23499 acceptor_pool.cc:254] collecting diagnostics on the listening RPC socket unix:/tmp/dist-test-taskhgjQna/test-tmp/rpc-test-f17b47ea80f34f3bac4c2e57ff32adb2.sock every 8 connection(s)
I20260929 02:01:24.459673 23354 rpc-test.cc:569] Connecting to unix:/tmp/dist-test-taskhgjQna/test-tmp/rpc-test-f17b47ea80f34f3bac4c2e57ff32adb2.sock
W20260929 02:01:32.700538 23495 connection.cc:196] Error closing socket: Network error: TlsSocket::Close: Broken pipe
[ OK ] Parameters/TestRpc.TestClientConnectionMetrics/SSL_UnixSocket (8257 ms)
[ RUN ] Parameters/TestRpc.TestCredentialsPolicy/SSL_UnixSocket
I20260929 02:01:32.709195 23521 acceptor_pool.cc:254] collecting diagnostics on the listening RPC socket unix:/tmp/dist-test-taskhgjQna/test-tmp/rpc-test-086b080ce0c345f59eb8ef8c4e056ceb.sock every 8 connection(s)
I20260929 02:01:32.709266 23522 acceptor_pool.cc:254] collecting diagnostics on the listening RPC socket unix:/tmp/dist-test-taskhgjQna/test-tmp/rpc-test-086b080ce0c345f59eb8ef8c4e056ceb.sock every 8 connection(s)
I20260929 02:01:32.709384 23354 rpc-test.cc:700] Connecting to unix:/tmp/dist-test-taskhgjQna/test-tmp/rpc-test-086b080ce0c345f59eb8ef8c4e056ceb.sock
W20260929 02:01:32.738118 23520 connection.cc:196] Error closing socket: Network error: TlsSocket::Close: Broken pipe
[ OK ] Parameters/TestRpc.TestCredentialsPolicy/SSL_UnixSocket (40 ms)
[ RUN ] Parameters/TestRpc.TestCallLongerThanKeepalive/SSL_UnixSocket
I20260929 02:01:32.754900 23546 acceptor_pool.cc:254] collecting diagnostics on the listening RPC socket unix:/tmp/dist-test-taskhgjQna/test-tmp/rpc-test-a3a1059449d54af4876ec740690f5b0a.sock every 8 connection(s)
I20260929 02:01:32.754916 23547 acceptor_pool.cc:254] collecting diagnostics on the listening RPC socket unix:/tmp/dist-test-taskhgjQna/test-tmp/rpc-test-a3a1059449d54af4876ec740690f5b0a.sock every 8 connection(s)
I20260929 02:01:32.768410 23550 rpc-test-base.h:222] got call: sleep_micros: 3000000 deferred: true
I20260929 02:01:35.769136 23550 rpcz_store.cc:275] Call kudu.rpc.GenericCalculatorService.Sleep from unix:<unnamed> (request call id 0) took 3000 ms. Trace:
I20260929 02:01:35.769269 23550 rpcz_store.cc:276] 0929 02:01:32.768355 (+ 0us) service_pool.cc:170] Inserting onto call queue
0929 02:01:32.768388 (+ 33us) service_pool.cc:227] Handling call
0929 02:01:35.769118 (+3000730us) inbound_call.cc:173] Queueing success response
Metrics: {}
[ OK ] Parameters/TestRpc.TestCallLongerThanKeepalive/SSL_UnixSocket (3028 ms)
[ RUN ] Parameters/TestRpc.TestRpcSidecar/SSL_UnixSocket
I20260929 02:01:35.781410 23571 acceptor_pool.cc:254] collecting diagnostics on the listening RPC socket unix:/tmp/dist-test-taskhgjQna/test-tmp/rpc-test-8a3a0f1ba06d4b279389a1245ecad4f1.sock every 8 connection(s)
I20260929 02:01:35.781453 23572 acceptor_pool.cc:254] collecting diagnostics on the listening RPC socket unix:/tmp/dist-test-taskhgjQna/test-tmp/rpc-test-8a3a0f1ba06d4b279389a1245ecad4f1.sock every 8 connection(s)
W20260929 02:01:35.827876 23568 connection.cc:196] Error closing socket: Network error: TlsSocket::Close: Broken pipe
[ OK ] Parameters/TestRpc.TestRpcSidecar/SSL_UnixSocket (57 ms)
[ RUN ] Parameters/TestRpc.TestRpcSidecarLimits/SSL_UnixSocket
I20260929 02:01:37.509508 23596 acceptor_pool.cc:254] collecting diagnostics on the listening RPC socket unix:/tmp/dist-test-taskhgjQna/test-tmp/rpc-test-09bccb29dfb540c8b63c008ddcf84077.sock every 8 connection(s)
I20260929 02:01:37.509550 23597 acceptor_pool.cc:254] collecting diagnostics on the listening RPC socket unix:/tmp/dist-test-taskhgjQna/test-tmp/rpc-test-09bccb29dfb540c8b63c008ddcf84077.sock every 8 connection(s)
W20260929 02:01:37.517522 23354 serialization.cc:72] Serialized kudu.rpc_test.PushStringsRequestPB (2147483654 bytes) is larger than the maximum configured RPC message size (52428800 bytes). Sending anyway, but peer may reject the data.
W20260929 02:01:37.520514 23593 connection.cc:535] server connection from unix:<unnamed> recv error: Network error: RPC frame had a length of 2147483714, but we only support messages up to 52428800 bytes long.
W20260929 02:01:37.520571 23593 connection.cc:158] shutting down server connection from unix:<unnamed> with pending inbound data: 4/2147483714 bytes received; last active 0 ns ago: status Network error: RPC frame had a length of 2147483714, but we only support messages up to 52428800 bytes long.
W20260929 02:01:37.520751 23609 connection.cc:698] client connection to unix:/tmp/dist-test-taskhgjQna/test-tmp/rpc-test-09bccb29dfb540c8b63c008ddcf84077.sock send error: Network error: failed to write to TLS socket: Broken pipe
W20260929 02:01:37.520875 23609 connection.cc:196] Error closing socket: Network error: TlsSocket::Close: Success
I20260929 02:01:37.534435 23621 acceptor_pool.cc:254] collecting diagnostics on the listening RPC socket unix:/tmp/dist-test-taskhgjQna/test-tmp/rpc-test-09bccb29dfb540c8b63c008ddcf84077.sock every 8 connection(s)
I20260929 02:01:37.534451 23622 acceptor_pool.cc:254] collecting diagnostics on the listening RPC socket unix:/tmp/dist-test-taskhgjQna/test-tmp/rpc-test-09bccb29dfb540c8b63c008ddcf84077.sock every 8 connection(s)
W20260929 02:01:42.168485 23618 connection.cc:577] server connection from unix:<unnamed>: received bad data: 'Corruption: Invalid packet: message had a length of 2147483710, but we only support messages up to 2147483647 bytes
'
W20260929 02:01:42.168795 23634 connection.cc:196] Error closing socket: Network error: TlsSocket::Close: Broken pipe
[ OK ] Parameters/TestRpc.TestRpcSidecarLimits/SSL_UnixSocket (6341 ms)
[ RUN ] Parameters/TestRpc.TestCallTimeoutDoesntAffectNegotiation/SSL_UnixSocket
I20260929 02:01:42.186487 23646 acceptor_pool.cc:254] collecting diagnostics on the listening RPC socket unix:/tmp/dist-test-taskhgjQna/test-tmp/rpc-test-bffebc4a8cbc481598382335a638d133.sock every 8 connection(s)
I20260929 02:01:42.186510 23647 acceptor_pool.cc:254] collecting diagnostics on the listening RPC socket unix:/tmp/dist-test-taskhgjQna/test-tmp/rpc-test-bffebc4a8cbc481598382335a638d133.sock every 8 connection(s)
W20260929 02:01:42.194139 23640 negotiation.cc:266] Injecting 500ms delay in negotiation
I20260929 02:01:42.244413 23354 rpc-test-base.h:595] status: Timed out: connection negotiation to unix:/tmp/dist-test-taskhgjQna/test-tmp/rpc-test-bffebc4a8cbc481598382335a638d133.sock for RPC Sleep timed out after 0.050s (ON_OUTBOUND_QUEUE), seconds elapsed: 0.0505621
W20260929 02:01:42.702072 23643 connection.cc:196] Error closing socket: Network error: TlsSocket::Close: Broken pipe
[ OK ] Parameters/TestRpc.TestCallTimeoutDoesntAffectNegotiation/SSL_UnixSocket (532 ms)
[ RUN ] Parameters/TestRpc.TestRpcHandlerLatencyMetric/SSL_UnixSocket
I20260929 02:01:42.713682 23671 acceptor_pool.cc:254] collecting diagnostics on the listening RPC socket unix:/tmp/dist-test-taskhgjQna/test-tmp/rpc-test-26436d4e51db4ab8972481378374df36.sock every 8 connection(s)
I20260929 02:01:42.713721 23672 acceptor_pool.cc:254] collecting diagnostics on the listening RPC socket unix:/tmp/dist-test-taskhgjQna/test-tmp/rpc-test-26436d4e51db4ab8972481378374df36.sock every 8 connection(s)
I20260929 02:01:42.752311 23354 rpc-test.cc:1236] Sleep() min lat: 20332
I20260929 02:01:42.752381 23354 rpc-test.cc:1237] Sleep() mean lat: 20332
I20260929 02:01:42.752405 23354 rpc-test.cc:1238] Sleep() max lat: 20332
I20260929 02:01:42.752417 23354 rpc-test.cc:1239] Sleep() #calls: 1
W20260929 02:01:42.753000 23668 connection.cc:196] Error closing socket: Network error: TlsSocket::Close: Broken pipe
[ OK ] Parameters/TestRpc.TestRpcHandlerLatencyMetric/SSL_UnixSocket (50 ms)
[ RUN ] Parameters/TestRpc.TimedOutOnResponseMetricServiceQueue/SSL_UnixSocket
I20260929 02:01:42.769172 23697 acceptor_pool.cc:254] collecting diagnostics on the listening RPC socket unix:/tmp/dist-test-taskhgjQna/test-tmp/rpc-test-4bb02b1c89be40c2aefe148e761d7b86.sock every 8 connection(s)
I20260929 02:01:42.769178 23698 acceptor_pool.cc:254] collecting diagnostics on the listening RPC socket unix:/tmp/dist-test-taskhgjQna/test-tmp/rpc-test-4bb02b1c89be40c2aefe148e761d7b86.sock every 8 connection(s)
W20260929 02:01:42.827504 23699 rpcz_store.cc:267] Call kudu.rpc_test.CalculatorService.Sleep from unix:<unnamed> (request call id 2) took 20 ms (client timeout 20 ms). Trace:
W20260929 02:01:42.827611 23699 rpcz_store.cc:269] 0929 02:01:42.807224 (+ 0us) service_pool.cc:170] Inserting onto call queue
0929 02:01:42.827447 (+ 20223us) service_pool.cc:214] Skipping call since client already timed out
0929 02:01:42.827488 (+ 41us) inbound_call.cc:173] Queueing failure response
Metrics: {}
W20260929 02:01:42.828315 23694 connection.cc:196] Error closing socket: Network error: TlsSocket::Close: Broken pipe
[ OK ] Parameters/TestRpc.TimedOutOnResponseMetricServiceQueue/SSL_UnixSocket (75 ms)
[ RUN ] Parameters/TestRpc.RpcPendingConnectionsMetric/SSL_UnixSocket
I20260929 02:01:42.831090 23720 acceptor_pool.cc:254] collecting diagnostics on the listening RPC socket 0.0.0.0:36913 every 8 connection(s)
I20260929 02:01:42.831141 23721 acceptor_pool.cc:254] collecting diagnostics on the listening RPC socket 0.0.0.0:36913 every 8 connection(s)
W20260929 02:01:42.831823 23716 negotiation.cc:337] Failed RPC negotiation. Trace:
0929 02:01:42.831598 (+ 0us) reactor.cc:625] Submitting negotiation task for server connection from 127.0.0.1:55032 (local address 127.0.0.1:36913)
0929 02:01:42.831645 (+ 47us) server_negotiation.cc:206] Beginning negotiation
0929 02:01:42.831647 (+ 2us) server_negotiation.cc:399] Waiting for connection header
0929 02:01:42.831725 (+ 78us) negotiation.cc:327] Negotiation complete: Network error: Server connection negotiation failed: server connection from 127.0.0.1:55032: BlockingRecv error: recv got EOF from 127.0.0.1:55032 (error 108)
Metrics: {"server-negotiator.queue_time_us":15}
[ OK ] Parameters/TestRpc.RpcPendingConnectionsMetric/SSL_UnixSocket (13 ms)
[ RUN ] Parameters/TestRpc.TestRpcContextClientDeadline/SSL_UnixSocket
I20260929 02:01:42.850301 23736 acceptor_pool.cc:254] collecting diagnostics on the listening RPC socket unix:/tmp/dist-test-taskhgjQna/test-tmp/rpc-test-e5a8d3719d7f49009aa5fc48ecf41f22.sock every 8 connection(s)
I20260929 02:01:42.850322 23737 acceptor_pool.cc:254] collecting diagnostics on the listening RPC socket unix:/tmp/dist-test-taskhgjQna/test-tmp/rpc-test-e5a8d3719d7f49009aa5fc48ecf41f22.sock every 8 connection(s)
[ OK ] Parameters/TestRpc.TestRpcContextClientDeadline/SSL_UnixSocket (39 ms)
[ RUN ] Parameters/TestRpc.TestApplicationFeatureFlagUnsupportedServer/SSL_UnixSocket
I20260929 02:01:42.890021 23761 acceptor_pool.cc:254] collecting diagnostics on the listening RPC socket unix:/tmp/dist-test-taskhgjQna/test-tmp/rpc-test-ee167df6943f4770a6c6f4d28a8bf854.sock every 8 connection(s)
I20260929 02:01:42.890050 23762 acceptor_pool.cc:254] collecting diagnostics on the listening RPC socket unix:/tmp/dist-test-taskhgjQna/test-tmp/rpc-test-ee167df6943f4770a6c6f4d28a8bf854.sock every 8 connection(s)
[ OK ] Parameters/TestRpc.TestApplicationFeatureFlagUnsupportedServer/SSL_UnixSocket (35 ms)
[ RUN ] Parameters/TestRpc.TestCancellationAsync/SSL_UnixSocket
I20260929 02:01:42.931573 23786 acceptor_pool.cc:254] collecting diagnostics on the listening RPC socket unix:/tmp/dist-test-taskhgjQna/test-tmp/rpc-test-cf03331de28c4f24be24dd74470143d5.sock every 8 connection(s)
I20260929 02:01:42.931607 23787 acceptor_pool.cc:254] collecting diagnostics on the listening RPC socket unix:/tmp/dist-test-taskhgjQna/test-tmp/rpc-test-cf03331de28c4f24be24dd74470143d5.sock every 8 connection(s)
I20260929 02:01:42.931766 23354 rpc-test.cc:1716] Connecting to unix:/tmp/dist-test-taskhgjQna/test-tmp/rpc-test-cf03331de28c4f24be24dd74470143d5.sock
I20260929 02:01:42.949201 23354 test_util.cc:268] Using random seed: -1872164529
I20260929 02:01:42.963263 23790 rpc-test-base.h:240] got call: sleep_micros: 500 pattern: 4294967295 num_repetitions: 2097152 sidecar_idx: 0
I20260929 02:01:42.974608 23790 rpc-test-base.h:240] got call: sleep_micros: 500 pattern: 4294967295 num_repetitions: 2097152 sidecar_idx: 0
I20260929 02:01:42.985162 23790 rpc-test-base.h:240] got call: sleep_micros: 500 pattern: 4294967295 num_repetitions: 2097152 sidecar_idx: 0
I20260929 02:01:42.995544 23790 rpc-test-base.h:240] got call: sleep_micros: 500 pattern: 4294967295 num_repetitions: 2097152 sidecar_idx: 0
I20260929 02:01:43.006150 23790 rpc-test-base.h:240] got call: sleep_micros: 500 pattern: 4294967295 num_repetitions: 2097152 sidecar_idx: 0
I20260929 02:01:43.016887 23790 rpc-test-base.h:240] got call: sleep_micros: 500 pattern: 4294967295 num_repetitions: 2097152 sidecar_idx: 0
I20260929 02:01:43.027475 23790 rpc-test-base.h:240] got call: sleep_micros: 500 pattern: 4294967295 num_repetitions: 2097152 sidecar_idx: 0
I20260929 02:01:43.037750 23790 rpc-test-base.h:240] got call: sleep_micros: 500 pattern: 4294967295 num_repetitions: 2097152 sidecar_idx: 0
W20260929 02:01:43.039372 23783 connection.cc:196] Error closing socket: Network error: TlsSocket::Close: Broken pipe
W20260929 02:01:43.040782 23783 connection.cc:441] server connection from unix:<unnamed> torn down before Call kudu.rpc.GenericCalculatorService.SleepWithSidecar from unix:<unnamed> (request call id 9) could send its response
[ OK ] Parameters/TestRpc.TestCancellationAsync/SSL_UnixSocket (123 ms)
[ RUN ] Parameters/TestRpc.TestPerformanceBySocketType/SSL_UnixSocket
I20260929 02:01:43.070473 23811 acceptor_pool.cc:254] collecting diagnostics on the listening RPC socket unix:/tmp/dist-test-taskhgjQna/test-tmp/rpc-test-ec15c6aad8154a9498c3a1c3c8841bf5.sock every 8 connection(s)
I20260929 02:01:43.070510 23812 acceptor_pool.cc:254] collecting diagnostics on the listening RPC socket unix:/tmp/dist-test-taskhgjQna/test-tmp/rpc-test-ec15c6aad8154a9498c3a1c3c8841bf5.sock every 8 connection(s)
I20260929 02:01:43.070638 23354 rpc-test.cc:1846] Connecting to unix:/tmp/dist-test-taskhgjQna/test-tmp/rpc-test-ec15c6aad8154a9498c3a1c3c8841bf5.sock
I20260929 02:01:44.369431 23354 rpc-test.cc:1859] Sending 1024MB via ssl-enabled unix socket: real 1.289s user 1.464s sys 0.814s
I20260929 02:01:45.648566 23354 rpc-test.cc:1859] Sending 1024MB via ssl-enabled unix socket: real 1.279s user 1.421s sys 0.848s
I20260929 02:01:46.946722 23354 rpc-test.cc:1859] Sending 1024MB via ssl-enabled unix socket: real 1.298s user 1.468s sys 0.833s
I20260929 02:01:48.224581 23354 rpc-test.cc:1859] Sending 1024MB via ssl-enabled unix socket: real 1.278s user 1.440s sys 0.822s
I20260929 02:01:49.481803 23354 rpc-test.cc:1859] Sending 1024MB via ssl-enabled unix socket: real 1.257s user 1.437s sys 0.803s
W20260929 02:01:49.482407 23808 connection.cc:196] Error closing socket: Network error: TlsSocket::Close: Broken pipe
[ OK ] Parameters/TestRpc.TestPerformanceBySocketType/SSL_UnixSocket (6441 ms)
[----------] 20 tests from Parameters/TestRpc (26208 ms total)
[----------] 1 test from Parameters/TestRpcSocketTxRxQueue
[ RUN ] Parameters/TestRpcSocketTxRxQueue.AcceptorRxQueueSizeMetric/0
I20260929 02:01:49.488632 23836 acceptor_pool.cc:254] collecting diagnostics on the listening RPC socket 0.0.0.0:41995 every 1 connection(s)
I20260929 02:01:49.488694 23837 acceptor_pool.cc:254] collecting diagnostics on the listening RPC socket 0.0.0.0:41995 every 1 connection(s)
W20260929 02:01:49.489215 23832 negotiation.cc:337] Failed RPC negotiation. Trace:
0929 02:01:49.489048 (+ 0us) reactor.cc:625] Submitting negotiation task for server connection from 127.0.0.1:39576 (local address 127.0.0.1:41995)
0929 02:01:49.489107 (+ 59us) server_negotiation.cc:206] Beginning negotiation
0929 02:01:49.489109 (+ 2us) server_negotiation.cc:399] Waiting for connection header
0929 02:01:49.489184 (+ 75us) negotiation.cc:327] Negotiation complete: Network error: Server connection negotiation failed: server connection from 127.0.0.1:39576: BlockingRecv error: recv got EOF from 127.0.0.1:39576 (error 108)
Metrics: {"server-negotiator.queue_time_us":29}
[ OK ] Parameters/TestRpcSocketTxRxQueue.AcceptorRxQueueSizeMetric/0 (7 ms)
[----------] 1 test from Parameters/TestRpcSocketTxRxQueue (7 ms total)
[----------] Global test environment tear-down
[==========] 21 tests from 2 test suites ran. (26216 ms total)
[ PASSED ] 20 tests.
[ FAILED ] 1 test, listed below:
[ FAILED ] Parameters/TestRpc.TestCallWithChainCertAndChainCA/SSL_UnixSocket, where GetParam() = (true, true)
1 FAILED TEST