Diagnosed failure

Parameters/TestRpc.TestCallWithChainCertAndChainCA/SSL_TCP: /data0/somelongdirectorytoavoidrpathissues/src/kudu/src/kudu/rpc/rpc-test.cc:270: Failure
Failed
Bad status: Runtime error: could not verify certificate chain (error with cert: subject=CN = localhost, ST = sadfjas, C = AS, emailAddress = sdflkdsajf, O = lskdfjlsad, OU = sldfkja, issuer=C = AS, ST = ASDfkjdhf, L = lskdjf, O = saldfja, OU = skdjf, CN = localhost, emailAddress = sadjflkadsj): : certificate has expired
Google Test trace:
/data0/somelongdirectorytoavoidrpathissues/src/kudu/src/kudu/rpc/rpc-test.cc:267: Connecting to 0.0.0.0:42779
I20260929 10:51:01.461859  3302 test_util.cc:175] -----------------------------------------------
I20260929 10:51:01.461906  3302 test_util.cc:176] Had fatal failures, leaving test files at /tmp/dist-test-task_afee5/test-tmp/rpc-test.5.Parameters_TestRpc.TestCallWithChainCertAndChainCA_SSL_TCP.1790679061373155-3302-0

Full log

Note: This is test shard 6 of 8.
[==========] Running 21 tests from 2 test suites.
[----------] Global test environment set-up.
[----------] 20 tests from Parameters/TestRpc
[ RUN      ] Parameters/TestRpc.TestMessengerCreateDestroy/SSL_TCP
WARNING: Logging before InitGoogleLogging() is written to STDERR
I20260929 10:51:01.416718  3302 rpc-test.cc:169] started messenger TestCreateDestroy
[       OK ] Parameters/TestRpc.TestMessengerCreateDestroy/SSL_TCP (42 ms)
[ RUN      ] Parameters/TestRpc.TestNegotiationDeadlock/SSL_TCP
I20260929 10:51:01.437121  3323 acceptor_pool.cc:254] collecting diagnostics on the listening RPC socket 0.0.0.0:40185 every 8 connection(s)
I20260929 10:51:01.437124  3322 acceptor_pool.cc:254] collecting diagnostics on the listening RPC socket 0.0.0.0:40185 every 8 connection(s)
[       OK ] Parameters/TestRpc.TestNegotiationDeadlock/SSL_TCP (26 ms)
[ RUN      ] Parameters/TestRpc.TestCallWithChainCertAndChainCA/SSL_TCP
I20260929 10:51:01.458014  3338 acceptor_pool.cc:254] collecting diagnostics on the listening RPC socket 0.0.0.0:42779 every 8 connection(s)
I20260929 10:51:01.458063  3339 acceptor_pool.cc:254] collecting diagnostics on the listening RPC socket 0.0.0.0:42779 every 8 connection(s)
/data0/somelongdirectorytoavoidrpathissues/src/kudu/src/kudu/rpc/rpc-test.cc:270: Failure
Failed
Bad status: Runtime error: could not verify certificate chain (error with cert: subject=CN = localhost, ST = sadfjas, C = AS, emailAddress = sdflkdsajf, O = lskdfjlsad, OU = sldfkja, issuer=C = AS, ST = ASDfkjdhf, L = lskdjf, O = saldfja, OU = skdjf, CN = localhost, emailAddress = sadjflkadsj): : certificate has expired
Google Test trace:
/data0/somelongdirectorytoavoidrpathissues/src/kudu/src/kudu/rpc/rpc-test.cc:267: Connecting to 0.0.0.0:42779
I20260929 10:51:01.461859  3302 test_util.cc:175] -----------------------------------------------
I20260929 10:51:01.461906  3302 test_util.cc:176] Had fatal failures, leaving test files at /tmp/dist-test-task_afee5/test-tmp/rpc-test.5.Parameters_TestRpc.TestCallWithChainCertAndChainCA_SSL_TCP.1790679061373155-3302-0
[  FAILED  ] Parameters/TestRpc.TestCallWithChainCertAndChainCA/SSL_TCP, where GetParam() = (true, false) (17 ms)
[ RUN      ] Parameters/TestRpc.TestCallWithPasswordProtectedKey/SSL_TCP
I20260929 10:51:01.481940  3363 acceptor_pool.cc:254] collecting diagnostics on the listening RPC socket 0.0.0.0:43569 every 8 connection(s)
I20260929 10:51:01.481971  3364 acceptor_pool.cc:254] collecting diagnostics on the listening RPC socket 0.0.0.0:43569 every 8 connection(s)
[       OK ] Parameters/TestRpc.TestCallWithPasswordProtectedKey/SSL_TCP (32 ms)
[ RUN      ] Parameters/TestRpc.TestCallToBadServer/SSL_TCP
I20260929 10:51:01.506625  3302 rpc-test.cc:394] Status: Network error: Client connection negotiation failed: client connection to 0.0.0.0:0: connect: Connection refused (error 111)
I20260929 10:51:01.506949  3302 rpc-test.cc:394] Status: Network error: Client connection negotiation failed: client connection to 0.0.0.0:0: connect: Connection refused (error 111)
I20260929 10:51:01.507200  3302 rpc-test.cc:394] Status: Network error: Client connection negotiation failed: client connection to 0.0.0.0:0: connect: Connection refused (error 111)
I20260929 10:51:01.507377  3302 rpc-test.cc:394] Status: Network error: Client connection negotiation failed: client connection to 0.0.0.0:0: connect: Connection refused (error 111)
I20260929 10:51:01.507542  3302 rpc-test.cc:394] Status: Network error: Client connection negotiation failed: client connection to 0.0.0.0:0: connect: Connection refused (error 111)
[       OK ] Parameters/TestRpc.TestCallToBadServer/SSL_TCP (13 ms)
[ RUN      ] Parameters/TestRpc.TestWrongService/SSL_TCP
I20260929 10:51:01.538514  3398 acceptor_pool.cc:254] collecting diagnostics on the listening RPC socket 0.0.0.0:45691 every 8 connection(s)
I20260929 10:51:01.538552  3399 acceptor_pool.cc:254] collecting diagnostics on the listening RPC socket 0.0.0.0:45691 every 8 connection(s)
I20260929 10:51:01.551719  3397 messenger.cc:345] service WrongServiceName not registered on TestServer
[       OK ] Parameters/TestRpc.TestWrongService/SSL_TCP (45 ms)
[ RUN      ] Parameters/TestRpc.TestConnectionKeepalive/SSL_TCP
I20260929 10:51:01.561890  3421 acceptor_pool.cc:254] collecting diagnostics on the listening RPC socket 0.0.0.0:41967 every 8 connection(s)
I20260929 10:51:01.561952  3422 acceptor_pool.cc:254] collecting diagnostics on the listening RPC socket 0.0.0.0:41967 every 8 connection(s)
I20260929 10:51:01.562096  3302 rpc-test.cc:488] Connecting to 0.0.0.0:41967
[       OK ] Parameters/TestRpc.TestConnectionKeepalive/SSL_TCP (1032 ms)
[ RUN      ] Parameters/TestRpc.TestClientConnectionMetrics/SSL_TCP
I20260929 10:51:02.604820  3446 acceptor_pool.cc:254] collecting diagnostics on the listening RPC socket 0.0.0.0:44539 every 8 connection(s)
I20260929 10:51:02.604887  3447 acceptor_pool.cc:254] collecting diagnostics on the listening RPC socket 0.0.0.0:44539 every 8 connection(s)
I20260929 10:51:02.605122  3302 rpc-test.cc:569] Connecting to 0.0.0.0:44539
[       OK ] Parameters/TestRpc.TestClientConnectionMetrics/SSL_TCP (9220 ms)
[ RUN      ] Parameters/TestRpc.TestCredentialsPolicy/SSL_TCP
I20260929 10:51:11.816212  3469 acceptor_pool.cc:254] collecting diagnostics on the listening RPC socket 0.0.0.0:35097 every 8 connection(s)
I20260929 10:51:11.816342  3470 acceptor_pool.cc:254] collecting diagnostics on the listening RPC socket 0.0.0.0:35097 every 8 connection(s)
I20260929 10:51:11.816517  3302 rpc-test.cc:700] Connecting to 0.0.0.0:35097
[       OK ] Parameters/TestRpc.TestCredentialsPolicy/SSL_TCP (52 ms)
[ RUN      ] Parameters/TestRpc.TestCallLongerThanKeepalive/SSL_TCP
I20260929 10:51:11.873507  3494 acceptor_pool.cc:254] collecting diagnostics on the listening RPC socket 0.0.0.0:41551 every 8 connection(s)
I20260929 10:51:11.873546  3495 acceptor_pool.cc:254] collecting diagnostics on the listening RPC socket 0.0.0.0:41551 every 8 connection(s)
I20260929 10:51:11.882020  3498 rpc-test-base.h:222] got call: sleep_micros: 3000000 deferred: true
I20260929 10:51:14.882741  3498 rpcz_store.cc:275] Call kudu.rpc.GenericCalculatorService.Sleep from 127.0.0.1:56150 (request call id 0) took 3000 ms. Trace:
I20260929 10:51:14.882882  3498 rpcz_store.cc:276] 0929 10:51:11.881972 (+     0us) service_pool.cc:170] Inserting onto call queue
0929 10:51:11.882007 (+    35us) service_pool.cc:227] Handling call
0929 10:51:14.882725 (+3000718us) inbound_call.cc:173] Queueing success response
Metrics: {}
[       OK ] Parameters/TestRpc.TestCallLongerThanKeepalive/SSL_TCP (3026 ms)
[ RUN      ] Parameters/TestRpc.TestRpcSidecar/SSL_TCP
I20260929 10:51:14.925128  3519 acceptor_pool.cc:254] collecting diagnostics on the listening RPC socket 0.0.0.0:39543 every 8 connection(s)
I20260929 10:51:14.925181  3520 acceptor_pool.cc:254] collecting diagnostics on the listening RPC socket 0.0.0.0:39543 every 8 connection(s)
[       OK ] Parameters/TestRpc.TestRpcSidecar/SSL_TCP (79 ms)
[ RUN      ] Parameters/TestRpc.TestRpcSidecarLimits/SSL_TCP
I20260929 10:51:17.087708  3544 acceptor_pool.cc:254] collecting diagnostics on the listening RPC socket 0.0.0.0:40293 every 8 connection(s)
I20260929 10:51:17.087805  3545 acceptor_pool.cc:254] collecting diagnostics on the listening RPC socket 0.0.0.0:40293 every 8 connection(s)
W20260929 10:51:17.115803  3302 serialization.cc:72] Serialized kudu.rpc_test.PushStringsRequestPB (2147483654 bytes) is larger than the maximum configured RPC message size (52428800 bytes). Sending anyway, but peer may reject the data.
W20260929 10:51:17.118945  3541 connection.cc:535] server connection from 127.0.0.1:44546 recv error: Network error: RPC frame had a length of 2147483714, but we only support messages up to 52428800 bytes long.
W20260929 10:51:17.119012  3541 connection.cc:158] shutting down server connection from 127.0.0.1:44546 with pending inbound data: 4/2147483714 bytes received; last active 0 ns ago: status Network error: RPC frame had a length of 2147483714, but we only support messages up to 52428800 bytes long.
W20260929 10:51:17.119226  3557 connection.cc:196] Error closing socket: Network error: TlsSocket::Close: Connection reset by peer
I20260929 10:51:17.125219  3569 acceptor_pool.cc:254] collecting diagnostics on the listening RPC socket 0.0.0.0:42199 every 8 connection(s)
I20260929 10:51:17.125267  3570 acceptor_pool.cc:254] collecting diagnostics on the listening RPC socket 0.0.0.0:42199 every 8 connection(s)
W20260929 10:51:21.631640  3567 connection.cc:577] server connection from 127.0.0.1:54924: received bad data: 'Corruption: Invalid packet: message had a length of 2147483710, but we only support messages up to 2147483647 bytes
'
[       OK ] Parameters/TestRpc.TestRpcSidecarLimits/SSL_TCP (6672 ms)
[ RUN      ] Parameters/TestRpc.TestCallTimeoutDoesntAffectNegotiation/SSL_TCP
I20260929 10:51:21.650945  3594 acceptor_pool.cc:254] collecting diagnostics on the listening RPC socket 0.0.0.0:41267 every 8 connection(s)
I20260929 10:51:21.651001  3595 acceptor_pool.cc:254] collecting diagnostics on the listening RPC socket 0.0.0.0:41267 every 8 connection(s)
W20260929 10:51:21.688182  3590 negotiation.cc:266] Injecting 500ms delay in negotiation
I20260929 10:51:21.738549  3302 rpc-test-base.h:595] status: Timed out: connection negotiation to 0.0.0.0:41267 for RPC Sleep timed out after 0.050s (ON_OUTBOUND_QUEUE), seconds elapsed: 0.0507285
[       OK ] Parameters/TestRpc.TestCallTimeoutDoesntAffectNegotiation/SSL_TCP (556 ms)
[ RUN      ] Parameters/TestRpc.TestRpcHandlerLatencyMetric/SSL_TCP
I20260929 10:51:22.216524  3619 acceptor_pool.cc:254] collecting diagnostics on the listening RPC socket 0.0.0.0:44037 every 8 connection(s)
I20260929 10:51:22.216557  3620 acceptor_pool.cc:254] collecting diagnostics on the listening RPC socket 0.0.0.0:44037 every 8 connection(s)
I20260929 10:51:22.244874  3302 rpc-test.cc:1236] Sleep() min lat: 20238
I20260929 10:51:22.244943  3302 rpc-test.cc:1237] Sleep() mean lat: 20238
I20260929 10:51:22.244967  3302 rpc-test.cc:1238] Sleep() max lat: 20238
I20260929 10:51:22.244980  3302 rpc-test.cc:1239] Sleep() #calls: 1
[       OK ] Parameters/TestRpc.TestRpcHandlerLatencyMetric/SSL_TCP (52 ms)
[ RUN      ] Parameters/TestRpc.TimedOutOnResponseMetricServiceQueue/SSL_TCP
I20260929 10:51:22.253034  3645 acceptor_pool.cc:254] collecting diagnostics on the listening RPC socket 0.0.0.0:39563 every 8 connection(s)
I20260929 10:51:22.253080  3646 acceptor_pool.cc:254] collecting diagnostics on the listening RPC socket 0.0.0.0:39563 every 8 connection(s)
W20260929 10:51:22.307343  3647 rpcz_store.cc:267] Call kudu.rpc_test.CalculatorService.Sleep from 127.0.0.1:36354 (request call id 2) took 20 ms (client timeout 20 ms). Trace:
W20260929 10:51:22.307473  3647 rpcz_store.cc:269] 0929 10:51:22.287054 (+     0us) service_pool.cc:170] Inserting onto call queue
0929 10:51:22.307305 (+ 20251us) service_pool.cc:214] Skipping call since client already timed out
0929 10:51:22.307313 (+     8us) inbound_call.cc:173] Queueing failure response
Metrics: {}
[       OK ] Parameters/TestRpc.TimedOutOnResponseMetricServiceQueue/SSL_TCP (62 ms)
[ RUN      ] Parameters/TestRpc.RpcPendingConnectionsMetric/SSL_TCP
I20260929 10:51:22.310668  3668 acceptor_pool.cc:254] collecting diagnostics on the listening RPC socket 0.0.0.0:36101 every 8 connection(s)
I20260929 10:51:22.310745  3669 acceptor_pool.cc:254] collecting diagnostics on the listening RPC socket 0.0.0.0:36101 every 8 connection(s)
W20260929 10:51:22.311299  3664 negotiation.cc:337] Failed RPC negotiation. Trace:
0929 10:51:22.311141 (+     0us) reactor.cc:625] Submitting negotiation task for server connection from 127.0.0.1:58324 (local address 127.0.0.1:36101)
0929 10:51:22.311181 (+    40us) server_negotiation.cc:206] Beginning negotiation
0929 10:51:22.311183 (+     2us) server_negotiation.cc:399] Waiting for connection header
0929 10:51:22.311251 (+    68us) negotiation.cc:327] Negotiation complete: Network error: Server connection negotiation failed: server connection from 127.0.0.1:58324: BlockingRecv error: recv got EOF from 127.0.0.1:58324 (error 108)
Metrics: {"server-negotiator.queue_time_us":14}
[       OK ] Parameters/TestRpc.RpcPendingConnectionsMetric/SSL_TCP (12 ms)
[ RUN      ] Parameters/TestRpc.TestRpcContextClientDeadline/SSL_TCP
I20260929 10:51:22.331633  3685 acceptor_pool.cc:254] collecting diagnostics on the listening RPC socket 0.0.0.0:44199 every 8 connection(s)
I20260929 10:51:22.331640  3684 acceptor_pool.cc:254] collecting diagnostics on the listening RPC socket 0.0.0.0:44199 every 8 connection(s)
[       OK ] Parameters/TestRpc.TestRpcContextClientDeadline/SSL_TCP (42 ms)
[ RUN      ] Parameters/TestRpc.TestApplicationFeatureFlagUnsupportedServer/SSL_TCP
I20260929 10:51:22.383654  3709 acceptor_pool.cc:254] collecting diagnostics on the listening RPC socket 0.0.0.0:34779 every 8 connection(s)
I20260929 10:51:22.383713  3710 acceptor_pool.cc:254] collecting diagnostics on the listening RPC socket 0.0.0.0:34779 every 8 connection(s)
[       OK ] Parameters/TestRpc.TestApplicationFeatureFlagUnsupportedServer/SSL_TCP (47 ms)
[ RUN      ] Parameters/TestRpc.TestCancellationAsync/SSL_TCP
I20260929 10:51:22.422758  3734 acceptor_pool.cc:254] collecting diagnostics on the listening RPC socket 0.0.0.0:35193 every 8 connection(s)
I20260929 10:51:22.422922  3735 acceptor_pool.cc:254] collecting diagnostics on the listening RPC socket 0.0.0.0:35193 every 8 connection(s)
I20260929 10:51:22.423126  3302 rpc-test.cc:1716] Connecting to 0.0.0.0:35193
I20260929 10:51:22.439054  3302 test_util.cc:268] Using random seed: -157445747
I20260929 10:51:22.457667  3738 rpc-test-base.h:240] got call: sleep_micros: 500 pattern: 4294967295 num_repetitions: 2097152 sidecar_idx: 0
I20260929 10:51:22.472407  3738 rpc-test-base.h:240] got call: sleep_micros: 500 pattern: 4294967295 num_repetitions: 2097152 sidecar_idx: 0
I20260929 10:51:22.489358  3738 rpc-test-base.h:240] got call: sleep_micros: 500 pattern: 4294967295 num_repetitions: 2097152 sidecar_idx: 0
I20260929 10:51:22.506258  3738 rpc-test-base.h:240] got call: sleep_micros: 500 pattern: 4294967295 num_repetitions: 2097152 sidecar_idx: 0
I20260929 10:51:22.522264  3738 rpc-test-base.h:240] got call: sleep_micros: 500 pattern: 4294967295 num_repetitions: 2097152 sidecar_idx: 0
I20260929 10:51:22.538775  3738 rpc-test-base.h:240] got call: sleep_micros: 500 pattern: 4294967295 num_repetitions: 2097152 sidecar_idx: 0
I20260929 10:51:22.555737  3738 rpc-test-base.h:240] got call: sleep_micros: 500 pattern: 4294967295 num_repetitions: 2097152 sidecar_idx: 0
I20260929 10:51:22.572090  3738 rpc-test-base.h:240] got call: sleep_micros: 500 pattern: 4294967295 num_repetitions: 2097152 sidecar_idx: 0
W20260929 10:51:22.575188  3733 connection.cc:441] server connection from 127.0.0.1:36802 torn down before Call kudu.rpc.GenericCalculatorService.SleepWithSidecar from 127.0.0.1:36802 (request call id 9) could send its response
[       OK ] Parameters/TestRpc.TestCancellationAsync/SSL_TCP (164 ms)
[ RUN      ] Parameters/TestRpc.TestPerformanceBySocketType/SSL_TCP
I20260929 10:51:22.594055  3759 acceptor_pool.cc:254] collecting diagnostics on the listening RPC socket 0.0.0.0:40081 every 8 connection(s)
I20260929 10:51:22.594115  3760 acceptor_pool.cc:254] collecting diagnostics on the listening RPC socket 0.0.0.0:40081 every 8 connection(s)
I20260929 10:51:22.594256  3302 rpc-test.cc:1846] Connecting to 0.0.0.0:40081
I20260929 10:51:24.114013  3302 rpc-test.cc:1859] Sending 1024MB via ssl-enabled tcp socket: real 1.505s	user 1.290s	sys 1.419s
I20260929 10:51:25.708318  3302 rpc-test.cc:1859] Sending 1024MB via ssl-enabled tcp socket: real 1.594s	user 1.311s	sys 1.534s
I20260929 10:51:27.266335  3302 rpc-test.cc:1859] Sending 1024MB via ssl-enabled tcp socket: real 1.558s	user 1.367s	sys 1.443s
I20260929 10:51:28.886441  3302 rpc-test.cc:1859] Sending 1024MB via ssl-enabled tcp socket: real 1.620s	user 1.388s	sys 1.488s
I20260929 10:51:30.478421  3302 rpc-test.cc:1859] Sending 1024MB via ssl-enabled tcp socket: real 1.592s	user 1.298s	sys 1.533s
[       OK ] Parameters/TestRpc.TestPerformanceBySocketType/SSL_TCP (7903 ms)
[----------] 20 tests from Parameters/TestRpc (29104 ms total)

[----------] 1 test from Parameters/TestRpcSocketTxRxQueue
[ RUN      ] Parameters/TestRpcSocketTxRxQueue.OverCapacity/0
W20260929 10:51:30.745415  3821 negotiation.cc:337] Failed RPC negotiation. Trace:
0929 10:51:30.485869 (+     0us) reactor.cc:625] Submitting negotiation task for client connection to 0.0.0.0:38731 (local address 127.0.0.1:34308)
0929 10:51:30.485924 (+    55us) negotiation.cc:107] Waiting for socket to connect
0929 10:51:30.485933 (+     9us) client_negotiation.cc:174] Beginning negotiation
0929 10:51:30.485974 (+    41us) client_negotiation.cc:252] Sending NEGOTIATE NegotiatePB request
0929 10:51:30.745317 (+259343us) negotiation.cc:327] Negotiation complete: Network error: Client connection negotiation failed: client connection to 0.0.0.0:38731: BlockingRecv error: recv error from unknown peer: Transport endpoint is not connected (error 107)
Metrics: {"client-negotiator.queue_time_us":33}
W20260929 10:51:30.745609  3812 negotiation.cc:337] Failed RPC negotiation. Trace:
0929 10:51:30.484959 (+     0us) reactor.cc:625] Submitting negotiation task for client connection to 0.0.0.0:38731 (local address 127.0.0.1:34300)
0929 10:51:30.485010 (+    51us) negotiation.cc:107] Waiting for socket to connect
0929 10:51:30.485020 (+    10us) client_negotiation.cc:174] Beginning negotiation
0929 10:51:30.485066 (+    46us) client_negotiation.cc:252] Sending NEGOTIATE NegotiatePB request
0929 10:51:30.745432 (+260366us) negotiation.cc:327] Negotiation complete: Network error: Client connection negotiation failed: client connection to 0.0.0.0:38731: BlockingRecv error: recv error from unknown peer: Transport endpoint is not connected (error 107)
Metrics: {"client-negotiator.queue_time_us":29}
W20260929 10:51:30.745790  3785 negotiation.cc:337] Failed RPC negotiation. Trace:
0929 10:51:30.482551 (+     0us) reactor.cc:625] Submitting negotiation task for client connection to 0.0.0.0:38731 (local address 127.0.0.1:34274)
0929 10:51:30.482588 (+    37us) negotiation.cc:107] Waiting for socket to connect
0929 10:51:30.482596 (+     8us) client_negotiation.cc:174] Beginning negotiation
0929 10:51:30.482636 (+    40us) client_negotiation.cc:252] Sending NEGOTIATE NegotiatePB request
0929 10:51:30.745370 (+262734us) negotiation.cc:327] Negotiation complete: Network error: Client connection negotiation failed: client connection to 0.0.0.0:38731: BlockingRecv error: recv error from unknown peer: Transport endpoint is not connected (error 107)
Metrics: {"client-negotiator.queue_time_us":16}
W20260929 10:51:30.745910  3803 negotiation.cc:337] Failed RPC negotiation. Trace:
0929 10:51:30.484168 (+     0us) reactor.cc:625] Submitting negotiation task for client connection to 0.0.0.0:38731 (local address 127.0.0.1:34292)
0929 10:51:30.484199 (+    31us) negotiation.cc:107] Waiting for socket to connect
0929 10:51:30.484207 (+     8us) client_negotiation.cc:174] Beginning negotiation
0929 10:51:30.484243 (+    36us) client_negotiation.cc:252] Sending NEGOTIATE NegotiatePB request
0929 10:51:30.745454 (+261211us) negotiation.cc:327] Negotiation complete: Network error: Client connection negotiation failed: client connection to 0.0.0.0:38731: BlockingRecv error: recv error from unknown peer: Transport endpoint is not connected (error 107)
Metrics: {"client-negotiator.queue_time_us":16}
W20260929 10:51:30.745415  3776 negotiation.cc:337] Failed RPC negotiation. Trace:
0929 10:51:30.481640 (+     0us) reactor.cc:625] Submitting negotiation task for client connection to 0.0.0.0:38731 (local address 127.0.0.1:34272)
0929 10:51:30.481699 (+    59us) negotiation.cc:107] Waiting for socket to connect
0929 10:51:30.481709 (+    10us) client_negotiation.cc:174] Beginning negotiation
0929 10:51:30.481781 (+    72us) client_negotiation.cc:252] Sending NEGOTIATE NegotiatePB request
0929 10:51:30.745259 (+263478us) negotiation.cc:327] Negotiation complete: Network error: Client connection negotiation failed: client connection to 0.0.0.0:38731: BlockingRecv error: recv error from unknown peer: Transport endpoint is not connected (error 107)
Metrics: {"client-negotiator.queue_time_us":33}
W20260929 10:51:30.746112  3794 negotiation.cc:337] Failed RPC negotiation. Trace:
0929 10:51:30.483323 (+     0us) reactor.cc:625] Submitting negotiation task for client connection to 0.0.0.0:38731 (local address 127.0.0.1:34278)
0929 10:51:30.483354 (+    31us) negotiation.cc:107] Waiting for socket to connect
0929 10:51:30.483361 (+     7us) client_negotiation.cc:174] Beginning negotiation
0929 10:51:30.483393 (+    32us) client_negotiation.cc:252] Sending NEGOTIATE NegotiatePB request
0929 10:51:30.745370 (+261977us) negotiation.cc:327] Negotiation complete: Network error: Client connection negotiation failed: client connection to 0.0.0.0:38731: BlockingRecv error: recv error from unknown peer: Transport endpoint is not connected (error 107)
Metrics: {"client-negotiator.queue_time_us":15}
[       OK ] Parameters/TestRpcSocketTxRxQueue.OverCapacity/0 (1036 ms)
[----------] 1 test from Parameters/TestRpcSocketTxRxQueue (1036 ms total)

[----------] Global test environment tear-down
[==========] 21 tests from 2 test suites ran. (30141 ms total)
[  PASSED  ] 20 tests.
[  FAILED  ] 1 test, listed below:
[  FAILED  ] Parameters/TestRpc.TestCallWithChainCertAndChainCA/SSL_TCP, where GetParam() = (true, false)

 1 FAILED TEST