Diagnosed failure

Parameters/TestRpc.TestCallWithChainCertAndChainCA/SSL_UnixSocket: /data0/somelongdirectorytoavoidrpathissues/src/kudu/src/kudu/rpc/rpc-test.cc:270: Failure
Failed
Bad status: Runtime error: could not verify certificate chain (error with cert: subject=CN = localhost, ST = sadfjas, C = AS, emailAddress = sdflkdsajf, O = lskdfjlsad, OU = sldfkja, issuer=C = AS, ST = ASDfkjdhf, L = lskdjf, O = saldfja, OU = skdjf, CN = localhost, emailAddress = sadjflkadsj): : certificate has expired
Google Test trace:
/data0/somelongdirectorytoavoidrpathissues/src/kudu/src/kudu/rpc/rpc-test.cc:267: Connecting to unix:/tmp/dist-test-taskgX2zkr/test-tmp/rpc-test-e322e5b69870481f8423aab1507b9fe1.sock
I20260924 10:35:30.977978 12762 test_util.cc:175] -----------------------------------------------
I20260924 10:35:30.978044 12762 test_util.cc:176] Had fatal failures, leaving test files at /tmp/dist-test-taskgX2zkr/test-tmp/rpc-test.6.Parameters_TestRpc.TestCallWithChainCertAndChainCA_SSL_UnixSocket.1790246130919060-12762-0

Full log

Note: This is test shard 7 of 8.
[==========] Running 21 tests from 2 test suites.
[----------] Global test environment set-up.
[----------] 20 tests from Parameters/TestRpc
[ RUN      ] Parameters/TestRpc.TestMessengerCreateDestroy/SSL_UnixSocket
WARNING: Logging before InitGoogleLogging() is written to STDERR
I20260924 10:35:30.942875 12762 rpc-test.cc:169] started messenger TestCreateDestroy
[       OK ] Parameters/TestRpc.TestMessengerCreateDestroy/SSL_UnixSocket (18 ms)
[ RUN      ] Parameters/TestRpc.TestNegotiationDeadlock/SSL_UnixSocket
I20260924 10:35:30.954138 12782 acceptor_pool.cc:254] collecting diagnostics on the listening RPC socket unix:/tmp/dist-test-taskgX2zkr/test-tmp/rpc-test-46271e09c2be47f1ab3b8a1c2aabcf24.sock every 8 connection(s)
I20260924 10:35:30.954169 12783 acceptor_pool.cc:254] collecting diagnostics on the listening RPC socket unix:/tmp/dist-test-taskgX2zkr/test-tmp/rpc-test-46271e09c2be47f1ab3b8a1c2aabcf24.sock every 8 connection(s)
[       OK ] Parameters/TestRpc.TestNegotiationDeadlock/SSL_UnixSocket (18 ms)
[ RUN      ] Parameters/TestRpc.TestCallWithChainCertAndChainCA/SSL_UnixSocket
I20260924 10:35:30.973526 12799 acceptor_pool.cc:254] collecting diagnostics on the listening RPC socket unix:/tmp/dist-test-taskgX2zkr/test-tmp/rpc-test-e322e5b69870481f8423aab1507b9fe1.sock every 8 connection(s)
I20260924 10:35:30.973543 12798 acceptor_pool.cc:254] collecting diagnostics on the listening RPC socket unix:/tmp/dist-test-taskgX2zkr/test-tmp/rpc-test-e322e5b69870481f8423aab1507b9fe1.sock every 8 connection(s)
/data0/somelongdirectorytoavoidrpathissues/src/kudu/src/kudu/rpc/rpc-test.cc:270: Failure
Failed
Bad status: Runtime error: could not verify certificate chain (error with cert: subject=CN = localhost, ST = sadfjas, C = AS, emailAddress = sdflkdsajf, O = lskdfjlsad, OU = sldfkja, issuer=C = AS, ST = ASDfkjdhf, L = lskdjf, O = saldfja, OU = skdjf, CN = localhost, emailAddress = sadjflkadsj): : certificate has expired
Google Test trace:
/data0/somelongdirectorytoavoidrpathissues/src/kudu/src/kudu/rpc/rpc-test.cc:267: Connecting to unix:/tmp/dist-test-taskgX2zkr/test-tmp/rpc-test-e322e5b69870481f8423aab1507b9fe1.sock
I20260924 10:35:30.977978 12762 test_util.cc:175] -----------------------------------------------
I20260924 10:35:30.978044 12762 test_util.cc:176] Had fatal failures, leaving test files at /tmp/dist-test-taskgX2zkr/test-tmp/rpc-test.6.Parameters_TestRpc.TestCallWithChainCertAndChainCA_SSL_UnixSocket.1790246130919060-12762-0
[  FAILED  ] Parameters/TestRpc.TestCallWithChainCertAndChainCA/SSL_UnixSocket, where GetParam() = (true, true) (15 ms)
[ RUN      ] Parameters/TestRpc.TestCallWithPasswordProtectedKey/SSL_UnixSocket
I20260924 10:35:31.000480 12823 acceptor_pool.cc:254] collecting diagnostics on the listening RPC socket unix:/tmp/dist-test-taskgX2zkr/test-tmp/rpc-test-b6071091c54549ae9a1be8b6280fc022.sock every 8 connection(s)
I20260924 10:35:31.000530 12824 acceptor_pool.cc:254] collecting diagnostics on the listening RPC socket unix:/tmp/dist-test-taskgX2zkr/test-tmp/rpc-test-b6071091c54549ae9a1be8b6280fc022.sock every 8 connection(s)
W20260924 10:35:31.011991 12820 connection.cc:196] Error closing socket: Network error: TlsSocket::Close: Broken pipe
[       OK ] Parameters/TestRpc.TestCallWithPasswordProtectedKey/SSL_UnixSocket (34 ms)
[ RUN      ] Parameters/TestRpc.TestCallToBadServer/SSL_UnixSocket
I20260924 10:35:31.019557 12762 rpc-test.cc:394] Status: Network error: Client connection negotiation failed: client connection to 0.0.0.0:0: connect: Connection refused (error 111)
I20260924 10:35:31.019860 12762 rpc-test.cc:394] Status: Network error: Client connection negotiation failed: client connection to 0.0.0.0:0: connect: Connection refused (error 111)
I20260924 10:35:31.020193 12762 rpc-test.cc:394] Status: Network error: Client connection negotiation failed: client connection to 0.0.0.0:0: connect: Connection refused (error 111)
I20260924 10:35:31.020598 12762 rpc-test.cc:394] Status: Network error: Client connection negotiation failed: client connection to 0.0.0.0:0: connect: Connection refused (error 111)
I20260924 10:35:31.020947 12762 rpc-test.cc:394] Status: Network error: Client connection negotiation failed: client connection to 0.0.0.0:0: connect: Connection refused (error 111)
[       OK ] Parameters/TestRpc.TestCallToBadServer/SSL_UnixSocket (8 ms)
[ RUN      ] Parameters/TestRpc.TestWrongService/SSL_UnixSocket
I20260924 10:35:31.029181 12858 acceptor_pool.cc:254] collecting diagnostics on the listening RPC socket unix:/tmp/dist-test-taskgX2zkr/test-tmp/rpc-test-7e790379ea14441bb31df403c44307ff.sock every 8 connection(s)
I20260924 10:35:31.029237 12859 acceptor_pool.cc:254] collecting diagnostics on the listening RPC socket unix:/tmp/dist-test-taskgX2zkr/test-tmp/rpc-test-7e790379ea14441bb31df403c44307ff.sock every 8 connection(s)
I20260924 10:35:31.049201 12855 messenger.cc:345] service WrongServiceName not registered on TestServer
[       OK ] Parameters/TestRpc.TestWrongService/SSL_UnixSocket (29 ms)
[ RUN      ] Parameters/TestRpc.TestConnectionKeepalive/SSL_UnixSocket
I20260924 10:35:31.059319 12881 acceptor_pool.cc:254] collecting diagnostics on the listening RPC socket unix:/tmp/dist-test-taskgX2zkr/test-tmp/rpc-test-b4add82a06ca41adb2513bb89479e63e.sock every 8 connection(s)
I20260924 10:35:31.059363 12882 acceptor_pool.cc:254] collecting diagnostics on the listening RPC socket unix:/tmp/dist-test-taskgX2zkr/test-tmp/rpc-test-b4add82a06ca41adb2513bb89479e63e.sock every 8 connection(s)
I20260924 10:35:31.059597 12762 rpc-test.cc:488] Connecting to unix:/tmp/dist-test-taskgX2zkr/test-tmp/rpc-test-b4add82a06ca41adb2513bb89479e63e.sock
W20260924 10:35:31.552621 12894 connection.cc:196] Error closing socket: Network error: TlsSocket::Close: Broken pipe
[       OK ] Parameters/TestRpc.TestConnectionKeepalive/SSL_UnixSocket (1034 ms)
[ RUN      ] Parameters/TestRpc.TestClientConnectionMetrics/SSL_UnixSocket
I20260924 10:35:32.095647 12906 acceptor_pool.cc:254] collecting diagnostics on the listening RPC socket unix:/tmp/dist-test-taskgX2zkr/test-tmp/rpc-test-b36b0ba655be48e6bb02ad902c974f2b.sock every 8 connection(s)
I20260924 10:35:32.095752 12907 acceptor_pool.cc:254] collecting diagnostics on the listening RPC socket unix:/tmp/dist-test-taskgX2zkr/test-tmp/rpc-test-b36b0ba655be48e6bb02ad902c974f2b.sock every 8 connection(s)
I20260924 10:35:32.095992 12762 rpc-test.cc:569] Connecting to unix:/tmp/dist-test-taskgX2zkr/test-tmp/rpc-test-b36b0ba655be48e6bb02ad902c974f2b.sock
W20260924 10:35:41.816927 12903 connection.cc:196] Error closing socket: Network error: TlsSocket::Close: Broken pipe
[       OK ] Parameters/TestRpc.TestClientConnectionMetrics/SSL_UnixSocket (9732 ms)
[ RUN      ] Parameters/TestRpc.TestCredentialsPolicy/SSL_UnixSocket
I20260924 10:35:41.830576 12929 acceptor_pool.cc:254] collecting diagnostics on the listening RPC socket unix:/tmp/dist-test-taskgX2zkr/test-tmp/rpc-test-529f4529558041dcbda4c6da29342c29.sock every 8 connection(s)
I20260924 10:35:41.830618 12930 acceptor_pool.cc:254] collecting diagnostics on the listening RPC socket unix:/tmp/dist-test-taskgX2zkr/test-tmp/rpc-test-529f4529558041dcbda4c6da29342c29.sock every 8 connection(s)
I20260924 10:35:41.830906 12762 rpc-test.cc:700] Connecting to unix:/tmp/dist-test-taskgX2zkr/test-tmp/rpc-test-529f4529558041dcbda4c6da29342c29.sock
W20260924 10:35:41.856084 12928 connection.cc:196] Error closing socket: Network error: TlsSocket::Close: Broken pipe
[       OK ] Parameters/TestRpc.TestCredentialsPolicy/SSL_UnixSocket (43 ms)
[ RUN      ] Parameters/TestRpc.TestCallLongerThanKeepalive/SSL_UnixSocket
I20260924 10:35:41.887326 12954 acceptor_pool.cc:254] collecting diagnostics on the listening RPC socket unix:/tmp/dist-test-taskgX2zkr/test-tmp/rpc-test-d75241daa7dd48b58362dd42bad575f0.sock every 8 connection(s)
I20260924 10:35:41.887383 12955 acceptor_pool.cc:254] collecting diagnostics on the listening RPC socket unix:/tmp/dist-test-taskgX2zkr/test-tmp/rpc-test-d75241daa7dd48b58362dd42bad575f0.sock every 8 connection(s)
I20260924 10:35:41.907589 12958 rpc-test-base.h:222] got call: sleep_micros: 3000000 deferred: true
I20260924 10:35:44.908427 12958 rpcz_store.cc:275] Call kudu.rpc.GenericCalculatorService.Sleep from unix:<unnamed> (request call id 0) took 3000 ms. Trace:
I20260924 10:35:44.908571 12958 rpcz_store.cc:276] 0924 10:35:41.907531 (+     0us) service_pool.cc:170] Inserting onto call queue
0924 10:35:41.907576 (+    45us) service_pool.cc:227] Handling call
0924 10:35:44.908409 (+3000833us) inbound_call.cc:173] Queueing success response
Metrics: {}
W20260924 10:35:44.910171 12951 connection.cc:196] Error closing socket: Network error: TlsSocket::Close: Broken pipe
[       OK ] Parameters/TestRpc.TestCallLongerThanKeepalive/SSL_UnixSocket (3049 ms)
[ RUN      ] Parameters/TestRpc.TestRpcSidecar/SSL_UnixSocket
I20260924 10:35:44.927171 12979 acceptor_pool.cc:254] collecting diagnostics on the listening RPC socket unix:/tmp/dist-test-taskgX2zkr/test-tmp/rpc-test-bebdd254e92f4638b0cc8bc14bc89825.sock every 8 connection(s)
I20260924 10:35:44.927227 12980 acceptor_pool.cc:254] collecting diagnostics on the listening RPC socket unix:/tmp/dist-test-taskgX2zkr/test-tmp/rpc-test-bebdd254e92f4638b0cc8bc14bc89825.sock every 8 connection(s)
W20260924 10:35:44.979702 12976 connection.cc:196] Error closing socket: Network error: TlsSocket::Close: Broken pipe
[       OK ] Parameters/TestRpc.TestRpcSidecar/SSL_UnixSocket (69 ms)
[ RUN      ] Parameters/TestRpc.TestRpcSidecarLimits/SSL_UnixSocket
I20260924 10:35:46.438879 13004 acceptor_pool.cc:254] collecting diagnostics on the listening RPC socket unix:/tmp/dist-test-taskgX2zkr/test-tmp/rpc-test-7e655934ced24d0a9c9b46085030ed3e.sock every 8 connection(s)
I20260924 10:35:46.438931 13005 acceptor_pool.cc:254] collecting diagnostics on the listening RPC socket unix:/tmp/dist-test-taskgX2zkr/test-tmp/rpc-test-7e655934ced24d0a9c9b46085030ed3e.sock every 8 connection(s)
W20260924 10:35:46.450224 12762 serialization.cc:72] Serialized kudu.rpc_test.PushStringsRequestPB (2147483654 bytes) is larger than the maximum configured RPC message size (52428800 bytes). Sending anyway, but peer may reject the data.
W20260924 10:35:46.453979 13001 connection.cc:535] server connection from unix:<unnamed> recv error: Network error: RPC frame had a length of 2147483714, but we only support messages up to 52428800 bytes long.
W20260924 10:35:46.454044 13001 connection.cc:158] shutting down server connection from unix:<unnamed> with pending inbound data: 4/2147483714 bytes received; last active 0 ns ago: status Network error: RPC frame had a length of 2147483714, but we only support messages up to 52428800 bytes long.
W20260924 10:35:46.454332 13017 connection.cc:196] Error closing socket: Network error: TlsSocket::Close: Broken pipe
I20260924 10:35:46.458768 13029 acceptor_pool.cc:254] collecting diagnostics on the listening RPC socket unix:/tmp/dist-test-taskgX2zkr/test-tmp/rpc-test-7e655934ced24d0a9c9b46085030ed3e.sock every 8 connection(s)
I20260924 10:35:46.458849 13030 acceptor_pool.cc:254] collecting diagnostics on the listening RPC socket unix:/tmp/dist-test-taskgX2zkr/test-tmp/rpc-test-7e655934ced24d0a9c9b46085030ed3e.sock every 8 connection(s)
W20260924 10:35:50.775916 13026 connection.cc:577] server connection from unix:<unnamed>: received bad data: 'Corruption: Invalid packet: message had a length of 2147483710, but we only support messages up to 2147483647 bytes
'
W20260924 10:35:50.776278 13042 connection.cc:196] Error closing socket: Network error: TlsSocket::Close: Broken pipe
[       OK ] Parameters/TestRpc.TestRpcSidecarLimits/SSL_UnixSocket (5797 ms)
[ RUN      ] Parameters/TestRpc.TestCallTimeoutDoesntAffectNegotiation/SSL_UnixSocket
I20260924 10:35:50.792174 13054 acceptor_pool.cc:254] collecting diagnostics on the listening RPC socket unix:/tmp/dist-test-taskgX2zkr/test-tmp/rpc-test-65098c720f0e4128bcff4105e5222234.sock every 8 connection(s)
I20260924 10:35:50.792299 13055 acceptor_pool.cc:254] collecting diagnostics on the listening RPC socket unix:/tmp/dist-test-taskgX2zkr/test-tmp/rpc-test-65098c720f0e4128bcff4105e5222234.sock every 8 connection(s)
W20260924 10:35:50.811012 13050 negotiation.cc:266] Injecting 500ms delay in negotiation
I20260924 10:35:50.861241 12762 rpc-test-base.h:595] status: Timed out: connection negotiation to unix:/tmp/dist-test-taskgX2zkr/test-tmp/rpc-test-65098c720f0e4128bcff4105e5222234.sock for RPC Sleep timed out after 0.050s (ON_OUTBOUND_QUEUE), seconds elapsed: 0.0506117
[       OK ] Parameters/TestRpc.TestCallTimeoutDoesntAffectNegotiation/SSL_UnixSocket (538 ms)
[ RUN      ] Parameters/TestRpc.TestRpcHandlerLatencyMetric/SSL_UnixSocket
I20260924 10:35:51.336450 13079 acceptor_pool.cc:254] collecting diagnostics on the listening RPC socket unix:/tmp/dist-test-taskgX2zkr/test-tmp/rpc-test-b769b3d4518f4f538010bbe797f033ba.sock every 8 connection(s)
I20260924 10:35:51.336491 13080 acceptor_pool.cc:254] collecting diagnostics on the listening RPC socket unix:/tmp/dist-test-taskgX2zkr/test-tmp/rpc-test-b769b3d4518f4f538010bbe797f033ba.sock every 8 connection(s)
I20260924 10:35:51.369841 12762 rpc-test.cc:1236] Sleep() min lat: 20390
I20260924 10:35:51.369884 12762 rpc-test.cc:1237] Sleep() mean lat: 20390
I20260924 10:35:51.369908 12762 rpc-test.cc:1238] Sleep() max lat: 20390
I20260924 10:35:51.369920 12762 rpc-test.cc:1239] Sleep() #calls: 1
[       OK ] Parameters/TestRpc.TestRpcHandlerLatencyMetric/SSL_UnixSocket (54 ms)
[ RUN      ] Parameters/TestRpc.TimedOutOnResponseMetricServiceQueue/SSL_UnixSocket
I20260924 10:35:51.376277 13105 acceptor_pool.cc:254] collecting diagnostics on the listening RPC socket unix:/tmp/dist-test-taskgX2zkr/test-tmp/rpc-test-fd323d1af02f4124a23945b90948a61e.sock every 8 connection(s)
I20260924 10:35:51.376328 13106 acceptor_pool.cc:254] collecting diagnostics on the listening RPC socket unix:/tmp/dist-test-taskgX2zkr/test-tmp/rpc-test-fd323d1af02f4124a23945b90948a61e.sock every 8 connection(s)
W20260924 10:35:51.455209 13107 rpcz_store.cc:267] Call kudu.rpc_test.CalculatorService.Sleep from unix:<unnamed> (request call id 2) took 20 ms (client timeout 20 ms). Trace:
W20260924 10:35:51.455281 13107 rpcz_store.cc:269] 0924 10:35:51.434898 (+     0us) service_pool.cc:170] Inserting onto call queue
0924 10:35:51.455187 (+ 20289us) service_pool.cc:214] Skipping call since client already timed out
0924 10:35:51.455202 (+    15us) inbound_call.cc:173] Queueing failure response
Metrics: {}
W20260924 10:35:51.455986 13102 connection.cc:196] Error closing socket: Network error: TlsSocket::Close: Broken pipe
[       OK ] Parameters/TestRpc.TimedOutOnResponseMetricServiceQueue/SSL_UnixSocket (85 ms)
[ RUN      ] Parameters/TestRpc.RpcPendingConnectionsMetric/SSL_UnixSocket
I20260924 10:35:51.459079 13128 acceptor_pool.cc:254] collecting diagnostics on the listening RPC socket 0.0.0.0:32807 every 8 connection(s)
I20260924 10:35:51.459149 13129 acceptor_pool.cc:254] collecting diagnostics on the listening RPC socket 0.0.0.0:32807 every 8 connection(s)
W20260924 10:35:51.460058 13124 negotiation.cc:337] Failed RPC negotiation. Trace:
0924 10:35:51.459713 (+     0us) reactor.cc:625] Submitting negotiation task for server connection from 127.0.0.1:40156 (local address 127.0.0.1:32807)
0924 10:35:51.459792 (+    79us) server_negotiation.cc:206] Beginning negotiation
0924 10:35:51.459794 (+     2us) server_negotiation.cc:399] Waiting for connection header
0924 10:35:51.459889 (+    95us) negotiation.cc:327] Negotiation complete: Network error: Server connection negotiation failed: server connection from 127.0.0.1:40156: BlockingRecv error: recv got EOF from 127.0.0.1:40156 (error 108)
Metrics: {"server-negotiator.queue_time_us":33}
[       OK ] Parameters/TestRpc.RpcPendingConnectionsMetric/SSL_UnixSocket (13 ms)
[ RUN      ] Parameters/TestRpc.TestRpcContextClientDeadline/SSL_UnixSocket
I20260924 10:35:51.482375 13144 acceptor_pool.cc:254] collecting diagnostics on the listening RPC socket unix:/tmp/dist-test-taskgX2zkr/test-tmp/rpc-test-791789099337437bbff84e8f979ac2d8.sock every 8 connection(s)
I20260924 10:35:51.482435 13145 acceptor_pool.cc:254] collecting diagnostics on the listening RPC socket unix:/tmp/dist-test-taskgX2zkr/test-tmp/rpc-test-791789099337437bbff84e8f979ac2d8.sock every 8 connection(s)
W20260924 10:35:51.518285 13141 connection.cc:196] Error closing socket: Network error: TlsSocket::Close: Broken pipe
[       OK ] Parameters/TestRpc.TestRpcContextClientDeadline/SSL_UnixSocket (48 ms)
[ RUN      ] Parameters/TestRpc.TestApplicationFeatureFlagUnsupportedServer/SSL_UnixSocket
I20260924 10:35:51.556826 13169 acceptor_pool.cc:254] collecting diagnostics on the listening RPC socket unix:/tmp/dist-test-taskgX2zkr/test-tmp/rpc-test-3f35d7fb5bbb4628b2453a716edbae47.sock every 8 connection(s)
I20260924 10:35:51.556875 13170 acceptor_pool.cc:254] collecting diagnostics on the listening RPC socket unix:/tmp/dist-test-taskgX2zkr/test-tmp/rpc-test-3f35d7fb5bbb4628b2453a716edbae47.sock every 8 connection(s)
[       OK ] Parameters/TestRpc.TestApplicationFeatureFlagUnsupportedServer/SSL_UnixSocket (53 ms)
[ RUN      ] Parameters/TestRpc.TestCancellationAsync/SSL_UnixSocket
I20260924 10:35:51.594748 13194 acceptor_pool.cc:254] collecting diagnostics on the listening RPC socket unix:/tmp/dist-test-taskgX2zkr/test-tmp/rpc-test-435652dd8bdc419293ae0d21c35c103c.sock every 8 connection(s)
I20260924 10:35:51.594826 13195 acceptor_pool.cc:254] collecting diagnostics on the listening RPC socket unix:/tmp/dist-test-taskgX2zkr/test-tmp/rpc-test-435652dd8bdc419293ae0d21c35c103c.sock every 8 connection(s)
I20260924 10:35:51.595117 12762 rpc-test.cc:1716] Connecting to unix:/tmp/dist-test-taskgX2zkr/test-tmp/rpc-test-435652dd8bdc419293ae0d21c35c103c.sock
I20260924 10:35:51.613600 12762 test_util.cc:268] Using random seed: 703425695
I20260924 10:35:51.631012 13198 rpc-test-base.h:240] got call: sleep_micros: 500 pattern: 4294967295 num_repetitions: 2097152 sidecar_idx: 0
I20260924 10:35:51.644443 13197 rpc-test-base.h:240] got call: sleep_micros: 500 pattern: 4294967295 num_repetitions: 2097152 sidecar_idx: 0
I20260924 10:35:51.658881 13198 rpc-test-base.h:240] got call: sleep_micros: 500 pattern: 4294967295 num_repetitions: 2097152 sidecar_idx: 0
I20260924 10:35:51.672120 13197 rpc-test-base.h:240] got call: sleep_micros: 500 pattern: 4294967295 num_repetitions: 2097152 sidecar_idx: 0
I20260924 10:35:51.684654 13198 rpc-test-base.h:240] got call: sleep_micros: 500 pattern: 4294967295 num_repetitions: 2097152 sidecar_idx: 0
I20260924 10:35:51.697000 13196 rpc-test-base.h:240] got call: sleep_micros: 500 pattern: 4294967295 num_repetitions: 2097152 sidecar_idx: 0
I20260924 10:35:51.712893 13198 rpc-test-base.h:240] got call: sleep_micros: 500 pattern: 4294967295 num_repetitions: 2097152 sidecar_idx: 0
I20260924 10:35:51.730774 13196 rpc-test-base.h:240] got call: sleep_micros: 500 pattern: 4294967295 num_repetitions: 2097152 sidecar_idx: 0
W20260924 10:35:51.731925 13191 connection.cc:196] Error closing socket: Network error: TlsSocket::Close: Broken pipe
W20260924 10:35:51.734616 13191 connection.cc:441] server connection from unix:<unnamed> torn down before Call kudu.rpc.GenericCalculatorService.SleepWithSidecar from unix:<unnamed> (request call id 8) could send its response
W20260924 10:35:51.746135 13191 connection.cc:441] server connection from unix:<unnamed> torn down before Call kudu.rpc.GenericCalculatorService.SleepWithSidecar from unix:<unnamed> (request call id 9) could send its response
[       OK ] Parameters/TestRpc.TestCancellationAsync/SSL_UnixSocket (174 ms)
[ RUN      ] Parameters/TestRpc.TestPerformanceBySocketType/SSL_UnixSocket
I20260924 10:35:51.764559 13219 acceptor_pool.cc:254] collecting diagnostics on the listening RPC socket unix:/tmp/dist-test-taskgX2zkr/test-tmp/rpc-test-1959a5e532e54400a7caa58dab56c610.sock every 8 connection(s)
I20260924 10:35:51.764598 13220 acceptor_pool.cc:254] collecting diagnostics on the listening RPC socket unix:/tmp/dist-test-taskgX2zkr/test-tmp/rpc-test-1959a5e532e54400a7caa58dab56c610.sock every 8 connection(s)
I20260924 10:35:51.764887 12762 rpc-test.cc:1846] Connecting to unix:/tmp/dist-test-taskgX2zkr/test-tmp/rpc-test-1959a5e532e54400a7caa58dab56c610.sock
I20260924 10:35:53.204120 12762 rpc-test.cc:1859] Sending 1024MB via ssl-enabled unix socket: real 1.413s	user 1.672s	sys 0.920s
I20260924 10:35:54.550094 12762 rpc-test.cc:1859] Sending 1024MB via ssl-enabled unix socket: real 1.346s	user 1.679s	sys 0.805s
I20260924 10:35:55.957139 12762 rpc-test.cc:1859] Sending 1024MB via ssl-enabled unix socket: real 1.407s	user 1.727s	sys 0.859s
I20260924 10:35:57.204329 12762 rpc-test.cc:1859] Sending 1024MB via ssl-enabled unix socket: real 1.247s	user 1.500s	sys 0.791s
I20260924 10:35:58.498512 12762 rpc-test.cc:1859] Sending 1024MB via ssl-enabled unix socket: real 1.294s	user 1.553s	sys 0.817s
W20260924 10:35:58.499703 13216 connection.cc:196] Error closing socket: Network error: TlsSocket::Close: Broken pipe
[       OK ] Parameters/TestRpc.TestPerformanceBySocketType/SSL_UnixSocket (6753 ms)
[----------] 20 tests from Parameters/TestRpc (27575 ms total)

[----------] 1 test from Parameters/TestRpcSocketTxRxQueue
[ RUN      ] Parameters/TestRpcSocketTxRxQueue.AcceptorRxQueueSizeMetric/0
I20260924 10:35:58.506460 13244 acceptor_pool.cc:254] collecting diagnostics on the listening RPC socket 0.0.0.0:35585 every 1 connection(s)
I20260924 10:35:58.506544 13245 acceptor_pool.cc:254] collecting diagnostics on the listening RPC socket 0.0.0.0:35585 every 1 connection(s)
W20260924 10:35:58.507228 13240 negotiation.cc:337] Failed RPC negotiation. Trace:
0924 10:35:58.507009 (+     0us) reactor.cc:625] Submitting negotiation task for server connection from 127.0.0.1:46418 (local address 127.0.0.1:35585)
0924 10:35:58.507089 (+    80us) server_negotiation.cc:206] Beginning negotiation
0924 10:35:58.507091 (+     2us) server_negotiation.cc:399] Waiting for connection header
0924 10:35:58.507174 (+    83us) negotiation.cc:327] Negotiation complete: Network error: Server connection negotiation failed: server connection from 127.0.0.1:46418: BlockingRecv error: recv got EOF from 127.0.0.1:46418 (error 108)
Metrics: {"server-negotiator.queue_time_us":25}
[       OK ] Parameters/TestRpcSocketTxRxQueue.AcceptorRxQueueSizeMetric/0 (8 ms)
[----------] 1 test from Parameters/TestRpcSocketTxRxQueue (8 ms total)

[----------] Global test environment tear-down
[==========] 21 tests from 2 test suites ran. (27584 ms total)
[  PASSED  ] 20 tests.
[  FAILED  ] 1 test, listed below:
[  FAILED  ] Parameters/TestRpc.TestCallWithChainCertAndChainCA/SSL_UnixSocket, where GetParam() = (true, true)

 1 FAILED TEST