Diagnosed failure

Parameters/TestRpc.TestCallWithChainCertAndChainCA/SSL_UnixSocket: /data0/somelongdirectorytoavoidrpathissues/src/kudu/src/kudu/rpc/rpc-test.cc:270: Failure
Failed
Bad status: Runtime error: could not verify certificate chain (error with cert: subject=CN = localhost, ST = sadfjas, C = AS, emailAddress = sdflkdsajf, O = lskdfjlsad, OU = sldfkja, issuer=C = AS, ST = ASDfkjdhf, L = lskdjf, O = saldfja, OU = skdjf, CN = localhost, emailAddress = sadjflkadsj): : certificate has expired
Google Test trace:
/data0/somelongdirectorytoavoidrpathissues/src/kudu/src/kudu/rpc/rpc-test.cc:267: Connecting to unix:/tmp/dist-test-task8Z1i3O/test-tmp/rpc-test-7f978add930e4d6a9c7d74e76aa4fa7a.sock
I20260927 19:46:12.552029 14618 test_util.cc:175] -----------------------------------------------
I20260927 19:46:12.552277 14618 test_util.cc:176] Had fatal failures, leaving test files at /tmp/dist-test-task8Z1i3O/test-tmp/rpc-test.6.Parameters_TestRpc.TestCallWithChainCertAndChainCA_SSL_UnixSocket.1790538371158621-14618-0

Full log

Note: This is test shard 7 of 8.
[==========] Running 21 tests from 2 test suites.
[----------] Global test environment set-up.
[----------] 20 tests from Parameters/TestRpc
[ RUN      ] Parameters/TestRpc.TestMessengerCreateDestroy/SSL_UnixSocket
WARNING: Logging before InitGoogleLogging() is written to STDERR
I20260927 19:46:11.264969 14618 rpc-test.cc:169] started messenger TestCreateDestroy
[       OK ] Parameters/TestRpc.TestMessengerCreateDestroy/SSL_UnixSocket (1181 ms)
[ RUN      ] Parameters/TestRpc.TestNegotiationDeadlock/SSL_UnixSocket
I20260927 19:46:12.432746 14640 acceptor_pool.cc:254] collecting diagnostics on the listening RPC socket unix:/tmp/dist-test-task8Z1i3O/test-tmp/rpc-test-b5942dc58bd84dcbb1e83648b39f23ea.sock every 8 connection(s)
I20260927 19:46:12.434197 14641 acceptor_pool.cc:254] collecting diagnostics on the listening RPC socket unix:/tmp/dist-test-task8Z1i3O/test-tmp/rpc-test-b5942dc58bd84dcbb1e83648b39f23ea.sock every 8 connection(s)
[       OK ] Parameters/TestRpc.TestNegotiationDeadlock/SSL_UnixSocket (92 ms)
[ RUN      ] Parameters/TestRpc.TestCallWithChainCertAndChainCA/SSL_UnixSocket
I20260927 19:46:12.522085 14656 acceptor_pool.cc:254] collecting diagnostics on the listening RPC socket unix:/tmp/dist-test-task8Z1i3O/test-tmp/rpc-test-7f978add930e4d6a9c7d74e76aa4fa7a.sock every 8 connection(s)
I20260927 19:46:12.524271 14657 acceptor_pool.cc:254] collecting diagnostics on the listening RPC socket unix:/tmp/dist-test-task8Z1i3O/test-tmp/rpc-test-7f978add930e4d6a9c7d74e76aa4fa7a.sock every 8 connection(s)
/data0/somelongdirectorytoavoidrpathissues/src/kudu/src/kudu/rpc/rpc-test.cc:270: Failure
Failed
Bad status: Runtime error: could not verify certificate chain (error with cert: subject=CN = localhost, ST = sadfjas, C = AS, emailAddress = sdflkdsajf, O = lskdfjlsad, OU = sldfkja, issuer=C = AS, ST = ASDfkjdhf, L = lskdjf, O = saldfja, OU = skdjf, CN = localhost, emailAddress = sadjflkadsj): : certificate has expired
Google Test trace:
/data0/somelongdirectorytoavoidrpathissues/src/kudu/src/kudu/rpc/rpc-test.cc:267: Connecting to unix:/tmp/dist-test-task8Z1i3O/test-tmp/rpc-test-7f978add930e4d6a9c7d74e76aa4fa7a.sock
I20260927 19:46:12.552029 14618 test_util.cc:175] -----------------------------------------------
I20260927 19:46:12.552277 14618 test_util.cc:176] Had fatal failures, leaving test files at /tmp/dist-test-task8Z1i3O/test-tmp/rpc-test.6.Parameters_TestRpc.TestCallWithChainCertAndChainCA_SSL_UnixSocket.1790538371158621-14618-0
[  FAILED  ] Parameters/TestRpc.TestCallWithChainCertAndChainCA/SSL_UnixSocket, where GetParam() = (true, true) (67 ms)
[ RUN      ] Parameters/TestRpc.TestCallWithPasswordProtectedKey/SSL_UnixSocket
I20260927 19:46:12.568491 14681 acceptor_pool.cc:254] collecting diagnostics on the listening RPC socket unix:/tmp/dist-test-task8Z1i3O/test-tmp/rpc-test-44b315fc313f455ea4bec2ac0dd433f0.sock every 8 connection(s)
I20260927 19:46:12.569161 14682 acceptor_pool.cc:254] collecting diagnostics on the listening RPC socket unix:/tmp/dist-test-task8Z1i3O/test-tmp/rpc-test-44b315fc313f455ea4bec2ac0dd433f0.sock every 8 connection(s)
W20260927 19:46:12.613289 14678 connection.cc:196] Error closing socket: Network error: TlsSocket::Close: Broken pipe
[       OK ] Parameters/TestRpc.TestCallWithPasswordProtectedKey/SSL_UnixSocket (67 ms)
[ RUN      ] Parameters/TestRpc.TestCallToBadServer/SSL_UnixSocket
I20260927 19:46:12.641503 14618 rpc-test.cc:394] Status: Network error: Client connection negotiation failed: client connection to 0.0.0.0:0: connect: Connection refused (error 111)
I20260927 19:46:12.643206 14618 rpc-test.cc:394] Status: Network error: Client connection negotiation failed: client connection to 0.0.0.0:0: connect: Connection refused (error 111)
I20260927 19:46:12.644593 14618 rpc-test.cc:394] Status: Network error: Client connection negotiation failed: client connection to 0.0.0.0:0: connect: Connection refused (error 111)
I20260927 19:46:12.645828 14618 rpc-test.cc:394] Status: Network error: Client connection negotiation failed: client connection to 0.0.0.0:0: connect: Connection refused (error 111)
I20260927 19:46:12.647140 14618 rpc-test.cc:394] Status: Network error: Client connection negotiation failed: client connection to 0.0.0.0:0: connect: Connection refused (error 111)
[       OK ] Parameters/TestRpc.TestCallToBadServer/SSL_UnixSocket (29 ms)
[ RUN      ] Parameters/TestRpc.TestWrongService/SSL_UnixSocket
I20260927 19:46:12.698176 14716 acceptor_pool.cc:254] collecting diagnostics on the listening RPC socket unix:/tmp/dist-test-task8Z1i3O/test-tmp/rpc-test-959d5318d6f9486fb7c844124041ec2a.sock every 8 connection(s)
I20260927 19:46:12.698909 14717 acceptor_pool.cc:254] collecting diagnostics on the listening RPC socket unix:/tmp/dist-test-task8Z1i3O/test-tmp/rpc-test-959d5318d6f9486fb7c844124041ec2a.sock every 8 connection(s)
I20260927 19:46:12.728770 14713 messenger.cc:345] service WrongServiceName not registered on TestServer
[       OK ] Parameters/TestRpc.TestWrongService/SSL_UnixSocket (87 ms)
[ RUN      ] Parameters/TestRpc.TestConnectionKeepalive/SSL_UnixSocket
I20260927 19:46:12.756460 14739 acceptor_pool.cc:254] collecting diagnostics on the listening RPC socket unix:/tmp/dist-test-task8Z1i3O/test-tmp/rpc-test-a8d0730d841a4fc58ffab78bf4ee59f3.sock every 8 connection(s)
I20260927 19:46:12.757112 14740 acceptor_pool.cc:254] collecting diagnostics on the listening RPC socket unix:/tmp/dist-test-task8Z1i3O/test-tmp/rpc-test-a8d0730d841a4fc58ffab78bf4ee59f3.sock every 8 connection(s)
I20260927 19:46:12.760416 14618 rpc-test.cc:488] Connecting to unix:/tmp/dist-test-task8Z1i3O/test-tmp/rpc-test-a8d0730d841a4fc58ffab78bf4ee59f3.sock
W20260927 19:46:13.240756 14752 connection.cc:196] Error closing socket: Network error: TlsSocket::Close: Broken pipe
[       OK ] Parameters/TestRpc.TestConnectionKeepalive/SSL_UnixSocket (1068 ms)
[ RUN      ] Parameters/TestRpc.TestClientConnectionMetrics/SSL_UnixSocket
I20260927 19:46:13.824435 14764 acceptor_pool.cc:254] collecting diagnostics on the listening RPC socket unix:/tmp/dist-test-task8Z1i3O/test-tmp/rpc-test-39b9898f6605462db9f2b98376e3b7d5.sock every 8 connection(s)
I20260927 19:46:13.825187 14765 acceptor_pool.cc:254] collecting diagnostics on the listening RPC socket unix:/tmp/dist-test-task8Z1i3O/test-tmp/rpc-test-39b9898f6605462db9f2b98376e3b7d5.sock every 8 connection(s)
I20260927 19:46:13.828408 14618 rpc-test.cc:569] Connecting to unix:/tmp/dist-test-task8Z1i3O/test-tmp/rpc-test-39b9898f6605462db9f2b98376e3b7d5.sock
W20260927 19:48:31.016534 14761 connection.cc:196] Error closing socket: Network error: TlsSocket::Close: Broken pipe
[       OK ] Parameters/TestRpc.TestClientConnectionMetrics/SSL_UnixSocket (137217 ms)
[ RUN      ] Parameters/TestRpc.TestCredentialsPolicy/SSL_UnixSocket
I20260927 19:48:31.066111 14800 acceptor_pool.cc:254] collecting diagnostics on the listening RPC socket unix:/tmp/dist-test-task8Z1i3O/test-tmp/rpc-test-414288c251244ffda8feeee174a21beb.sock every 8 connection(s)
I20260927 19:48:31.066955 14801 acceptor_pool.cc:254] collecting diagnostics on the listening RPC socket unix:/tmp/dist-test-task8Z1i3O/test-tmp/rpc-test-414288c251244ffda8feeee174a21beb.sock every 8 connection(s)
I20260927 19:48:31.070226 14618 rpc-test.cc:700] Connecting to unix:/tmp/dist-test-task8Z1i3O/test-tmp/rpc-test-414288c251244ffda8feeee174a21beb.sock
W20260927 19:48:31.099594 14799 connection.cc:196] Error closing socket: Network error: TlsSocket::Close: Broken pipe
W20260927 19:48:31.112991 14799 connection.cc:196] Error closing socket: Network error: TlsSocket::Close: Broken pipe
[       OK ] Parameters/TestRpc.TestCredentialsPolicy/SSL_UnixSocket (96 ms)
[ RUN      ] Parameters/TestRpc.TestCallLongerThanKeepalive/SSL_UnixSocket
I20260927 19:48:31.143082 14825 acceptor_pool.cc:254] collecting diagnostics on the listening RPC socket unix:/tmp/dist-test-task8Z1i3O/test-tmp/rpc-test-8ecb3205097a413a90d8ac819ae9edf1.sock every 8 connection(s)
I20260927 19:48:31.143808 14826 acceptor_pool.cc:254] collecting diagnostics on the listening RPC socket unix:/tmp/dist-test-task8Z1i3O/test-tmp/rpc-test-8ecb3205097a413a90d8ac819ae9edf1.sock every 8 connection(s)
I20260927 19:48:31.181412 14829 rpc-test-base.h:222] got call: sleep_micros: 3000000 deferred: true
I20260927 19:48:34.185976 14829 rpcz_store.cc:275] Call kudu.rpc.GenericCalculatorService.Sleep from unix:<unnamed> (request call id 0) took 3004 ms. Trace:
I20260927 19:48:34.186396 14829 rpcz_store.cc:276] 0927 19:48:31.181251 (+     0us) service_pool.cc:170] Inserting onto call queue
0927 19:48:31.181355 (+   104us) service_pool.cc:227] Handling call
0927 19:48:34.185801 (+3004446us) inbound_call.cc:173] Queueing success response
Metrics: {}
[       OK ] Parameters/TestRpc.TestCallLongerThanKeepalive/SSL_UnixSocket (3078 ms)
[ RUN      ] Parameters/TestRpc.TestRpcSidecar/SSL_UnixSocket
I20260927 19:48:34.218801 14851 acceptor_pool.cc:254] collecting diagnostics on the listening RPC socket unix:/tmp/dist-test-task8Z1i3O/test-tmp/rpc-test-e1b88cd91f424d14875b1ac80efc2ca7.sock every 8 connection(s)
I20260927 19:48:34.219553 14852 acceptor_pool.cc:254] collecting diagnostics on the listening RPC socket unix:/tmp/dist-test-task8Z1i3O/test-tmp/rpc-test-e1b88cd91f424d14875b1ac80efc2ca7.sock every 8 connection(s)
W20260927 19:48:34.713456 14848 connection.cc:196] Error closing socket: Network error: TlsSocket::Close: Broken pipe
[       OK ] Parameters/TestRpc.TestRpcSidecar/SSL_UnixSocket (519 ms)
[ RUN      ] Parameters/TestRpc.TestRpcSidecarLimits/SSL_UnixSocket
I20260927 19:48:51.631084 14877 acceptor_pool.cc:254] collecting diagnostics on the listening RPC socket unix:/tmp/dist-test-task8Z1i3O/test-tmp/rpc-test-8bdb5c5963a34cc28e3ca60f4550773a.sock every 8 connection(s)
I20260927 19:48:51.631932 14878 acceptor_pool.cc:254] collecting diagnostics on the listening RPC socket unix:/tmp/dist-test-task8Z1i3O/test-tmp/rpc-test-8bdb5c5963a34cc28e3ca60f4550773a.sock every 8 connection(s)
W20260927 19:48:51.655622 14618 serialization.cc:72] Serialized kudu.rpc_test.PushStringsRequestPB (2147483654 bytes) is larger than the maximum configured RPC message size (52428800 bytes). Sending anyway, but peer may reject the data.
W20260927 19:48:51.666996 14874 connection.cc:535] server connection from unix:<unnamed> recv error: Network error: RPC frame had a length of 2147483714, but we only support messages up to 52428800 bytes long.
W20260927 19:48:51.667338 14874 connection.cc:158] shutting down server connection from unix:<unnamed> with pending inbound data: 4/2147483714 bytes received; last active 0 ns ago: status Network error: RPC frame had a length of 2147483714, but we only support messages up to 52428800 bytes long.
W20260927 19:48:51.668078 14890 connection.cc:698] client connection to unix:/tmp/dist-test-task8Z1i3O/test-tmp/rpc-test-8bdb5c5963a34cc28e3ca60f4550773a.sock send error: Network error: failed to write to TLS socket: Broken pipe
W20260927 19:48:51.668663 14890 connection.cc:196] Error closing socket: Network error: TlsSocket::Close: Success
[       OK ] Parameters/TestRpc.TestRpcSidecarLimits/SSL_UnixSocket (17789 ms)
[ RUN      ] Parameters/TestRpc.TestCallTimeoutDoesntAffectNegotiation/SSL_UnixSocket
I20260927 19:48:52.550920 14903 acceptor_pool.cc:254] collecting diagnostics on the listening RPC socket unix:/tmp/dist-test-task8Z1i3O/test-tmp/rpc-test-56427ff895794d7da66004705db3d4c6.sock every 8 connection(s)
I20260927 19:48:52.551753 14904 acceptor_pool.cc:254] collecting diagnostics on the listening RPC socket unix:/tmp/dist-test-task8Z1i3O/test-tmp/rpc-test-56427ff895794d7da66004705db3d4c6.sock every 8 connection(s)
W20260927 19:48:52.593565 14899 negotiation.cc:266] Injecting 500ms delay in negotiation
I20260927 19:48:52.643146 14618 rpc-test-base.h:595] status: Timed out: connection negotiation to unix:/tmp/dist-test-task8Z1i3O/test-tmp/rpc-test-56427ff895794d7da66004705db3d4c6.sock for RPC Sleep timed out after 0.050s (ON_OUTBOUND_QUEUE), seconds elapsed: 0.0506714
[       OK ] Parameters/TestRpc.TestCallTimeoutDoesntAffectNegotiation/SSL_UnixSocket (604 ms)
[ RUN      ] Parameters/TestRpc.TestRpcHandlerLatencyMetric/SSL_UnixSocket
I20260927 19:48:53.130844 14928 acceptor_pool.cc:254] collecting diagnostics on the listening RPC socket unix:/tmp/dist-test-task8Z1i3O/test-tmp/rpc-test-6fabc73e5fa94914ba5e8302f6e7a19d.sock every 8 connection(s)
I20260927 19:48:53.131577 14929 acceptor_pool.cc:254] collecting diagnostics on the listening RPC socket unix:/tmp/dist-test-task8Z1i3O/test-tmp/rpc-test-6fabc73e5fa94914ba5e8302f6e7a19d.sock every 8 connection(s)
I20260927 19:48:53.193614 14618 rpc-test.cc:1236] Sleep() min lat: 21671
I20260927 19:48:53.193857 14618 rpc-test.cc:1237] Sleep() mean lat: 21671
I20260927 19:48:53.194051 14618 rpc-test.cc:1238] Sleep() max lat: 21671
I20260927 19:48:53.194271 14618 rpc-test.cc:1239] Sleep() #calls: 1
W20260927 19:48:53.196834 14925 connection.cc:196] Error closing socket: Network error: TlsSocket::Close: Broken pipe
[       OK ] Parameters/TestRpc.TestRpcHandlerLatencyMetric/SSL_UnixSocket (90 ms)
[ RUN      ] Parameters/TestRpc.TimedOutOnResponseMetricServiceQueue/SSL_UnixSocket
I20260927 19:48:53.224898 14954 acceptor_pool.cc:254] collecting diagnostics on the listening RPC socket unix:/tmp/dist-test-task8Z1i3O/test-tmp/rpc-test-033f02cbb6bb4820915230edbc6cee20.sock every 8 connection(s)
I20260927 19:48:53.225642 14955 acceptor_pool.cc:254] collecting diagnostics on the listening RPC socket unix:/tmp/dist-test-task8Z1i3O/test-tmp/rpc-test-033f02cbb6bb4820915230edbc6cee20.sock every 8 connection(s)
W20260927 19:48:53.313958 14956 rpcz_store.cc:267] Call kudu.rpc_test.CalculatorService.Sleep from unix:<unnamed> (request call id 2) took 20 ms (client timeout 20 ms). Trace:
W20260927 19:48:53.314348 14956 rpcz_store.cc:269] 0927 19:48:53.293423 (+     0us) service_pool.cc:170] Inserting onto call queue
0927 19:48:53.313793 (+ 20370us) service_pool.cc:214] Skipping call since client already timed out
0927 19:48:53.313878 (+    85us) inbound_call.cc:173] Queueing failure response
Metrics: {}
W20260927 19:48:53.316897 14951 connection.cc:196] Error closing socket: Network error: TlsSocket::Close: Broken pipe
[       OK ] Parameters/TestRpc.TimedOutOnResponseMetricServiceQueue/SSL_UnixSocket (118 ms)
[ RUN      ] Parameters/TestRpc.RpcPendingConnectionsMetric/SSL_UnixSocket
I20260927 19:48:53.333125 14977 acceptor_pool.cc:254] collecting diagnostics on the listening RPC socket 0.0.0.0:34589 every 8 connection(s)
I20260927 19:48:53.333865 14978 acceptor_pool.cc:254] collecting diagnostics on the listening RPC socket 0.0.0.0:34589 every 8 connection(s)
W20260927 19:48:53.339093 14973 negotiation.cc:337] Failed RPC negotiation. Trace:
0927 19:48:53.337812 (+     0us) reactor.cc:625] Submitting negotiation task for server connection from 127.0.0.1:57292 (local address 127.0.0.1:34589)
0927 19:48:53.338240 (+   428us) server_negotiation.cc:206] Beginning negotiation
0927 19:48:53.338258 (+    18us) server_negotiation.cc:399] Waiting for connection header
0927 19:48:53.338501 (+   243us) negotiation.cc:327] Negotiation complete: Network error: Server connection negotiation failed: server connection from 127.0.0.1:57292: BlockingRecv error: recv got EOF from 127.0.0.1:57292 (error 108)
Metrics: {"server-negotiator.queue_time_us":130}
[       OK ] Parameters/TestRpc.RpcPendingConnectionsMetric/SSL_UnixSocket (31 ms)
[ RUN      ] Parameters/TestRpc.TestRpcContextClientDeadline/SSL_UnixSocket
I20260927 19:48:53.374239 14993 acceptor_pool.cc:254] collecting diagnostics on the listening RPC socket unix:/tmp/dist-test-task8Z1i3O/test-tmp/rpc-test-28fd0c1673db49a28647cdc142ee5998.sock every 8 connection(s)
I20260927 19:48:53.375017 14994 acceptor_pool.cc:254] collecting diagnostics on the listening RPC socket unix:/tmp/dist-test-task8Z1i3O/test-tmp/rpc-test-28fd0c1673db49a28647cdc142ee5998.sock every 8 connection(s)
[       OK ] Parameters/TestRpc.TestRpcContextClientDeadline/SSL_UnixSocket (79 ms)
[ RUN      ] Parameters/TestRpc.TestApplicationFeatureFlagUnsupportedServer/SSL_UnixSocket
I20260927 19:48:53.463240 15018 acceptor_pool.cc:254] collecting diagnostics on the listening RPC socket unix:/tmp/dist-test-task8Z1i3O/test-tmp/rpc-test-11d77f32ce304789aa3db0df100aa95a.sock every 8 connection(s)
I20260927 19:48:53.463980 15019 acceptor_pool.cc:254] collecting diagnostics on the listening RPC socket unix:/tmp/dist-test-task8Z1i3O/test-tmp/rpc-test-11d77f32ce304789aa3db0df100aa95a.sock every 8 connection(s)
W20260927 19:48:53.506886 15015 connection.cc:196] Error closing socket: Network error: TlsSocket::Close: Broken pipe
[       OK ] Parameters/TestRpc.TestApplicationFeatureFlagUnsupportedServer/SSL_UnixSocket (79 ms)
[ RUN      ] Parameters/TestRpc.TestCancellationAsync/SSL_UnixSocket
I20260927 19:48:53.529508 15043 acceptor_pool.cc:254] collecting diagnostics on the listening RPC socket unix:/tmp/dist-test-task8Z1i3O/test-tmp/rpc-test-59fa0e0a2731410a80554072956e51bd.sock every 8 connection(s)
I20260927 19:48:53.530210 15044 acceptor_pool.cc:254] collecting diagnostics on the listening RPC socket unix:/tmp/dist-test-task8Z1i3O/test-tmp/rpc-test-59fa0e0a2731410a80554072956e51bd.sock every 8 connection(s)
I20260927 19:48:53.533309 14618 rpc-test.cc:1716] Connecting to unix:/tmp/dist-test-task8Z1i3O/test-tmp/rpc-test-59fa0e0a2731410a80554072956e51bd.sock
I20260927 19:48:53.566107 14618 test_util.cc:268] Using random seed: 1027602051
I20260927 19:48:53.785567 15047 rpc-test-base.h:240] got call: sleep_micros: 500 pattern: 4294967295 num_repetitions: 2097152 sidecar_idx: 0
I20260927 19:48:53.987056 15046 rpc-test-base.h:240] got call: sleep_micros: 500 pattern: 4294967295 num_repetitions: 2097152 sidecar_idx: 0
I20260927 19:48:54.206015 15046 rpc-test-base.h:240] got call: sleep_micros: 500 pattern: 4294967295 num_repetitions: 2097152 sidecar_idx: 0
I20260927 19:48:54.401925 15047 rpc-test-base.h:240] got call: sleep_micros: 500 pattern: 4294967295 num_repetitions: 2097152 sidecar_idx: 0
I20260927 19:48:54.593405 15046 rpc-test-base.h:240] got call: sleep_micros: 500 pattern: 4294967295 num_repetitions: 2097152 sidecar_idx: 0
I20260927 19:48:54.802245 15047 rpc-test-base.h:240] got call: sleep_micros: 500 pattern: 4294967295 num_repetitions: 2097152 sidecar_idx: 0
I20260927 19:48:55.006078 15046 rpc-test-base.h:240] got call: sleep_micros: 500 pattern: 4294967295 num_repetitions: 2097152 sidecar_idx: 0
I20260927 19:48:55.205147 15047 rpc-test-base.h:240] got call: sleep_micros: 500 pattern: 4294967295 num_repetitions: 2097152 sidecar_idx: 0
I20260927 19:48:55.451135 15047 rpc-test-base.h:240] got call: sleep_micros: 500 pattern: 4294967295 num_repetitions: 2097152 sidecar_idx: 0
W20260927 19:48:55.465979 15040 connection.cc:196] Error closing socket: Network error: TlsSocket::Close: Broken pipe
W20260927 19:48:55.588343 15040 connection.cc:441] server connection from unix:<unnamed> torn down before Call kudu.rpc.GenericCalculatorService.SleepWithSidecar from unix:<unnamed> (request call id 9) could send its response
[       OK ] Parameters/TestRpc.TestCancellationAsync/SSL_UnixSocket (2086 ms)
[ RUN      ] Parameters/TestRpc.TestPerformanceBySocketType/SSL_UnixSocket
I20260927 19:48:55.699251 15068 acceptor_pool.cc:254] collecting diagnostics on the listening RPC socket unix:/tmp/dist-test-task8Z1i3O/test-tmp/rpc-test-60af7179c12d49738182abcba6970221.sock every 8 connection(s)
I20260927 19:48:55.699981 15069 acceptor_pool.cc:254] collecting diagnostics on the listening RPC socket unix:/tmp/dist-test-task8Z1i3O/test-tmp/rpc-test-60af7179c12d49738182abcba6970221.sock every 8 connection(s)
I20260927 19:48:55.703169 14618 rpc-test.cc:1846] Connecting to unix:/tmp/dist-test-task8Z1i3O/test-tmp/rpc-test-60af7179c12d49738182abcba6970221.sock
I20260927 19:49:17.226960 14618 rpc-test.cc:1859] Sending 1024MB via ssl-enabled unix socket: real 21.503s	user 19.331s	sys 12.909s
I20260927 19:49:38.887538 14618 rpc-test.cc:1859] Sending 1024MB via ssl-enabled unix socket: real 21.660s	user 19.489s	sys 13.111s
I20260927 19:50:00.424239 14618 rpc-test.cc:1859] Sending 1024MB via ssl-enabled unix socket: real 21.536s	user 19.493s	sys 12.766s
I20260927 19:50:21.882337 14618 rpc-test.cc:1859] Sending 1024MB via ssl-enabled unix socket: real 21.458s	user 19.396s	sys 12.788s
I20260927 19:50:43.583607 14618 rpc-test.cc:1859] Sending 1024MB via ssl-enabled unix socket: real 21.701s	user 19.517s	sys 13.138s
W20260927 19:50:43.589027 15065 connection.cc:196] Error closing socket: Network error: TlsSocket::Close: Broken pipe
[       OK ] Parameters/TestRpc.TestPerformanceBySocketType/SSL_UnixSocket (108003 ms)
[----------] 20 tests from Parameters/TestRpc (272391 ms total)

[----------] 1 test from Parameters/TestRpcSocketTxRxQueue
[ RUN      ] Parameters/TestRpcSocketTxRxQueue.AcceptorRxQueueSizeMetric/0
I20260927 19:50:43.617702 15104 acceptor_pool.cc:254] collecting diagnostics on the listening RPC socket 0.0.0.0:35837 every 1 connection(s)
I20260927 19:50:43.618571 15105 acceptor_pool.cc:254] collecting diagnostics on the listening RPC socket 0.0.0.0:35837 every 1 connection(s)
W20260927 19:50:43.624351 15100 negotiation.cc:337] Failed RPC negotiation. Trace:
0927 19:50:43.622646 (+     0us) reactor.cc:625] Submitting negotiation task for server connection from 127.0.0.1:46544 (local address 127.0.0.1:35837)
0927 19:50:43.623148 (+   502us) server_negotiation.cc:206] Beginning negotiation
0927 19:50:43.623194 (+    46us) server_negotiation.cc:399] Waiting for connection header
0927 19:50:43.623430 (+   236us) negotiation.cc:327] Negotiation complete: Network error: Server connection negotiation failed: server connection from 127.0.0.1:46544: BlockingRecv error: recv got EOF from 127.0.0.1:46544 (error 108)
Metrics: {"server-negotiator.queue_time_us":147}
[       OK ] Parameters/TestRpcSocketTxRxQueue.AcceptorRxQueueSizeMetric/0 (29 ms)
[----------] 1 test from Parameters/TestRpcSocketTxRxQueue (29 ms total)

[----------] Global test environment tear-down
[==========] 21 tests from 2 test suites ran. (272421 ms total)
[  PASSED  ] 20 tests.
[  FAILED  ] 1 test, listed below:
[  FAILED  ] Parameters/TestRpc.TestCallWithChainCertAndChainCA/SSL_UnixSocket, where GetParam() = (true, true)

 1 FAILED TEST