Diagnosed failure

Parameters/TestRpc.TestCallWithChainCertAndChainCA/SSL_TCP: /data0/somelongdirectorytoavoidrpathissues/src/kudu/src/kudu/rpc/rpc-test.cc:270: Failure
Failed
Bad status: Runtime error: could not verify certificate chain (error with cert: subject=CN = localhost, ST = sadfjas, C = AS, emailAddress = sdflkdsajf, O = lskdfjlsad, OU = sldfkja, issuer=C = AS, ST = ASDfkjdhf, L = lskdjf, O = saldfja, OU = skdjf, CN = localhost, emailAddress = sadjflkadsj): : certificate has expired
Google Test trace:
/data0/somelongdirectorytoavoidrpathissues/src/kudu/src/kudu/rpc/rpc-test.cc:267: Connecting to 0.0.0.0:46721
I20260924 10:35:18.088186  2717 test_util.cc:175] -----------------------------------------------
I20260924 10:35:18.088241  2717 test_util.cc:176] Had fatal failures, leaving test files at /tmp/dist-test-taskpxBmU3/test-tmp/rpc-test.5.Parameters_TestRpc.TestCallWithChainCertAndChainCA_SSL_TCP.1790246118004770-2717-0

Full log

Note: This is test shard 6 of 8.
[==========] Running 21 tests from 2 test suites.
[----------] Global test environment set-up.
[----------] 20 tests from Parameters/TestRpc
[ RUN      ] Parameters/TestRpc.TestMessengerCreateDestroy/SSL_TCP
WARNING: Logging before InitGoogleLogging() is written to STDERR
I20260924 10:35:18.034013  2717 rpc-test.cc:169] started messenger TestCreateDestroy
[       OK ] Parameters/TestRpc.TestMessengerCreateDestroy/SSL_TCP (24 ms)
[ RUN      ] Parameters/TestRpc.TestNegotiationDeadlock/SSL_TCP
I20260924 10:35:18.052793  2737 acceptor_pool.cc:254] collecting diagnostics on the listening RPC socket 0.0.0.0:35219 every 8 connection(s)
I20260924 10:35:18.052912  2738 acceptor_pool.cc:254] collecting diagnostics on the listening RPC socket 0.0.0.0:35219 every 8 connection(s)
[       OK ] Parameters/TestRpc.TestNegotiationDeadlock/SSL_TCP (29 ms)
[ RUN      ] Parameters/TestRpc.TestCallWithChainCertAndChainCA/SSL_TCP
I20260924 10:35:18.082979  2753 acceptor_pool.cc:254] collecting diagnostics on the listening RPC socket 0.0.0.0:46721 every 8 connection(s)
I20260924 10:35:18.083003  2754 acceptor_pool.cc:254] collecting diagnostics on the listening RPC socket 0.0.0.0:46721 every 8 connection(s)
/data0/somelongdirectorytoavoidrpathissues/src/kudu/src/kudu/rpc/rpc-test.cc:270: Failure
Failed
Bad status: Runtime error: could not verify certificate chain (error with cert: subject=CN = localhost, ST = sadfjas, C = AS, emailAddress = sdflkdsajf, O = lskdfjlsad, OU = sldfkja, issuer=C = AS, ST = ASDfkjdhf, L = lskdjf, O = saldfja, OU = skdjf, CN = localhost, emailAddress = sadjflkadsj): : certificate has expired
Google Test trace:
/data0/somelongdirectorytoavoidrpathissues/src/kudu/src/kudu/rpc/rpc-test.cc:267: Connecting to 0.0.0.0:46721
I20260924 10:35:18.088186  2717 test_util.cc:175] -----------------------------------------------
I20260924 10:35:18.088241  2717 test_util.cc:176] Had fatal failures, leaving test files at /tmp/dist-test-taskpxBmU3/test-tmp/rpc-test.5.Parameters_TestRpc.TestCallWithChainCertAndChainCA_SSL_TCP.1790246118004770-2717-0
[  FAILED  ] Parameters/TestRpc.TestCallWithChainCertAndChainCA/SSL_TCP, where GetParam() = (true, false) (22 ms)
[ RUN      ] Parameters/TestRpc.TestCallWithPasswordProtectedKey/SSL_TCP
I20260924 10:35:18.124063  2778 acceptor_pool.cc:254] collecting diagnostics on the listening RPC socket 0.0.0.0:35951 every 8 connection(s)
I20260924 10:35:18.124084  2779 acceptor_pool.cc:254] collecting diagnostics on the listening RPC socket 0.0.0.0:35951 every 8 connection(s)
[       OK ] Parameters/TestRpc.TestCallWithPasswordProtectedKey/SSL_TCP (50 ms)
[ RUN      ] Parameters/TestRpc.TestCallToBadServer/SSL_TCP
I20260924 10:35:18.150807  2717 rpc-test.cc:394] Status: Network error: Client connection negotiation failed: client connection to 0.0.0.0:0: connect: Connection refused (error 111)
I20260924 10:35:18.151285  2717 rpc-test.cc:394] Status: Network error: Client connection negotiation failed: client connection to 0.0.0.0:0: connect: Connection refused (error 111)
I20260924 10:35:18.151784  2717 rpc-test.cc:394] Status: Network error: Client connection negotiation failed: client connection to 0.0.0.0:0: connect: Connection refused (error 111)
I20260924 10:35:18.152204  2717 rpc-test.cc:394] Status: Network error: Client connection negotiation failed: client connection to 0.0.0.0:0: connect: Connection refused (error 111)
I20260924 10:35:18.152601  2717 rpc-test.cc:394] Status: Network error: Client connection negotiation failed: client connection to 0.0.0.0:0: connect: Connection refused (error 111)
[       OK ] Parameters/TestRpc.TestCallToBadServer/SSL_TCP (14 ms)
[ RUN      ] Parameters/TestRpc.TestWrongService/SSL_TCP
I20260924 10:35:18.171240  2813 acceptor_pool.cc:254] collecting diagnostics on the listening RPC socket 0.0.0.0:38235 every 8 connection(s)
I20260924 10:35:18.171279  2814 acceptor_pool.cc:254] collecting diagnostics on the listening RPC socket 0.0.0.0:38235 every 8 connection(s)
I20260924 10:35:18.183254  2811 messenger.cc:345] service WrongServiceName not registered on TestServer
[       OK ] Parameters/TestRpc.TestWrongService/SSL_TCP (32 ms)
[ RUN      ] Parameters/TestRpc.TestConnectionKeepalive/SSL_TCP
I20260924 10:35:18.193823  2836 acceptor_pool.cc:254] collecting diagnostics on the listening RPC socket 0.0.0.0:40555 every 8 connection(s)
I20260924 10:35:18.193872  2837 acceptor_pool.cc:254] collecting diagnostics on the listening RPC socket 0.0.0.0:40555 every 8 connection(s)
I20260924 10:35:18.194147  2717 rpc-test.cc:488] Connecting to 0.0.0.0:40555
[       OK ] Parameters/TestRpc.TestConnectionKeepalive/SSL_TCP (1046 ms)
[ RUN      ] Parameters/TestRpc.TestClientConnectionMetrics/SSL_TCP
I20260924 10:35:19.240330  2861 acceptor_pool.cc:254] collecting diagnostics on the listening RPC socket 0.0.0.0:43115 every 8 connection(s)
I20260924 10:35:19.240481  2862 acceptor_pool.cc:254] collecting diagnostics on the listening RPC socket 0.0.0.0:43115 every 8 connection(s)
I20260924 10:35:19.240715  2717 rpc-test.cc:569] Connecting to 0.0.0.0:43115
[       OK ] Parameters/TestRpc.TestClientConnectionMetrics/SSL_TCP (14385 ms)
[ RUN      ] Parameters/TestRpc.TestCredentialsPolicy/SSL_TCP
I20260924 10:35:33.630617  2884 acceptor_pool.cc:254] collecting diagnostics on the listening RPC socket 0.0.0.0:41357 every 8 connection(s)
I20260924 10:35:33.630661  2885 acceptor_pool.cc:254] collecting diagnostics on the listening RPC socket 0.0.0.0:41357 every 8 connection(s)
I20260924 10:35:33.630990  2717 rpc-test.cc:700] Connecting to 0.0.0.0:41357
[       OK ] Parameters/TestRpc.TestCredentialsPolicy/SSL_TCP (46 ms)
[ RUN      ] Parameters/TestRpc.TestCallLongerThanKeepalive/SSL_TCP
I20260924 10:35:33.673755  2909 acceptor_pool.cc:254] collecting diagnostics on the listening RPC socket 0.0.0.0:42161 every 8 connection(s)
I20260924 10:35:33.673789  2910 acceptor_pool.cc:254] collecting diagnostics on the listening RPC socket 0.0.0.0:42161 every 8 connection(s)
I20260924 10:35:33.686635  2913 rpc-test-base.h:222] got call: sleep_micros: 3000000 deferred: true
I20260924 10:35:36.687659  2913 rpcz_store.cc:275] Call kudu.rpc.GenericCalculatorService.Sleep from 127.0.0.1:36734 (request call id 0) took 3001 ms. Trace:
I20260924 10:35:36.687816  2913 rpcz_store.cc:276] 0924 10:35:33.686525 (+     0us) service_pool.cc:170] Inserting onto call queue
0924 10:35:33.686605 (+    80us) service_pool.cc:227] Handling call
0924 10:35:36.687638 (+3001033us) inbound_call.cc:173] Queueing success response
Metrics: {}
[       OK ] Parameters/TestRpc.TestCallLongerThanKeepalive/SSL_TCP (3026 ms)
[ RUN      ] Parameters/TestRpc.TestRpcSidecar/SSL_TCP
I20260924 10:35:36.702782  2934 acceptor_pool.cc:254] collecting diagnostics on the listening RPC socket 0.0.0.0:36207 every 8 connection(s)
I20260924 10:35:36.702929  2935 acceptor_pool.cc:254] collecting diagnostics on the listening RPC socket 0.0.0.0:36207 every 8 connection(s)
[       OK ] Parameters/TestRpc.TestRpcSidecar/SSL_TCP (95 ms)
[ RUN      ] Parameters/TestRpc.TestRpcSidecarLimits/SSL_TCP
I20260924 10:35:38.530488  2959 acceptor_pool.cc:254] collecting diagnostics on the listening RPC socket 0.0.0.0:43815 every 8 connection(s)
I20260924 10:35:38.530519  2960 acceptor_pool.cc:254] collecting diagnostics on the listening RPC socket 0.0.0.0:43815 every 8 connection(s)
W20260924 10:35:38.552204  2717 serialization.cc:72] Serialized kudu.rpc_test.PushStringsRequestPB (2147483654 bytes) is larger than the maximum configured RPC message size (52428800 bytes). Sending anyway, but peer may reject the data.
W20260924 10:35:38.556301  2956 connection.cc:535] server connection from 127.0.0.1:34944 recv error: Network error: RPC frame had a length of 2147483714, but we only support messages up to 52428800 bytes long.
W20260924 10:35:38.556388  2956 connection.cc:158] shutting down server connection from 127.0.0.1:34944 with pending inbound data: 4/2147483714 bytes received; last active 0 ns ago: status Network error: RPC frame had a length of 2147483714, but we only support messages up to 52428800 bytes long.
W20260924 10:35:38.556627  2972 connection.cc:698] client connection to 0.0.0.0:43815 send error: Network error: failed to write to TLS socket: Connection reset by peer
W20260924 10:35:38.556793  2972 connection.cc:196] Error closing socket: Network error: TlsSocket::Close: Success
I20260924 10:35:38.575927  2985 acceptor_pool.cc:254] collecting diagnostics on the listening RPC socket 0.0.0.0:44823 every 8 connection(s)
I20260924 10:35:38.575901  2984 acceptor_pool.cc:254] collecting diagnostics on the listening RPC socket 0.0.0.0:44823 every 8 connection(s)
W20260924 10:35:42.874589  2981 connection.cc:577] server connection from 127.0.0.1:36942: received bad data: 'Corruption: Invalid packet: message had a length of 2147483710, but we only support messages up to 2147483647 bytes
'
[       OK ] Parameters/TestRpc.TestRpcSidecarLimits/SSL_TCP (6090 ms)
[ RUN      ] Parameters/TestRpc.TestCallTimeoutDoesntAffectNegotiation/SSL_TCP
I20260924 10:35:42.896839  3009 acceptor_pool.cc:254] collecting diagnostics on the listening RPC socket 0.0.0.0:40043 every 8 connection(s)
I20260924 10:35:42.896989  3010 acceptor_pool.cc:254] collecting diagnostics on the listening RPC socket 0.0.0.0:40043 every 8 connection(s)
W20260924 10:35:42.935602  3005 negotiation.cc:266] Injecting 500ms delay in negotiation
I20260924 10:35:42.985922  2717 rpc-test-base.h:595] status: Timed out: connection negotiation to 0.0.0.0:40043 for RPC Sleep timed out after 0.050s (ON_OUTBOUND_QUEUE), seconds elapsed: 0.0509061
[       OK ] Parameters/TestRpc.TestCallTimeoutDoesntAffectNegotiation/SSL_TCP (565 ms)
[ RUN      ] Parameters/TestRpc.TestRpcHandlerLatencyMetric/SSL_TCP
I20260924 10:35:43.461290  3034 acceptor_pool.cc:254] collecting diagnostics on the listening RPC socket 0.0.0.0:37113 every 8 connection(s)
I20260924 10:35:43.461303  3035 acceptor_pool.cc:254] collecting diagnostics on the listening RPC socket 0.0.0.0:37113 every 8 connection(s)
I20260924 10:35:43.494637  2717 rpc-test.cc:1236] Sleep() min lat: 20385
I20260924 10:35:43.494709  2717 rpc-test.cc:1237] Sleep() mean lat: 20385
I20260924 10:35:43.494737  2717 rpc-test.cc:1238] Sleep() max lat: 20385
I20260924 10:35:43.494750  2717 rpc-test.cc:1239] Sleep() #calls: 1
[       OK ] Parameters/TestRpc.TestRpcHandlerLatencyMetric/SSL_TCP (54 ms)
[ RUN      ] Parameters/TestRpc.TimedOutOnResponseMetricServiceQueue/SSL_TCP
I20260924 10:35:43.514642  3060 acceptor_pool.cc:254] collecting diagnostics on the listening RPC socket 0.0.0.0:46567 every 8 connection(s)
I20260924 10:35:43.514660  3061 acceptor_pool.cc:254] collecting diagnostics on the listening RPC socket 0.0.0.0:46567 every 8 connection(s)
W20260924 10:35:43.567260  3062 rpcz_store.cc:267] Call kudu.rpc_test.CalculatorService.Sleep from 127.0.0.1:54490 (request call id 2) took 20 ms (client timeout 20 ms). Trace:
W20260924 10:35:43.567436  3062 rpcz_store.cc:269] 0924 10:35:43.546836 (+     0us) service_pool.cc:170] Inserting onto call queue
0924 10:35:43.567203 (+ 20367us) service_pool.cc:214] Skipping call since client already timed out
0924 10:35:43.567239 (+    36us) inbound_call.cc:173] Queueing failure response
Metrics: {}
[       OK ] Parameters/TestRpc.TimedOutOnResponseMetricServiceQueue/SSL_TCP (72 ms)
[ RUN      ] Parameters/TestRpc.RpcPendingConnectionsMetric/SSL_TCP
I20260924 10:35:43.571866  3083 acceptor_pool.cc:254] collecting diagnostics on the listening RPC socket 0.0.0.0:45271 every 8 connection(s)
I20260924 10:35:43.572000  3084 acceptor_pool.cc:254] collecting diagnostics on the listening RPC socket 0.0.0.0:45271 every 8 connection(s)
W20260924 10:35:43.572938  3079 negotiation.cc:337] Failed RPC negotiation. Trace:
0924 10:35:43.572605 (+     0us) reactor.cc:625] Submitting negotiation task for server connection from 127.0.0.1:49286 (local address 127.0.0.1:45271)
0924 10:35:43.572687 (+    82us) server_negotiation.cc:206] Beginning negotiation
0924 10:35:43.572690 (+     3us) server_negotiation.cc:399] Waiting for connection header
0924 10:35:43.572761 (+    71us) negotiation.cc:327] Negotiation complete: Network error: Server connection negotiation failed: server connection from 127.0.0.1:49286: BlockingRecv error: recv got EOF from 127.0.0.1:49286 (error 108)
Metrics: {"server-negotiator.queue_time_us":24}
[       OK ] Parameters/TestRpc.RpcPendingConnectionsMetric/SSL_TCP (14 ms)
[ RUN      ] Parameters/TestRpc.TestRpcContextClientDeadline/SSL_TCP
I20260924 10:35:43.597509  3099 acceptor_pool.cc:254] collecting diagnostics on the listening RPC socket 0.0.0.0:34165 every 8 connection(s)
I20260924 10:35:43.597554  3100 acceptor_pool.cc:254] collecting diagnostics on the listening RPC socket 0.0.0.0:34165 every 8 connection(s)
[       OK ] Parameters/TestRpc.TestRpcContextClientDeadline/SSL_TCP (51 ms)
[ RUN      ] Parameters/TestRpc.TestApplicationFeatureFlagUnsupportedServer/SSL_TCP
I20260924 10:35:43.649595  3124 acceptor_pool.cc:254] collecting diagnostics on the listening RPC socket 0.0.0.0:44261 every 8 connection(s)
I20260924 10:35:43.649631  3125 acceptor_pool.cc:254] collecting diagnostics on the listening RPC socket 0.0.0.0:44261 every 8 connection(s)
[       OK ] Parameters/TestRpc.TestApplicationFeatureFlagUnsupportedServer/SSL_TCP (34 ms)
[ RUN      ] Parameters/TestRpc.TestCancellationAsync/SSL_TCP
I20260924 10:35:43.678483  3149 acceptor_pool.cc:254] collecting diagnostics on the listening RPC socket 0.0.0.0:35183 every 8 connection(s)
I20260924 10:35:43.678495  3150 acceptor_pool.cc:254] collecting diagnostics on the listening RPC socket 0.0.0.0:35183 every 8 connection(s)
I20260924 10:35:43.678790  2717 rpc-test.cc:1716] Connecting to 0.0.0.0:35183
I20260924 10:35:43.683527  2717 test_util.cc:268] Using random seed: 695495622
I20260924 10:35:43.702221  3153 rpc-test-base.h:240] got call: sleep_micros: 500 pattern: 4294967295 num_repetitions: 2097152 sidecar_idx: 0
I20260924 10:35:43.721354  3152 rpc-test-base.h:240] got call: sleep_micros: 500 pattern: 4294967295 num_repetitions: 2097152 sidecar_idx: 0
I20260924 10:35:43.738337  3153 rpc-test-base.h:240] got call: sleep_micros: 500 pattern: 4294967295 num_repetitions: 2097152 sidecar_idx: 0
I20260924 10:35:43.754021  3152 rpc-test-base.h:240] got call: sleep_micros: 500 pattern: 4294967295 num_repetitions: 2097152 sidecar_idx: 0
I20260924 10:35:43.770758  3153 rpc-test-base.h:240] got call: sleep_micros: 500 pattern: 4294967295 num_repetitions: 2097152 sidecar_idx: 0
I20260924 10:35:43.788497  3152 rpc-test-base.h:240] got call: sleep_micros: 500 pattern: 4294967295 num_repetitions: 2097152 sidecar_idx: 0
I20260924 10:35:43.809623  3153 rpc-test-base.h:240] got call: sleep_micros: 500 pattern: 4294967295 num_repetitions: 2097152 sidecar_idx: 0
W20260924 10:35:43.814532  3146 connection.cc:441] server connection from 127.0.0.1:59952 torn down before Call kudu.rpc.GenericCalculatorService.SleepWithSidecar from 127.0.0.1:59952 (request call id 8) could send its response
W20260924 10:35:43.827703  3146 connection.cc:441] server connection from 127.0.0.1:59952 torn down before Call kudu.rpc.GenericCalculatorService.SleepWithSidecar from 127.0.0.1:59952 (request call id 9) could send its response
[       OK ] Parameters/TestRpc.TestCancellationAsync/SSL_TCP (159 ms)
[ RUN      ] Parameters/TestRpc.TestPerformanceBySocketType/SSL_TCP
I20260924 10:35:43.855959  3174 acceptor_pool.cc:254] collecting diagnostics on the listening RPC socket 0.0.0.0:46837 every 8 connection(s)
I20260924 10:35:43.855983  3175 acceptor_pool.cc:254] collecting diagnostics on the listening RPC socket 0.0.0.0:46837 every 8 connection(s)
I20260924 10:35:43.856308  2717 rpc-test.cc:1846] Connecting to 0.0.0.0:46837
I20260924 10:35:46.024364  2717 rpc-test.cc:1859] Sending 1024MB via ssl-enabled tcp socket: real 2.142s	user 2.219s	sys 1.592s
I20260924 10:35:48.232983  2717 rpc-test.cc:1859] Sending 1024MB via ssl-enabled tcp socket: real 2.209s	user 2.340s	sys 1.602s
I20260924 10:35:50.284832  2717 rpc-test.cc:1859] Sending 1024MB via ssl-enabled tcp socket: real 2.052s	user 2.088s	sys 1.567s
I20260924 10:35:52.427004  2717 rpc-test.cc:1859] Sending 1024MB via ssl-enabled tcp socket: real 2.142s	user 2.157s	sys 1.622s
I20260924 10:35:54.622459  2717 rpc-test.cc:1859] Sending 1024MB via ssl-enabled tcp socket: real 2.195s	user 2.323s	sys 1.574s
[       OK ] Parameters/TestRpc.TestPerformanceBySocketType/SSL_TCP (10795 ms)
[----------] 20 tests from Parameters/TestRpc (36613 ms total)

[----------] 1 test from Parameters/TestRpcSocketTxRxQueue
[ RUN      ] Parameters/TestRpcSocketTxRxQueue.OverCapacity/0
W20260924 10:35:54.894320  3200 negotiation.cc:337] Failed RPC negotiation. Trace:
0924 10:35:54.628280 (+     0us) reactor.cc:625] Submitting negotiation task for client connection to 0.0.0.0:36255 (local address 127.0.0.1:44148)
0924 10:35:54.628416 (+   136us) negotiation.cc:107] Waiting for socket to connect
0924 10:35:54.628431 (+    15us) client_negotiation.cc:174] Beginning negotiation
0924 10:35:54.628533 (+   102us) client_negotiation.cc:252] Sending NEGOTIATE NegotiatePB request
0924 10:35:54.894229 (+265696us) negotiation.cc:327] Negotiation complete: Network error: Client connection negotiation failed: client connection to 0.0.0.0:36255: BlockingRecv error: recv error from unknown peer: Transport endpoint is not connected (error 107)
Metrics: {"client-negotiator.queue_time_us":67}
W20260924 10:35:54.894343  3209 negotiation.cc:337] Failed RPC negotiation. Trace:
0924 10:35:54.629487 (+     0us) reactor.cc:625] Submitting negotiation task for client connection to 0.0.0.0:36255 (local address 127.0.0.1:44154)
0924 10:35:54.629619 (+   132us) negotiation.cc:107] Waiting for socket to connect
0924 10:35:54.629634 (+    15us) client_negotiation.cc:174] Beginning negotiation
0924 10:35:54.629712 (+    78us) client_negotiation.cc:252] Sending NEGOTIATE NegotiatePB request
0924 10:35:54.894196 (+264484us) negotiation.cc:327] Negotiation complete: Network error: Client connection negotiation failed: client connection to 0.0.0.0:36255: BlockingRecv error: recv error from unknown peer: Transport endpoint is not connected (error 107)
Metrics: {"client-negotiator.queue_time_us":64}
W20260924 10:35:54.894613  3218 negotiation.cc:337] Failed RPC negotiation. Trace:
0924 10:35:54.630606 (+     0us) reactor.cc:625] Submitting negotiation task for client connection to 0.0.0.0:36255 (local address 127.0.0.1:44170)
0924 10:35:54.630717 (+   111us) negotiation.cc:107] Waiting for socket to connect
0924 10:35:54.630729 (+    12us) client_negotiation.cc:174] Beginning negotiation
0924 10:35:54.630800 (+    71us) client_negotiation.cc:252] Sending NEGOTIATE NegotiatePB request
0924 10:35:54.894451 (+263651us) negotiation.cc:327] Negotiation complete: Network error: Client connection negotiation failed: client connection to 0.0.0.0:36255: BlockingRecv error: recv error from unknown peer: Transport endpoint is not connected (error 107)
Metrics: {"client-negotiator.queue_time_us":24}
W20260924 10:35:54.894626  3236 negotiation.cc:337] Failed RPC negotiation. Trace:
0924 10:35:54.632855 (+     0us) reactor.cc:625] Submitting negotiation task for client connection to 0.0.0.0:36255 (local address 127.0.0.1:44188)
0924 10:35:54.632998 (+   143us) negotiation.cc:107] Waiting for socket to connect
0924 10:35:54.633010 (+    12us) client_negotiation.cc:174] Beginning negotiation
0924 10:35:54.633086 (+    76us) client_negotiation.cc:252] Sending NEGOTIATE NegotiatePB request
0924 10:35:54.894562 (+261476us) negotiation.cc:327] Negotiation complete: Network error: Client connection negotiation failed: client connection to 0.0.0.0:36255: BlockingRecv error: recv error from unknown peer: Transport endpoint is not connected (error 107)
Metrics: {"client-negotiator.queue_time_us":57}
W20260924 10:35:54.894814  3227 negotiation.cc:337] Failed RPC negotiation. Trace:
0924 10:35:54.631756 (+     0us) reactor.cc:625] Submitting negotiation task for client connection to 0.0.0.0:36255 (local address 127.0.0.1:44180)
0924 10:35:54.631858 (+   102us) negotiation.cc:107] Waiting for socket to connect
0924 10:35:54.631872 (+    14us) client_negotiation.cc:174] Beginning negotiation
0924 10:35:54.631945 (+    73us) client_negotiation.cc:252] Sending NEGOTIATE NegotiatePB request
0924 10:35:54.894739 (+262794us) negotiation.cc:327] Negotiation complete: Network error: Client connection negotiation failed: client connection to 0.0.0.0:36255: BlockingRecv error: recv error from unknown peer: Transport endpoint is not connected (error 107)
Metrics: {"client-negotiator.queue_time_us":26}
W20260924 10:35:54.894343  3191 negotiation.cc:337] Failed RPC negotiation. Trace:
0924 10:35:54.626948 (+     0us) reactor.cc:625] Submitting negotiation task for client connection to 0.0.0.0:36255 (local address 127.0.0.1:44132)
0924 10:35:54.627044 (+    96us) negotiation.cc:107] Waiting for socket to connect
0924 10:35:54.627059 (+    15us) client_negotiation.cc:174] Beginning negotiation
0924 10:35:54.627173 (+   114us) client_negotiation.cc:252] Sending NEGOTIATE NegotiatePB request
0924 10:35:54.894196 (+267023us) negotiation.cc:327] Negotiation complete: Network error: Client connection negotiation failed: client connection to 0.0.0.0:36255: BlockingRecv error: recv error from unknown peer: Transport endpoint is not connected (error 107)
Metrics: {"client-negotiator.queue_time_us":25}
[       OK ] Parameters/TestRpcSocketTxRxQueue.OverCapacity/0 (1049 ms)
[----------] 1 test from Parameters/TestRpcSocketTxRxQueue (1049 ms total)

[----------] Global test environment tear-down
[==========] 21 tests from 2 test suites ran. (37663 ms total)
[  PASSED  ] 20 tests.
[  FAILED  ] 1 test, listed below:
[  FAILED  ] Parameters/TestRpc.TestCallWithChainCertAndChainCA/SSL_TCP, where GetParam() = (true, false)

 1 FAILED TEST