Diagnosed failure
Parameters/TestRpc.TestCallWithChainCertAndChainCA/SSL_TCP: /data0/somelongdirectorytoavoidrpathissues/src/kudu/src/kudu/rpc/rpc-test.cc:270: Failure
Failed
Bad status: Runtime error: could not verify certificate chain (error with cert: subject=CN = localhost, ST = sadfjas, C = AS, emailAddress = sdflkdsajf, O = lskdfjlsad, OU = sldfkja, issuer=C = AS, ST = ASDfkjdhf, L = lskdjf, O = saldfja, OU = skdjf, CN = localhost, emailAddress = sadjflkadsj): : certificate has expired
Google Test trace:
/data0/somelongdirectorytoavoidrpathissues/src/kudu/src/kudu/rpc/rpc-test.cc:267: Connecting to 0.0.0.0:41459
I20260926 07:26:46.035094 2003 test_util.cc:175] -----------------------------------------------
I20260926 07:26:46.035167 2003 test_util.cc:176] Had fatal failures, leaving test files at /tmp/dist-test-task1abcdE/test-tmp/rpc-test.5.Parameters_TestRpc.TestCallWithChainCertAndChainCA_SSL_TCP.1790407605906921-2003-0
Full log
Note: This is test shard 6 of 8.
[==========] Running 21 tests from 2 test suites.
[----------] Global test environment set-up.
[----------] 20 tests from Parameters/TestRpc
[ RUN ] Parameters/TestRpc.TestMessengerCreateDestroy/SSL_TCP
WARNING: Logging before InitGoogleLogging() is written to STDERR
I20260926 07:26:45.966002 2003 rpc-test.cc:169] started messenger TestCreateDestroy
[ OK ] Parameters/TestRpc.TestMessengerCreateDestroy/SSL_TCP (53 ms)
[ RUN ] Parameters/TestRpc.TestNegotiationDeadlock/SSL_TCP
I20260926 07:26:45.987947 2024 acceptor_pool.cc:254] collecting diagnostics on the listening RPC socket 0.0.0.0:45929 every 8 connection(s)
I20260926 07:26:45.987947 2023 acceptor_pool.cc:254] collecting diagnostics on the listening RPC socket 0.0.0.0:45929 every 8 connection(s)
[ OK ] Parameters/TestRpc.TestNegotiationDeadlock/SSL_TCP (32 ms)
[ RUN ] Parameters/TestRpc.TestCallWithChainCertAndChainCA/SSL_TCP
I20260926 07:26:46.028877 2039 acceptor_pool.cc:254] collecting diagnostics on the listening RPC socket 0.0.0.0:41459 every 8 connection(s)
I20260926 07:26:46.028887 2040 acceptor_pool.cc:254] collecting diagnostics on the listening RPC socket 0.0.0.0:41459 every 8 connection(s)
/data0/somelongdirectorytoavoidrpathissues/src/kudu/src/kudu/rpc/rpc-test.cc:270: Failure
Failed
Bad status: Runtime error: could not verify certificate chain (error with cert: subject=CN = localhost, ST = sadfjas, C = AS, emailAddress = sdflkdsajf, O = lskdfjlsad, OU = sldfkja, issuer=C = AS, ST = ASDfkjdhf, L = lskdjf, O = saldfja, OU = skdjf, CN = localhost, emailAddress = sadjflkadsj): : certificate has expired
Google Test trace:
/data0/somelongdirectorytoavoidrpathissues/src/kudu/src/kudu/rpc/rpc-test.cc:267: Connecting to 0.0.0.0:41459
I20260926 07:26:46.035094 2003 test_util.cc:175] -----------------------------------------------
I20260926 07:26:46.035167 2003 test_util.cc:176] Had fatal failures, leaving test files at /tmp/dist-test-task1abcdE/test-tmp/rpc-test.5.Parameters_TestRpc.TestCallWithChainCertAndChainCA_SSL_TCP.1790407605906921-2003-0
[ FAILED ] Parameters/TestRpc.TestCallWithChainCertAndChainCA/SSL_TCP, where GetParam() = (true, false) (34 ms)
[ RUN ] Parameters/TestRpc.TestCallWithPasswordProtectedKey/SSL_TCP
I20260926 07:26:46.045624 2064 acceptor_pool.cc:254] collecting diagnostics on the listening RPC socket 0.0.0.0:42145 every 8 connection(s)
I20260926 07:26:46.045747 2065 acceptor_pool.cc:254] collecting diagnostics on the listening RPC socket 0.0.0.0:42145 every 8 connection(s)
[ OK ] Parameters/TestRpc.TestCallWithPasswordProtectedKey/SSL_TCP (27 ms)
[ RUN ] Parameters/TestRpc.TestCallToBadServer/SSL_TCP
I20260926 07:26:46.071585 2003 rpc-test.cc:394] Status: Network error: Client connection negotiation failed: client connection to 0.0.0.0:0: connect: Connection refused (error 111)
I20260926 07:26:46.072175 2003 rpc-test.cc:394] Status: Network error: Client connection negotiation failed: client connection to 0.0.0.0:0: connect: Connection refused (error 111)
I20260926 07:26:46.072829 2003 rpc-test.cc:394] Status: Network error: Client connection negotiation failed: client connection to 0.0.0.0:0: connect: Connection refused (error 111)
I20260926 07:26:46.073371 2003 rpc-test.cc:394] Status: Network error: Client connection negotiation failed: client connection to 0.0.0.0:0: connect: Connection refused (error 111)
I20260926 07:26:46.073890 2003 rpc-test.cc:394] Status: Network error: Client connection negotiation failed: client connection to 0.0.0.0:0: connect: Connection refused (error 111)
[ OK ] Parameters/TestRpc.TestCallToBadServer/SSL_TCP (11 ms)
[ RUN ] Parameters/TestRpc.TestWrongService/SSL_TCP
I20260926 07:26:46.094856 2099 acceptor_pool.cc:254] collecting diagnostics on the listening RPC socket 0.0.0.0:36329 every 8 connection(s)
I20260926 07:26:46.094893 2100 acceptor_pool.cc:254] collecting diagnostics on the listening RPC socket 0.0.0.0:36329 every 8 connection(s)
I20260926 07:26:46.116912 2098 messenger.cc:345] service WrongServiceName not registered on TestServer
[ OK ] Parameters/TestRpc.TestWrongService/SSL_TCP (44 ms)
[ RUN ] Parameters/TestRpc.TestConnectionKeepalive/SSL_TCP
I20260926 07:26:46.142475 2122 acceptor_pool.cc:254] collecting diagnostics on the listening RPC socket 0.0.0.0:40815 every 8 connection(s)
I20260926 07:26:46.142510 2123 acceptor_pool.cc:254] collecting diagnostics on the listening RPC socket 0.0.0.0:40815 every 8 connection(s)
I20260926 07:26:46.142869 2003 rpc-test.cc:488] Connecting to 0.0.0.0:40815
[ OK ] Parameters/TestRpc.TestConnectionKeepalive/SSL_TCP (1047 ms)
[ RUN ] Parameters/TestRpc.TestClientConnectionMetrics/SSL_TCP
I20260926 07:26:47.182884 2147 acceptor_pool.cc:254] collecting diagnostics on the listening RPC socket 0.0.0.0:41275 every 8 connection(s)
I20260926 07:26:47.183048 2148 acceptor_pool.cc:254] collecting diagnostics on the listening RPC socket 0.0.0.0:41275 every 8 connection(s)
I20260926 07:26:47.183346 2003 rpc-test.cc:569] Connecting to 0.0.0.0:41275
[ OK ] Parameters/TestRpc.TestClientConnectionMetrics/SSL_TCP (15636 ms)
[ RUN ] Parameters/TestRpc.TestCredentialsPolicy/SSL_TCP
I20260926 07:27:02.822996 2170 acceptor_pool.cc:254] collecting diagnostics on the listening RPC socket 0.0.0.0:44281 every 8 connection(s)
I20260926 07:27:02.823045 2171 acceptor_pool.cc:254] collecting diagnostics on the listening RPC socket 0.0.0.0:44281 every 8 connection(s)
I20260926 07:27:02.823529 2003 rpc-test.cc:700] Connecting to 0.0.0.0:44281
[ OK ] Parameters/TestRpc.TestCredentialsPolicy/SSL_TCP (59 ms)
[ RUN ] Parameters/TestRpc.TestCallLongerThanKeepalive/SSL_TCP
I20260926 07:27:02.878875 2195 acceptor_pool.cc:254] collecting diagnostics on the listening RPC socket 0.0.0.0:33755 every 8 connection(s)
I20260926 07:27:02.878906 2196 acceptor_pool.cc:254] collecting diagnostics on the listening RPC socket 0.0.0.0:33755 every 8 connection(s)
I20260926 07:27:02.907177 2199 rpc-test-base.h:222] got call: sleep_micros: 3000000 deferred: true
I20260926 07:27:05.908157 2199 rpcz_store.cc:275] Call kudu.rpc.GenericCalculatorService.Sleep from 127.0.0.1:44176 (request call id 0) took 3001 ms. Trace:
I20260926 07:27:05.908291 2199 rpcz_store.cc:276] 0926 07:27:02.906988 (+ 0us) service_pool.cc:170] Inserting onto call queue
0926 07:27:02.907142 (+ 154us) service_pool.cc:227] Handling call
0926 07:27:05.908135 (+3000993us) inbound_call.cc:173] Queueing success response
Metrics: {}
[ OK ] Parameters/TestRpc.TestCallLongerThanKeepalive/SSL_TCP (3049 ms)
[ RUN ] Parameters/TestRpc.TestRpcSidecar/SSL_TCP
I20260926 07:27:05.929895 2220 acceptor_pool.cc:254] collecting diagnostics on the listening RPC socket 0.0.0.0:35209 every 8 connection(s)
I20260926 07:27:05.930157 2221 acceptor_pool.cc:254] collecting diagnostics on the listening RPC socket 0.0.0.0:35209 every 8 connection(s)
[ OK ] Parameters/TestRpc.TestRpcSidecar/SSL_TCP (115 ms)
[ RUN ] Parameters/TestRpc.TestRpcSidecarLimits/SSL_TCP
I20260926 07:27:07.786933 2245 acceptor_pool.cc:254] collecting diagnostics on the listening RPC socket 0.0.0.0:39501 every 8 connection(s)
I20260926 07:27:07.786958 2246 acceptor_pool.cc:254] collecting diagnostics on the listening RPC socket 0.0.0.0:39501 every 8 connection(s)
W20260926 07:27:07.820169 2003 serialization.cc:72] Serialized kudu.rpc_test.PushStringsRequestPB (2147483654 bytes) is larger than the maximum configured RPC message size (52428800 bytes). Sending anyway, but peer may reject the data.
W20260926 07:27:07.824796 2242 connection.cc:535] server connection from 127.0.0.1:43312 recv error: Network error: RPC frame had a length of 2147483714, but we only support messages up to 52428800 bytes long.
W20260926 07:27:07.824903 2242 connection.cc:158] shutting down server connection from 127.0.0.1:43312 with pending inbound data: 4/2147483714 bytes received; last active 0 ns ago: status Network error: RPC frame had a length of 2147483714, but we only support messages up to 52428800 bytes long.
W20260926 07:27:07.825218 2258 connection.cc:196] Error closing socket: Network error: TlsSocket::Close: Connection reset by peer
I20260926 07:27:07.847700 2270 acceptor_pool.cc:254] collecting diagnostics on the listening RPC socket 0.0.0.0:44133 every 8 connection(s)
I20260926 07:27:07.847718 2271 acceptor_pool.cc:254] collecting diagnostics on the listening RPC socket 0.0.0.0:44133 every 8 connection(s)
W20260926 07:27:12.119109 2269 connection.cc:577] server connection from 127.0.0.1:60668: received bad data: 'Corruption: Invalid packet: message had a length of 2147483710, but we only support messages up to 2147483647 bytes
'
[ OK ] Parameters/TestRpc.TestRpcSidecarLimits/SSL_TCP (6095 ms)
[ RUN ] Parameters/TestRpc.TestCallTimeoutDoesntAffectNegotiation/SSL_TCP
I20260926 07:27:12.142189 2296 acceptor_pool.cc:254] collecting diagnostics on the listening RPC socket 0.0.0.0:46673 every 8 connection(s)
I20260926 07:27:12.142160 2295 acceptor_pool.cc:254] collecting diagnostics on the listening RPC socket 0.0.0.0:46673 every 8 connection(s)
W20260926 07:27:12.156685 2291 negotiation.cc:266] Injecting 500ms delay in negotiation
I20260926 07:27:12.207098 2003 rpc-test-base.h:595] status: Timed out: connection negotiation to 0.0.0.0:46673 for RPC Sleep timed out after 0.050s (ON_OUTBOUND_QUEUE), seconds elapsed: 0.0509764
[ OK ] Parameters/TestRpc.TestCallTimeoutDoesntAffectNegotiation/SSL_TCP (541 ms)
[ RUN ] Parameters/TestRpc.TestRpcHandlerLatencyMetric/SSL_TCP
I20260926 07:27:12.674727 2320 acceptor_pool.cc:254] collecting diagnostics on the listening RPC socket 0.0.0.0:46215 every 8 connection(s)
I20260926 07:27:12.674896 2321 acceptor_pool.cc:254] collecting diagnostics on the listening RPC socket 0.0.0.0:46215 every 8 connection(s)
I20260926 07:27:12.713948 2003 rpc-test.cc:1236] Sleep() min lat: 20495
I20260926 07:27:12.714028 2003 rpc-test.cc:1237] Sleep() mean lat: 20495
I20260926 07:27:12.714057 2003 rpc-test.cc:1238] Sleep() max lat: 20495
I20260926 07:27:12.714071 2003 rpc-test.cc:1239] Sleep() #calls: 1
[ OK ] Parameters/TestRpc.TestRpcHandlerLatencyMetric/SSL_TCP (51 ms)
[ RUN ] Parameters/TestRpc.TimedOutOnResponseMetricServiceQueue/SSL_TCP
I20260926 07:27:12.743669 2346 acceptor_pool.cc:254] collecting diagnostics on the listening RPC socket 0.0.0.0:40943 every 8 connection(s)
I20260926 07:27:12.743693 2347 acceptor_pool.cc:254] collecting diagnostics on the listening RPC socket 0.0.0.0:40943 every 8 connection(s)
W20260926 07:27:12.830911 2348 rpcz_store.cc:267] Call kudu.rpc_test.CalculatorService.Sleep from 127.0.0.1:57396 (request call id 2) took 20 ms (client timeout 20 ms). Trace:
W20260926 07:27:12.831032 2348 rpcz_store.cc:269] 0926 07:27:12.810466 (+ 0us) service_pool.cc:170] Inserting onto call queue
0926 07:27:12.830851 (+ 20385us) service_pool.cc:214] Skipping call since client already timed out
0926 07:27:12.830888 (+ 37us) inbound_call.cc:173] Queueing failure response
Metrics: {}
[ OK ] Parameters/TestRpc.TimedOutOnResponseMetricServiceQueue/SSL_TCP (116 ms)
[ RUN ] Parameters/TestRpc.RpcPendingConnectionsMetric/SSL_TCP
I20260926 07:27:12.836028 2369 acceptor_pool.cc:254] collecting diagnostics on the listening RPC socket 0.0.0.0:35395 every 8 connection(s)
I20260926 07:27:12.836098 2370 acceptor_pool.cc:254] collecting diagnostics on the listening RPC socket 0.0.0.0:35395 every 8 connection(s)
W20260926 07:27:12.837411 2364 negotiation.cc:337] Failed RPC negotiation. Trace:
0926 07:27:12.836880 (+ 0us) reactor.cc:625] Submitting negotiation task for server connection from 127.0.0.1:41156 (local address 127.0.0.1:35395)
0926 07:27:12.837015 (+ 135us) server_negotiation.cc:206] Beginning negotiation
0926 07:27:12.837019 (+ 4us) server_negotiation.cc:399] Waiting for connection header
0926 07:27:12.837203 (+ 184us) negotiation.cc:327] Negotiation complete: Network error: Server connection negotiation failed: server connection from 127.0.0.1:41156: BlockingRecv error: recv got EOF from 127.0.0.1:41156 (error 108)
Metrics: {"server-negotiator.queue_time_us":54}
[ OK ] Parameters/TestRpc.RpcPendingConnectionsMetric/SSL_TCP (15 ms)
[ RUN ] Parameters/TestRpc.TestRpcContextClientDeadline/SSL_TCP
I20260926 07:27:12.878911 2386 acceptor_pool.cc:254] collecting diagnostics on the listening RPC socket 0.0.0.0:39939 every 8 connection(s)
I20260926 07:27:12.878908 2385 acceptor_pool.cc:254] collecting diagnostics on the listening RPC socket 0.0.0.0:39939 every 8 connection(s)
[ OK ] Parameters/TestRpc.TestRpcContextClientDeadline/SSL_TCP (72 ms)
[ RUN ] Parameters/TestRpc.TestApplicationFeatureFlagUnsupportedServer/SSL_TCP
I20260926 07:27:12.937206 2410 acceptor_pool.cc:254] collecting diagnostics on the listening RPC socket 0.0.0.0:36707 every 8 connection(s)
I20260926 07:27:12.937305 2411 acceptor_pool.cc:254] collecting diagnostics on the listening RPC socket 0.0.0.0:36707 every 8 connection(s)
[ OK ] Parameters/TestRpc.TestApplicationFeatureFlagUnsupportedServer/SSL_TCP (34 ms)
[ RUN ] Parameters/TestRpc.TestCancellationAsync/SSL_TCP
I20260926 07:27:12.967062 2435 acceptor_pool.cc:254] collecting diagnostics on the listening RPC socket 0.0.0.0:38121 every 8 connection(s)
I20260926 07:27:12.967085 2436 acceptor_pool.cc:254] collecting diagnostics on the listening RPC socket 0.0.0.0:38121 every 8 connection(s)
I20260926 07:27:12.967425 2003 rpc-test.cc:1716] Connecting to 0.0.0.0:38121
I20260926 07:27:12.977924 2003 test_util.cc:268] Using random seed: -1023967231
I20260926 07:27:12.997915 2439 rpc-test-base.h:240] got call: sleep_micros: 500 pattern: 4294967295 num_repetitions: 2097152 sidecar_idx: 0
I20260926 07:27:13.016304 2438 rpc-test-base.h:240] got call: sleep_micros: 500 pattern: 4294967295 num_repetitions: 2097152 sidecar_idx: 0
I20260926 07:27:13.033975 2439 rpc-test-base.h:240] got call: sleep_micros: 500 pattern: 4294967295 num_repetitions: 2097152 sidecar_idx: 0
I20260926 07:27:13.054791 2438 rpc-test-base.h:240] got call: sleep_micros: 500 pattern: 4294967295 num_repetitions: 2097152 sidecar_idx: 0
I20260926 07:27:13.075403 2439 rpc-test-base.h:240] got call: sleep_micros: 500 pattern: 4294967295 num_repetitions: 2097152 sidecar_idx: 0
I20260926 07:27:13.095512 2438 rpc-test-base.h:240] got call: sleep_micros: 500 pattern: 4294967295 num_repetitions: 2097152 sidecar_idx: 0
I20260926 07:27:13.117938 2439 rpc-test-base.h:240] got call: sleep_micros: 500 pattern: 4294967295 num_repetitions: 2097152 sidecar_idx: 0
I20260926 07:27:13.138446 2438 rpc-test-base.h:240] got call: sleep_micros: 500 pattern: 4294967295 num_repetitions: 2097152 sidecar_idx: 0
W20260926 07:27:13.145082 2434 connection.cc:441] server connection from 127.0.0.1:37158 torn down before Call kudu.rpc.GenericCalculatorService.SleepWithSidecar from 127.0.0.1:37158 (request call id 8) could send its response
W20260926 07:27:13.157903 2434 connection.cc:441] server connection from 127.0.0.1:37158 torn down before Call kudu.rpc.GenericCalculatorService.SleepWithSidecar from 127.0.0.1:37158 (request call id 9) could send its response
[ OK ] Parameters/TestRpc.TestCancellationAsync/SSL_TCP (203 ms)
[ RUN ] Parameters/TestRpc.TestPerformanceBySocketType/SSL_TCP
I20260926 07:27:13.171613 2460 acceptor_pool.cc:254] collecting diagnostics on the listening RPC socket 0.0.0.0:35143 every 8 connection(s)
I20260926 07:27:13.171622 2461 acceptor_pool.cc:254] collecting diagnostics on the listening RPC socket 0.0.0.0:35143 every 8 connection(s)
I20260926 07:27:13.171983 2003 rpc-test.cc:1846] Connecting to 0.0.0.0:35143
I20260926 07:27:15.512789 2003 rpc-test.cc:1859] Sending 1024MB via ssl-enabled tcp socket: real 2.334s user 2.417s sys 1.676s
I20260926 07:27:17.927773 2003 rpc-test.cc:1859] Sending 1024MB via ssl-enabled tcp socket: real 2.415s user 2.633s sys 1.626s
I20260926 07:27:20.309134 2003 rpc-test.cc:1859] Sending 1024MB via ssl-enabled tcp socket: real 2.381s user 2.512s sys 1.662s
I20260926 07:27:22.659126 2003 rpc-test.cc:1859] Sending 1024MB via ssl-enabled tcp socket: real 2.350s user 2.469s sys 1.631s
I20260926 07:27:24.982762 2003 rpc-test.cc:1859] Sending 1024MB via ssl-enabled tcp socket: real 2.324s user 2.519s sys 1.560s
[ OK ] Parameters/TestRpc.TestPerformanceBySocketType/SSL_TCP (11825 ms)
[----------] 20 tests from Parameters/TestRpc (39071 ms total)
[----------] 1 test from Parameters/TestRpcSocketTxRxQueue
[ RUN ] Parameters/TestRpcSocketTxRxQueue.OverCapacity/0
W20260926 07:27:25.260396 2486 negotiation.cc:337] Failed RPC negotiation. Trace:
0926 07:27:24.989431 (+ 0us) reactor.cc:625] Submitting negotiation task for client connection to 0.0.0.0:45413 (local address 127.0.0.1:35574)
0926 07:27:24.989549 (+ 118us) negotiation.cc:107] Waiting for socket to connect
0926 07:27:24.989562 (+ 13us) client_negotiation.cc:174] Beginning negotiation
0926 07:27:24.989642 (+ 80us) client_negotiation.cc:252] Sending NEGOTIATE NegotiatePB request
0926 07:27:25.260240 (+270598us) negotiation.cc:327] Negotiation complete: Network error: Client connection negotiation failed: client connection to 0.0.0.0:45413: BlockingRecv error: recv error from unknown peer: Transport endpoint is not connected (error 107)
Metrics: {"client-negotiator.queue_time_us":49}
W20260926 07:27:25.260531 2504 negotiation.cc:337] Failed RPC negotiation. Trace:
0926 07:27:24.992242 (+ 0us) reactor.cc:625] Submitting negotiation task for client connection to 0.0.0.0:45413 (local address 127.0.0.1:35592)
0926 07:27:24.992366 (+ 124us) negotiation.cc:107] Waiting for socket to connect
0926 07:27:24.992384 (+ 18us) client_negotiation.cc:174] Beginning negotiation
0926 07:27:24.992480 (+ 96us) client_negotiation.cc:252] Sending NEGOTIATE NegotiatePB request
0926 07:27:25.260239 (+267759us) negotiation.cc:327] Negotiation complete: Network error: Client connection negotiation failed: client connection to 0.0.0.0:45413: BlockingRecv error: recv error from unknown peer: Transport endpoint is not connected (error 107)
Metrics: {"client-negotiator.queue_time_us":29}
W20260926 07:27:25.260396 2477 negotiation.cc:337] Failed RPC negotiation. Trace:
0926 07:27:24.988082 (+ 0us) reactor.cc:625] Submitting negotiation task for client connection to 0.0.0.0:45413 (local address 127.0.0.1:35560)
0926 07:27:24.988196 (+ 114us) negotiation.cc:107] Waiting for socket to connect
0926 07:27:24.988210 (+ 14us) client_negotiation.cc:174] Beginning negotiation
0926 07:27:24.988309 (+ 99us) client_negotiation.cc:252] Sending NEGOTIATE NegotiatePB request
0926 07:27:25.260240 (+271931us) negotiation.cc:327] Negotiation complete: Network error: Client connection negotiation failed: client connection to 0.0.0.0:45413: BlockingRecv error: recv error from unknown peer: Transport endpoint is not connected (error 107)
Metrics: {"client-negotiator.queue_time_us":46}
W20260926 07:27:25.260735 2513 negotiation.cc:337] Failed RPC negotiation. Trace:
0926 07:27:24.993535 (+ 0us) reactor.cc:625] Submitting negotiation task for client connection to 0.0.0.0:45413 (local address 127.0.0.1:35608)
0926 07:27:24.993805 (+ 270us) negotiation.cc:107] Waiting for socket to connect
0926 07:27:24.993820 (+ 15us) client_negotiation.cc:174] Beginning negotiation
0926 07:27:24.993918 (+ 98us) client_negotiation.cc:252] Sending NEGOTIATE NegotiatePB request
0926 07:27:25.260413 (+266495us) negotiation.cc:327] Negotiation complete: Network error: Client connection negotiation failed: client connection to 0.0.0.0:45413: BlockingRecv error: recv error from unknown peer: Transport endpoint is not connected (error 107)
Metrics: {"client-negotiator.queue_time_us":151}
W20260926 07:27:25.260421 2495 negotiation.cc:337] Failed RPC negotiation. Trace:
0926 07:27:24.990763 (+ 0us) reactor.cc:625] Submitting negotiation task for client connection to 0.0.0.0:45413 (local address 127.0.0.1:35576)
0926 07:27:24.990885 (+ 122us) negotiation.cc:107] Waiting for socket to connect
0926 07:27:24.990898 (+ 13us) client_negotiation.cc:174] Beginning negotiation
0926 07:27:24.990979 (+ 81us) client_negotiation.cc:252] Sending NEGOTIATE NegotiatePB request
0926 07:27:25.260239 (+269260us) negotiation.cc:327] Negotiation complete: Network error: Client connection negotiation failed: client connection to 0.0.0.0:45413: BlockingRecv error: recv error from unknown peer: Transport endpoint is not connected (error 107)
Metrics: {"client-negotiator.queue_time_us":52}
W20260926 07:27:25.261047 2522 negotiation.cc:337] Failed RPC negotiation. Trace:
0926 07:27:24.994897 (+ 0us) reactor.cc:625] Submitting negotiation task for client connection to 0.0.0.0:45413 (local address 127.0.0.1:35614)
0926 07:27:24.995022 (+ 125us) negotiation.cc:107] Waiting for socket to connect
0926 07:27:24.995034 (+ 12us) client_negotiation.cc:174] Beginning negotiation
0926 07:27:24.995102 (+ 68us) client_negotiation.cc:252] Sending NEGOTIATE NegotiatePB request
0926 07:27:25.260552 (+265450us) negotiation.cc:327] Negotiation complete: Network error: Client connection negotiation failed: client connection to 0.0.0.0:45413: BlockingRecv error: recv error from unknown peer: Transport endpoint is not connected (error 107)
Metrics: {"client-negotiator.queue_time_us":59}
[ OK ] Parameters/TestRpcSocketTxRxQueue.OverCapacity/0 (1043 ms)
[----------] 1 test from Parameters/TestRpcSocketTxRxQueue (1043 ms total)
[----------] Global test environment tear-down
[==========] 21 tests from 2 test suites ran. (40114 ms total)
[ PASSED ] 20 tests.
[ FAILED ] 1 test, listed below:
[ FAILED ] Parameters/TestRpc.TestCallWithChainCertAndChainCA/SSL_TCP, where GetParam() = (true, false)
1 FAILED TEST