Diagnosed failure

Parameters/TestRpc.TestCallWithChainCertAndChainCA/SSL_UnixSocket: /data0/somelongdirectorytoavoidrpathissues/src/kudu/src/kudu/rpc/rpc-test.cc:270: Failure
Failed
Bad status: Runtime error: could not verify certificate chain (error with cert: subject=CN = localhost, ST = sadfjas, C = AS, emailAddress = sdflkdsajf, O = lskdfjlsad, OU = sldfkja, issuer=C = AS, ST = ASDfkjdhf, L = lskdjf, O = saldfja, OU = skdjf, CN = localhost, emailAddress = sadjflkadsj): : certificate has expired
Google Test trace:
/data0/somelongdirectorytoavoidrpathissues/src/kudu/src/kudu/rpc/rpc-test.cc:267: Connecting to unix:/tmp/dist-test-taskN_3cm1/test-tmp/rpc-test-bf0c5abd5181478cb0e7b70563589216.sock
I20260927 06:56:44.367987 12102 test_util.cc:175] -----------------------------------------------
I20260927 06:56:44.368093 12102 test_util.cc:176] Had fatal failures, leaving test files at /tmp/dist-test-taskN_3cm1/test-tmp/rpc-test.6.Parameters_TestRpc.TestCallWithChainCertAndChainCA_SSL_UnixSocket.1790492204266246-12102-0

Full log

Note: This is test shard 7 of 8.
[==========] Running 21 tests from 2 test suites.
[----------] Global test environment set-up.
[----------] 20 tests from Parameters/TestRpc
[ RUN      ] Parameters/TestRpc.TestMessengerCreateDestroy/SSL_UnixSocket
WARNING: Logging before InitGoogleLogging() is written to STDERR
I20260927 06:56:44.314320 12102 rpc-test.cc:169] started messenger TestCreateDestroy
[       OK ] Parameters/TestRpc.TestMessengerCreateDestroy/SSL_UnixSocket (31 ms)
[ RUN      ] Parameters/TestRpc.TestNegotiationDeadlock/SSL_UnixSocket
I20260927 06:56:44.326372 12122 acceptor_pool.cc:254] collecting diagnostics on the listening RPC socket unix:/tmp/dist-test-taskN_3cm1/test-tmp/rpc-test-4205ffa110c84d579afcad5e83ea9c17.sock every 8 connection(s)
I20260927 06:56:44.326695 12123 acceptor_pool.cc:254] collecting diagnostics on the listening RPC socket unix:/tmp/dist-test-taskN_3cm1/test-tmp/rpc-test-4205ffa110c84d579afcad5e83ea9c17.sock every 8 connection(s)
[       OK ] Parameters/TestRpc.TestNegotiationDeadlock/SSL_UnixSocket (27 ms)
[ RUN      ] Parameters/TestRpc.TestCallWithChainCertAndChainCA/SSL_UnixSocket
I20260927 06:56:44.356896 12138 acceptor_pool.cc:254] collecting diagnostics on the listening RPC socket unix:/tmp/dist-test-taskN_3cm1/test-tmp/rpc-test-bf0c5abd5181478cb0e7b70563589216.sock every 8 connection(s)
I20260927 06:56:44.357260 12139 acceptor_pool.cc:254] collecting diagnostics on the listening RPC socket unix:/tmp/dist-test-taskN_3cm1/test-tmp/rpc-test-bf0c5abd5181478cb0e7b70563589216.sock every 8 connection(s)
/data0/somelongdirectorytoavoidrpathissues/src/kudu/src/kudu/rpc/rpc-test.cc:270: Failure
Failed
Bad status: Runtime error: could not verify certificate chain (error with cert: subject=CN = localhost, ST = sadfjas, C = AS, emailAddress = sdflkdsajf, O = lskdfjlsad, OU = sldfkja, issuer=C = AS, ST = ASDfkjdhf, L = lskdjf, O = saldfja, OU = skdjf, CN = localhost, emailAddress = sadjflkadsj): : certificate has expired
Google Test trace:
/data0/somelongdirectorytoavoidrpathissues/src/kudu/src/kudu/rpc/rpc-test.cc:267: Connecting to unix:/tmp/dist-test-taskN_3cm1/test-tmp/rpc-test-bf0c5abd5181478cb0e7b70563589216.sock
I20260927 06:56:44.367987 12102 test_util.cc:175] -----------------------------------------------
I20260927 06:56:44.368093 12102 test_util.cc:176] Had fatal failures, leaving test files at /tmp/dist-test-taskN_3cm1/test-tmp/rpc-test.6.Parameters_TestRpc.TestCallWithChainCertAndChainCA_SSL_UnixSocket.1790492204266246-12102-0
[  FAILED  ] Parameters/TestRpc.TestCallWithChainCertAndChainCA/SSL_UnixSocket, where GetParam() = (true, true) (23 ms)
[ RUN      ] Parameters/TestRpc.TestCallWithPasswordProtectedKey/SSL_UnixSocket
I20260927 06:56:44.378638 12163 acceptor_pool.cc:254] collecting diagnostics on the listening RPC socket unix:/tmp/dist-test-taskN_3cm1/test-tmp/rpc-test-994a07f5115e47edafd0470568adc366.sock every 8 connection(s)
I20260927 06:56:44.378890 12164 acceptor_pool.cc:254] collecting diagnostics on the listening RPC socket unix:/tmp/dist-test-taskN_3cm1/test-tmp/rpc-test-994a07f5115e47edafd0470568adc366.sock every 8 connection(s)
W20260927 06:56:44.409404 12160 connection.cc:196] Error closing socket: Network error: TlsSocket::Close: Broken pipe
[       OK ] Parameters/TestRpc.TestCallWithPasswordProtectedKey/SSL_UnixSocket (44 ms)
[ RUN      ] Parameters/TestRpc.TestCallToBadServer/SSL_UnixSocket
I20260927 06:56:44.427562 12102 rpc-test.cc:394] Status: Network error: Client connection negotiation failed: client connection to 0.0.0.0:0: connect: Connection refused (error 111)
I20260927 06:56:44.428305 12102 rpc-test.cc:394] Status: Network error: Client connection negotiation failed: client connection to 0.0.0.0:0: connect: Connection refused (error 111)
I20260927 06:56:44.428961 12102 rpc-test.cc:394] Status: Network error: Client connection negotiation failed: client connection to 0.0.0.0:0: connect: Connection refused (error 111)
I20260927 06:56:44.429725 12102 rpc-test.cc:394] Status: Network error: Client connection negotiation failed: client connection to 0.0.0.0:0: connect: Connection refused (error 111)
I20260927 06:56:44.430409 12102 rpc-test.cc:394] Status: Network error: Client connection negotiation failed: client connection to 0.0.0.0:0: connect: Connection refused (error 111)
[       OK ] Parameters/TestRpc.TestCallToBadServer/SSL_UnixSocket (19 ms)
[ RUN      ] Parameters/TestRpc.TestWrongService/SSL_UnixSocket
I20260927 06:56:44.468853 12198 acceptor_pool.cc:254] collecting diagnostics on the listening RPC socket unix:/tmp/dist-test-taskN_3cm1/test-tmp/rpc-test-b9fd40acda5647208a55147098d8eba8.sock every 8 connection(s)
I20260927 06:56:44.469153 12199 acceptor_pool.cc:254] collecting diagnostics on the listening RPC socket unix:/tmp/dist-test-taskN_3cm1/test-tmp/rpc-test-b9fd40acda5647208a55147098d8eba8.sock every 8 connection(s)
I20260927 06:56:44.488574 12195 messenger.cc:345] service WrongServiceName not registered on TestServer
W20260927 06:56:44.489861 12195 connection.cc:196] Error closing socket: Network error: TlsSocket::Close: Broken pipe
[       OK ] Parameters/TestRpc.TestWrongService/SSL_UnixSocket (61 ms)
[ RUN      ] Parameters/TestRpc.TestConnectionKeepalive/SSL_UnixSocket
I20260927 06:56:44.510181 12221 acceptor_pool.cc:254] collecting diagnostics on the listening RPC socket unix:/tmp/dist-test-taskN_3cm1/test-tmp/rpc-test-9d2f67ff17514e1991fa27a372d00435.sock every 8 connection(s)
I20260927 06:56:44.510458 12222 acceptor_pool.cc:254] collecting diagnostics on the listening RPC socket unix:/tmp/dist-test-taskN_3cm1/test-tmp/rpc-test-9d2f67ff17514e1991fa27a372d00435.sock every 8 connection(s)
I20260927 06:56:44.511416 12102 rpc-test.cc:488] Connecting to unix:/tmp/dist-test-taskN_3cm1/test-tmp/rpc-test-9d2f67ff17514e1991fa27a372d00435.sock
W20260927 06:56:44.996940 12234 connection.cc:196] Error closing socket: Network error: TlsSocket::Close: Broken pipe
[       OK ] Parameters/TestRpc.TestConnectionKeepalive/SSL_UnixSocket (1045 ms)
[ RUN      ] Parameters/TestRpc.TestClientConnectionMetrics/SSL_UnixSocket
I20260927 06:56:45.569790 12246 acceptor_pool.cc:254] collecting diagnostics on the listening RPC socket unix:/tmp/dist-test-taskN_3cm1/test-tmp/rpc-test-dbe1c0e59cf04bf180ff4d9aed341f1d.sock every 8 connection(s)
I20260927 06:56:45.570020 12247 acceptor_pool.cc:254] collecting diagnostics on the listening RPC socket unix:/tmp/dist-test-taskN_3cm1/test-tmp/rpc-test-dbe1c0e59cf04bf180ff4d9aed341f1d.sock every 8 connection(s)
I20260927 06:56:45.571040 12102 rpc-test.cc:569] Connecting to unix:/tmp/dist-test-taskN_3cm1/test-tmp/rpc-test-dbe1c0e59cf04bf180ff4d9aed341f1d.sock
[       OK ] Parameters/TestRpc.TestClientConnectionMetrics/SSL_UnixSocket (20999 ms)
[ RUN      ] Parameters/TestRpc.TestCredentialsPolicy/SSL_UnixSocket
I20260927 06:57:06.562556 12269 acceptor_pool.cc:254] collecting diagnostics on the listening RPC socket unix:/tmp/dist-test-taskN_3cm1/test-tmp/rpc-test-380ce859240a4d4b841ce87b4a3d2f0e.sock every 8 connection(s)
I20260927 06:57:06.562798 12270 acceptor_pool.cc:254] collecting diagnostics on the listening RPC socket unix:/tmp/dist-test-taskN_3cm1/test-tmp/rpc-test-380ce859240a4d4b841ce87b4a3d2f0e.sock every 8 connection(s)
I20260927 06:57:06.563683 12102 rpc-test.cc:700] Connecting to unix:/tmp/dist-test-taskN_3cm1/test-tmp/rpc-test-380ce859240a4d4b841ce87b4a3d2f0e.sock
W20260927 06:57:06.601068 12268 connection.cc:196] Error closing socket: Network error: TlsSocket::Close: Broken pipe
[       OK ] Parameters/TestRpc.TestCredentialsPolicy/SSL_UnixSocket (71 ms)
[ RUN      ] Parameters/TestRpc.TestCallLongerThanKeepalive/SSL_UnixSocket
I20260927 06:57:06.622648 12294 acceptor_pool.cc:254] collecting diagnostics on the listening RPC socket unix:/tmp/dist-test-taskN_3cm1/test-tmp/rpc-test-8505c723ee4c4bc694d2cc2ee6236359.sock every 8 connection(s)
I20260927 06:57:06.622855 12295 acceptor_pool.cc:254] collecting diagnostics on the listening RPC socket unix:/tmp/dist-test-taskN_3cm1/test-tmp/rpc-test-8505c723ee4c4bc694d2cc2ee6236359.sock every 8 connection(s)
I20260927 06:57:06.656064 12298 rpc-test-base.h:222] got call: sleep_micros: 3000000 deferred: true
I20260927 06:57:09.657861 12298 rpcz_store.cc:275] Call kudu.rpc.GenericCalculatorService.Sleep from unix:<unnamed> (request call id 0) took 3001 ms. Trace:
I20260927 06:57:09.658030 12298 rpcz_store.cc:276] 0927 06:57:06.655892 (+     0us) service_pool.cc:170] Inserting onto call queue
0927 06:57:06.655994 (+   102us) service_pool.cc:227] Handling call
0927 06:57:09.657816 (+3001822us) inbound_call.cc:173] Queueing success response
Metrics: {}
[       OK ] Parameters/TestRpc.TestCallLongerThanKeepalive/SSL_UnixSocket (3052 ms)
[ RUN      ] Parameters/TestRpc.TestRpcSidecar/SSL_UnixSocket
I20260927 06:57:09.676165 12319 acceptor_pool.cc:254] collecting diagnostics on the listening RPC socket unix:/tmp/dist-test-taskN_3cm1/test-tmp/rpc-test-af5796ed211043c6bab6ae58e48099bc.sock every 8 connection(s)
I20260927 06:57:09.676435 12320 acceptor_pool.cc:254] collecting diagnostics on the listening RPC socket unix:/tmp/dist-test-taskN_3cm1/test-tmp/rpc-test-af5796ed211043c6bab6ae58e48099bc.sock every 8 connection(s)
W20260927 06:57:09.777442 12316 connection.cc:196] Error closing socket: Network error: TlsSocket::Close: Broken pipe
[       OK ] Parameters/TestRpc.TestRpcSidecar/SSL_UnixSocket (116 ms)
[ RUN      ] Parameters/TestRpc.TestRpcSidecarLimits/SSL_UnixSocket
I20260927 06:57:11.778369 12344 acceptor_pool.cc:254] collecting diagnostics on the listening RPC socket unix:/tmp/dist-test-taskN_3cm1/test-tmp/rpc-test-db180dd49af6482186fbc7d9a395c16b.sock every 8 connection(s)
I20260927 06:57:11.778657 12345 acceptor_pool.cc:254] collecting diagnostics on the listening RPC socket unix:/tmp/dist-test-taskN_3cm1/test-tmp/rpc-test-db180dd49af6482186fbc7d9a395c16b.sock every 8 connection(s)
W20260927 06:57:11.803081 12102 serialization.cc:72] Serialized kudu.rpc_test.PushStringsRequestPB (2147483654 bytes) is larger than the maximum configured RPC message size (52428800 bytes). Sending anyway, but peer may reject the data.
W20260927 06:57:11.809494 12341 connection.cc:535] server connection from unix:<unnamed> recv error: Network error: RPC frame had a length of 2147483714, but we only support messages up to 52428800 bytes long.
W20260927 06:57:11.809634 12341 connection.cc:158] shutting down server connection from unix:<unnamed> with pending inbound data: 4/2147483714 bytes received; last active 0 ns ago: status Network error: RPC frame had a length of 2147483714, but we only support messages up to 52428800 bytes long.
W20260927 06:57:11.810149 12357 connection.cc:196] Error closing socket: Network error: TlsSocket::Close: Broken pipe
I20260927 06:57:11.834299 12369 acceptor_pool.cc:254] collecting diagnostics on the listening RPC socket unix:/tmp/dist-test-taskN_3cm1/test-tmp/rpc-test-db180dd49af6482186fbc7d9a395c16b.sock every 8 connection(s)
I20260927 06:57:11.834642 12370 acceptor_pool.cc:254] collecting diagnostics on the listening RPC socket unix:/tmp/dist-test-taskN_3cm1/test-tmp/rpc-test-db180dd49af6482186fbc7d9a395c16b.sock every 8 connection(s)
W20260927 06:57:17.392818 12366 connection.cc:577] server connection from unix:<unnamed>: received bad data: 'Corruption: Invalid packet: message had a length of 2147483710, but we only support messages up to 2147483647 bytes
'
W20260927 06:57:17.393563 12382 connection.cc:196] Error closing socket: Network error: TlsSocket::Close: Broken pipe
[       OK ] Parameters/TestRpc.TestRpcSidecarLimits/SSL_UnixSocket (8086 ms)
[ RUN      ] Parameters/TestRpc.TestCallTimeoutDoesntAffectNegotiation/SSL_UnixSocket
I20260927 06:57:17.882088 12394 acceptor_pool.cc:254] collecting diagnostics on the listening RPC socket unix:/tmp/dist-test-taskN_3cm1/test-tmp/rpc-test-9f1bda818e4241e7acd8b8b9607eca39.sock every 8 connection(s)
I20260927 06:57:17.882378 12395 acceptor_pool.cc:254] collecting diagnostics on the listening RPC socket unix:/tmp/dist-test-taskN_3cm1/test-tmp/rpc-test-9f1bda818e4241e7acd8b8b9607eca39.sock every 8 connection(s)
W20260927 06:57:17.915218 12390 negotiation.cc:266] Injecting 500ms delay in negotiation
I20260927 06:57:17.965781 12102 rpc-test-base.h:595] status: Timed out: connection negotiation to unix:/tmp/dist-test-taskN_3cm1/test-tmp/rpc-test-9f1bda818e4241e7acd8b8b9607eca39.sock for RPC Sleep timed out after 0.050s (ON_OUTBOUND_QUEUE), seconds elapsed: 0.0511635
W20260927 06:57:18.422437 12391 connection.cc:196] Error closing socket: Network error: TlsSocket::Close: Broken pipe
[       OK ] Parameters/TestRpc.TestCallTimeoutDoesntAffectNegotiation/SSL_UnixSocket (557 ms)
[ RUN      ] Parameters/TestRpc.TestRpcHandlerLatencyMetric/SSL_UnixSocket
I20260927 06:57:18.438010 12419 acceptor_pool.cc:254] collecting diagnostics on the listening RPC socket unix:/tmp/dist-test-taskN_3cm1/test-tmp/rpc-test-3b9452cf08a14a9c87ceab29901f8474.sock every 8 connection(s)
I20260927 06:57:18.438315 12420 acceptor_pool.cc:254] collecting diagnostics on the listening RPC socket unix:/tmp/dist-test-taskN_3cm1/test-tmp/rpc-test-3b9452cf08a14a9c87ceab29901f8474.sock every 8 connection(s)
I20260927 06:57:18.503926 12102 rpc-test.cc:1236] Sleep() min lat: 20664
I20260927 06:57:18.504055 12102 rpc-test.cc:1237] Sleep() mean lat: 20664
I20260927 06:57:18.504103 12102 rpc-test.cc:1238] Sleep() max lat: 20664
I20260927 06:57:18.504130 12102 rpc-test.cc:1239] Sleep() #calls: 1
W20260927 06:57:18.505105 12416 connection.cc:196] Error closing socket: Network error: TlsSocket::Close: Broken pipe
[       OK ] Parameters/TestRpc.TestRpcHandlerLatencyMetric/SSL_UnixSocket (84 ms)
[ RUN      ] Parameters/TestRpc.TimedOutOnResponseMetricServiceQueue/SSL_UnixSocket
I20260927 06:57:18.533681 12445 acceptor_pool.cc:254] collecting diagnostics on the listening RPC socket unix:/tmp/dist-test-taskN_3cm1/test-tmp/rpc-test-d8a1300b1b704ecf9cedd178aa9dbae3.sock every 8 connection(s)
I20260927 06:57:18.533901 12446 acceptor_pool.cc:254] collecting diagnostics on the listening RPC socket unix:/tmp/dist-test-taskN_3cm1/test-tmp/rpc-test-d8a1300b1b704ecf9cedd178aa9dbae3.sock every 8 connection(s)
W20260927 06:57:18.612021 12447 rpcz_store.cc:267] Call kudu.rpc_test.CalculatorService.Sleep from unix:<unnamed> (request call id 2) took 20 ms (client timeout 20 ms). Trace:
W20260927 06:57:18.612186 12447 rpcz_store.cc:269] 0927 06:57:18.591617 (+     0us) service_pool.cc:170] Inserting onto call queue
0927 06:57:18.611934 (+ 20317us) service_pool.cc:214] Skipping call since client already timed out
0927 06:57:18.612000 (+    66us) inbound_call.cc:173] Queueing failure response
Metrics: {}
W20260927 06:57:18.613427 12442 connection.cc:196] Error closing socket: Network error: TlsSocket::Close: Broken pipe
[       OK ] Parameters/TestRpc.TimedOutOnResponseMetricServiceQueue/SSL_UnixSocket (107 ms)
[ RUN      ] Parameters/TestRpc.RpcPendingConnectionsMetric/SSL_UnixSocket
I20260927 06:57:18.621567 12468 acceptor_pool.cc:254] collecting diagnostics on the listening RPC socket 0.0.0.0:35915 every 8 connection(s)
I20260927 06:57:18.621780 12469 acceptor_pool.cc:254] collecting diagnostics on the listening RPC socket 0.0.0.0:35915 every 8 connection(s)
W20260927 06:57:18.623773 12464 negotiation.cc:337] Failed RPC negotiation. Trace:
0927 06:57:18.623165 (+     0us) reactor.cc:625] Submitting negotiation task for server connection from 127.0.0.1:59778 (local address 127.0.0.1:35915)
0927 06:57:18.623334 (+   169us) server_negotiation.cc:206] Beginning negotiation
0927 06:57:18.623338 (+     4us) server_negotiation.cc:399] Waiting for connection header
0927 06:57:18.623464 (+   126us) negotiation.cc:327] Negotiation complete: Network error: Server connection negotiation failed: server connection from 127.0.0.1:59778: BlockingRecv error: recv got EOF from 127.0.0.1:59778 (error 108)
Metrics: {"server-negotiator.queue_time_us":53}
[       OK ] Parameters/TestRpc.RpcPendingConnectionsMetric/SSL_UnixSocket (19 ms)
[ RUN      ] Parameters/TestRpc.TestRpcContextClientDeadline/SSL_UnixSocket
I20260927 06:57:18.646860 12484 acceptor_pool.cc:254] collecting diagnostics on the listening RPC socket unix:/tmp/dist-test-taskN_3cm1/test-tmp/rpc-test-d1d746842f5945aab4498d2ac45d278a.sock every 8 connection(s)
I20260927 06:57:18.647089 12485 acceptor_pool.cc:254] collecting diagnostics on the listening RPC socket unix:/tmp/dist-test-taskN_3cm1/test-tmp/rpc-test-d1d746842f5945aab4498d2ac45d278a.sock every 8 connection(s)
W20260927 06:57:18.686378 12481 connection.cc:196] Error closing socket: Network error: TlsSocket::Close: Broken pipe
[       OK ] Parameters/TestRpc.TestRpcContextClientDeadline/SSL_UnixSocket (53 ms)
[ RUN      ] Parameters/TestRpc.TestApplicationFeatureFlagUnsupportedServer/SSL_UnixSocket
I20260927 06:57:18.718061 12509 acceptor_pool.cc:254] collecting diagnostics on the listening RPC socket unix:/tmp/dist-test-taskN_3cm1/test-tmp/rpc-test-361c9c5c6824418f83fd9d77fcc4b8bb.sock every 8 connection(s)
I20260927 06:57:18.718331 12510 acceptor_pool.cc:254] collecting diagnostics on the listening RPC socket unix:/tmp/dist-test-taskN_3cm1/test-tmp/rpc-test-361c9c5c6824418f83fd9d77fcc4b8bb.sock every 8 connection(s)
[       OK ] Parameters/TestRpc.TestApplicationFeatureFlagUnsupportedServer/SSL_UnixSocket (65 ms)
[ RUN      ] Parameters/TestRpc.TestCancellationAsync/SSL_UnixSocket
I20260927 06:57:18.776829 12534 acceptor_pool.cc:254] collecting diagnostics on the listening RPC socket unix:/tmp/dist-test-taskN_3cm1/test-tmp/rpc-test-f92aa870fab34432a0624d78a7e632f8.sock every 8 connection(s)
I20260927 06:57:18.777050 12535 acceptor_pool.cc:254] collecting diagnostics on the listening RPC socket unix:/tmp/dist-test-taskN_3cm1/test-tmp/rpc-test-f92aa870fab34432a0624d78a7e632f8.sock every 8 connection(s)
I20260927 06:57:18.778043 12102 rpc-test.cc:1716] Connecting to unix:/tmp/dist-test-taskN_3cm1/test-tmp/rpc-test-f92aa870fab34432a0624d78a7e632f8.sock
I20260927 06:57:18.796000 12102 test_util.cc:268] Using random seed: 1977472206
I20260927 06:57:18.835182 12538 rpc-test-base.h:240] got call: sleep_micros: 500 pattern: 4294967295 num_repetitions: 2097152 sidecar_idx: 0
I20260927 06:57:18.861510 12537 rpc-test-base.h:240] got call: sleep_micros: 500 pattern: 4294967295 num_repetitions: 2097152 sidecar_idx: 0
I20260927 06:57:18.895519 12538 rpc-test-base.h:240] got call: sleep_micros: 500 pattern: 4294967295 num_repetitions: 2097152 sidecar_idx: 0
I20260927 06:57:18.924167 12537 rpc-test-base.h:240] got call: sleep_micros: 500 pattern: 4294967295 num_repetitions: 2097152 sidecar_idx: 0
I20260927 06:57:18.954330 12538 rpc-test-base.h:240] got call: sleep_micros: 500 pattern: 4294967295 num_repetitions: 2097152 sidecar_idx: 0
I20260927 06:57:18.983628 12537 rpc-test-base.h:240] got call: sleep_micros: 500 pattern: 4294967295 num_repetitions: 2097152 sidecar_idx: 0
I20260927 06:57:19.012308 12538 rpc-test-base.h:240] got call: sleep_micros: 500 pattern: 4294967295 num_repetitions: 2097152 sidecar_idx: 0
W20260927 06:57:19.014876 12531 connection.cc:196] Error closing socket: Network error: TlsSocket::Close: Broken pipe
W20260927 06:57:19.030939 12531 connection.cc:441] server connection from unix:<unnamed> torn down before Call kudu.rpc.GenericCalculatorService.SleepWithSidecar from unix:<unnamed> (request call id 8) could send its response
W20260927 06:57:19.045636 12531 connection.cc:441] server connection from unix:<unnamed> torn down before Call kudu.rpc.GenericCalculatorService.SleepWithSidecar from unix:<unnamed> (request call id 9) could send its response
[       OK ] Parameters/TestRpc.TestCancellationAsync/SSL_UnixSocket (293 ms)
[ RUN      ] Parameters/TestRpc.TestPerformanceBySocketType/SSL_UnixSocket
I20260927 06:57:19.065057 12559 acceptor_pool.cc:254] collecting diagnostics on the listening RPC socket unix:/tmp/dist-test-taskN_3cm1/test-tmp/rpc-test-55b0a345546f457480a2ca53885d37d5.sock every 8 connection(s)
I20260927 06:57:19.065361 12560 acceptor_pool.cc:254] collecting diagnostics on the listening RPC socket unix:/tmp/dist-test-taskN_3cm1/test-tmp/rpc-test-55b0a345546f457480a2ca53885d37d5.sock every 8 connection(s)
I20260927 06:57:19.066331 12102 rpc-test.cc:1846] Connecting to unix:/tmp/dist-test-taskN_3cm1/test-tmp/rpc-test-55b0a345546f457480a2ca53885d37d5.sock
I20260927 06:57:22.163517 12102 rpc-test.cc:1859] Sending 1024MB via ssl-enabled unix socket: real 3.070s	user 2.904s	sys 2.292s
I20260927 06:57:25.310367 12102 rpc-test.cc:1859] Sending 1024MB via ssl-enabled unix socket: real 3.147s	user 3.111s	sys 2.236s
I20260927 06:57:28.339849 12102 rpc-test.cc:1859] Sending 1024MB via ssl-enabled unix socket: real 3.029s	user 2.840s	sys 2.269s
I20260927 06:57:31.531244 12102 rpc-test.cc:1859] Sending 1024MB via ssl-enabled unix socket: real 3.191s	user 3.133s	sys 2.273s
I20260927 06:57:34.668188 12102 rpc-test.cc:1859] Sending 1024MB via ssl-enabled unix socket: real 3.137s	user 3.075s	sys 2.214s
W20260927 06:57:34.671185 12556 connection.cc:196] Error closing socket: Network error: TlsSocket::Close: Broken pipe
[       OK ] Parameters/TestRpc.TestPerformanceBySocketType/SSL_UnixSocket (15627 ms)
[----------] 20 tests from Parameters/TestRpc (50390 ms total)

[----------] 1 test from Parameters/TestRpcSocketTxRxQueue
[ RUN      ] Parameters/TestRpcSocketTxRxQueue.AcceptorRxQueueSizeMetric/0
I20260927 06:57:34.681545 12584 acceptor_pool.cc:254] collecting diagnostics on the listening RPC socket 0.0.0.0:33005 every 1 connection(s)
I20260927 06:57:34.681876 12585 acceptor_pool.cc:254] collecting diagnostics on the listening RPC socket 0.0.0.0:33005 every 1 connection(s)
W20260927 06:57:34.683595 12580 negotiation.cc:337] Failed RPC negotiation. Trace:
0927 06:57:34.683196 (+     0us) reactor.cc:625] Submitting negotiation task for server connection from 127.0.0.1:60282 (local address 127.0.0.1:33005)
0927 06:57:34.683361 (+   165us) server_negotiation.cc:206] Beginning negotiation
0927 06:57:34.683365 (+     4us) server_negotiation.cc:399] Waiting for connection header
0927 06:57:34.683486 (+   121us) negotiation.cc:327] Negotiation complete: Network error: Server connection negotiation failed: server connection from 127.0.0.1:60282: BlockingRecv error: recv got EOF from 127.0.0.1:60282 (error 108)
Metrics: {"server-negotiator.queue_time_us":67}
[       OK ] Parameters/TestRpcSocketTxRxQueue.AcceptorRxQueueSizeMetric/0 (10 ms)
[----------] 1 test from Parameters/TestRpcSocketTxRxQueue (10 ms total)

[----------] Global test environment tear-down
[==========] 21 tests from 2 test suites ran. (50401 ms total)
[  PASSED  ] 20 tests.
[  FAILED  ] 1 test, listed below:
[  FAILED  ] Parameters/TestRpc.TestCallWithChainCertAndChainCA/SSL_UnixSocket, where GetParam() = (true, true)

 1 FAILED TEST