Parameters/TestRpc.TestCallWithChainCertAndRootCA/SSL_TCP: /data0/somelongdirectorytoavoidrpathissues/src/kudu/src/kudu/rpc/rpc-test.cc:303: Failure
Failed
Bad status: Runtime error: could not verify certificate chain (error with cert: subject=CN = localhost, ST = sadfjas, C = AS, emailAddress = sdflkdsajf, O = lskdfjlsad, OU = sldfkja, issuer=C = AS, ST = ASDfkjdhf, L = lskdjf, O = saldfja, OU = skdjf, CN = localhost, emailAddress = sadjflkadsj): : certificate has expired
Google Test trace:
/data0/somelongdirectorytoavoidrpathissues/src/kudu/src/kudu/rpc/rpc-test.cc:300: Connecting to 0.0.0.0:45603
I20260925 03:03:07.387107 8349 test_util.cc:175] -----------------------------------------------
I20260925 03:03:07.387280 8349 test_util.cc:176] Had fatal failures, leaving test files at /tmp/dist-test-taskWlsY2y/test-tmp/rpc-test.1.Parameters_TestRpc.TestCallWithChainCertAndRootCA_SSL_TCP.1790305385914490-8349-0
Note: This is test shard 2 of 8.
[==========] Running 21 tests from 2 test suites.
[----------] Global test environment set-up.
[----------] 1 test from TestRpc
[ RUN ] TestRpc.TestMethodsByName
[ OK ] TestRpc.TestMethodsByName (6 ms)
[----------] 1 test from TestRpc (6 ms total)
[----------] 20 tests from Parameters/TestRpc
[ RUN ] Parameters/TestRpc.TestAcceptorPoolStartStop/SSL_TCP
WARNING: Logging before InitGoogleLogging() is written to STDERR
I20260925 03:03:06.022308 8364 acceptor_pool.cc:254] collecting diagnostics on the listening RPC socket 0.0.0.0:41389 every 8 connection(s)
I20260925 03:03:06.023703 8365 acceptor_pool.cc:254] collecting diagnostics on the listening RPC socket 0.0.0.0:41389 every 8 connection(s)
W20260925 03:03:07.024317 8349 thread.cc:536] Waited for 1000ms trying to join with acceptor (tid 8365)
I20260925 03:03:07.103740 8376 acceptor_pool.cc:254] collecting diagnostics on the listening RPC socket 0.0.0.0:41317 every 8 connection(s)
I20260925 03:03:07.105068 8377 acceptor_pool.cc:254] collecting diagnostics on the listening RPC socket 0.0.0.0:41317 every 8 connection(s)
I20260925 03:03:07.141829 8387 acceptor_pool.cc:254] collecting diagnostics on the listening RPC socket 0.0.0.0:38617 every 8 connection(s)
I20260925 03:03:07.143146 8388 acceptor_pool.cc:254] collecting diagnostics on the listening RPC socket 0.0.0.0:38617 every 8 connection(s)
I20260925 03:03:07.167984 8398 acceptor_pool.cc:254] collecting diagnostics on the listening RPC socket 0.0.0.0:33553 every 8 connection(s)
I20260925 03:03:07.168697 8399 acceptor_pool.cc:254] collecting diagnostics on the listening RPC socket 0.0.0.0:33553 every 8 connection(s)
I20260925 03:03:07.206271 8409 acceptor_pool.cc:254] collecting diagnostics on the listening RPC socket 0.0.0.0:45757 every 8 connection(s)
I20260925 03:03:07.206954 8410 acceptor_pool.cc:254] collecting diagnostics on the listening RPC socket 0.0.0.0:45757 every 8 connection(s)
[ OK ] Parameters/TestRpc.TestAcceptorPoolStartStop/SSL_TCP (1236 ms)
[ RUN ] Parameters/TestRpc.TestCall/SSL_TCP
I20260925 03:03:07.226707 8422 acceptor_pool.cc:254] collecting diagnostics on the listening RPC socket 0.0.0.0:40673 every 8 connection(s)
I20260925 03:03:07.228614 8423 acceptor_pool.cc:254] collecting diagnostics on the listening RPC socket 0.0.0.0:40673 every 8 connection(s)
I20260925 03:03:07.233247 8349 rpc-test.cc:234] Connecting to 0.0.0.0:40673
[ OK ] Parameters/TestRpc.TestCall/SSL_TCP (141 ms)
[ RUN ] Parameters/TestRpc.TestCallWithChainCertAndRootCA/SSL_TCP
I20260925 03:03:07.367517 8447 acceptor_pool.cc:254] collecting diagnostics on the listening RPC socket 0.0.0.0:45603 every 8 connection(s)
I20260925 03:03:07.368232 8448 acceptor_pool.cc:254] collecting diagnostics on the listening RPC socket 0.0.0.0:45603 every 8 connection(s)
/data0/somelongdirectorytoavoidrpathissues/src/kudu/src/kudu/rpc/rpc-test.cc:303: Failure
Failed
Bad status: Runtime error: could not verify certificate chain (error with cert: subject=CN = localhost, ST = sadfjas, C = AS, emailAddress = sdflkdsajf, O = lskdfjlsad, OU = sldfkja, issuer=C = AS, ST = ASDfkjdhf, L = lskdjf, O = saldfja, OU = skdjf, CN = localhost, emailAddress = sadjflkadsj): : certificate has expired
Google Test trace:
/data0/somelongdirectorytoavoidrpathissues/src/kudu/src/kudu/rpc/rpc-test.cc:300: Connecting to 0.0.0.0:45603
I20260925 03:03:07.387107 8349 test_util.cc:175] -----------------------------------------------
I20260925 03:03:07.387280 8349 test_util.cc:176] Had fatal failures, leaving test files at /tmp/dist-test-taskWlsY2y/test-tmp/rpc-test.1.Parameters_TestRpc.TestCallWithChainCertAndRootCA_SSL_TCP.1790305385914490-8349-0
[ FAILED ] Parameters/TestRpc.TestCallWithChainCertAndRootCA/SSL_TCP, where GetParam() = (true, false) (35 ms)
[ RUN ] Parameters/TestRpc.TestCallWithBadPasswordProtectedKey/SSL_TCP
[ OK ] Parameters/TestRpc.TestCallWithBadPasswordProtectedKey/SSL_TCP (31 ms)
[ RUN ] Parameters/TestRpc.TestInvalidMethodCall/SSL_TCP
I20260925 03:03:07.447525 8484 acceptor_pool.cc:254] collecting diagnostics on the listening RPC socket 0.0.0.0:42843 every 8 connection(s)
I20260925 03:03:07.448307 8485 acceptor_pool.cc:254] collecting diagnostics on the listening RPC socket 0.0.0.0:42843 every 8 connection(s)
I20260925 03:03:07.451539 8349 rpc-test.cc:406] Connecting to 0.0.0.0:42843
[ OK ] Parameters/TestRpc.TestInvalidMethodCall/SSL_TCP (64 ms)
[ RUN ] Parameters/TestRpc.TestHighFDs/SSL_TCP
I20260925 03:03:07.699028 8509 acceptor_pool.cc:254] collecting diagnostics on the listening RPC socket 0.0.0.0:43007 every 8 connection(s)
I20260925 03:03:07.699690 8510 acceptor_pool.cc:254] collecting diagnostics on the listening RPC socket 0.0.0.0:43007 every 8 connection(s)
[ OK ] Parameters/TestRpc.TestHighFDs/SSL_TCP (261 ms)
[ RUN ] Parameters/TestRpc.TestConnectionAlwaysKeepalive/SSL_TCP
I20260925 03:03:07.773026 8532 acceptor_pool.cc:254] collecting diagnostics on the listening RPC socket 0.0.0.0:37701 every 8 connection(s)
I20260925 03:03:07.773705 8533 acceptor_pool.cc:254] collecting diagnostics on the listening RPC socket 0.0.0.0:37701 every 8 connection(s)
I20260925 03:03:07.776650 8349 rpc-test.cc:532] Connecting to 0.0.0.0:37701
[ OK ] Parameters/TestRpc.TestConnectionAlwaysKeepalive/SSL_TCP (3090 ms)
[ RUN ] Parameters/TestRpc.TestReopenOutboundConnections/SSL_TCP
I20260925 03:03:10.854643 8555 acceptor_pool.cc:254] collecting diagnostics on the listening RPC socket 0.0.0.0:38545 every 8 connection(s)
I20260925 03:03:10.855316 8556 acceptor_pool.cc:254] collecting diagnostics on the listening RPC socket 0.0.0.0:38545 every 8 connection(s)
I20260925 03:03:10.858287 8349 rpc-test.cc:658] Connecting to 0.0.0.0:38545
[ OK ] Parameters/TestRpc.TestReopenOutboundConnections/SSL_TCP (365 ms)
[ RUN ] Parameters/TestRpc.TestConnectionNetworkPlane/SSL_TCP
I20260925 03:03:11.237752 8578 acceptor_pool.cc:254] collecting diagnostics on the listening RPC socket 0.0.0.0:41057 every 8 connection(s)
I20260925 03:03:11.238502 8579 acceptor_pool.cc:254] collecting diagnostics on the listening RPC socket 0.0.0.0:41057 every 8 connection(s)
I20260925 03:03:11.241544 8349 rpc-test.cc:772] Connecting to 0.0.0.0:41057
[ OK ] Parameters/TestRpc.TestConnectionNetworkPlane/SSL_TCP (92 ms)
[ RUN ] Parameters/TestRpc.TestTCPKeepalive/SSL_TCP
I20260925 03:03:11.307441 8603 acceptor_pool.cc:254] collecting diagnostics on the listening RPC socket 0.0.0.0:38111 every 8 connection(s)
I20260925 03:03:11.308049 8604 acceptor_pool.cc:254] collecting diagnostics on the listening RPC socket 0.0.0.0:38111 every 8 connection(s)
I20260925 03:03:11.335117 8607 rpc-test-base.h:222] got call: sleep_micros: 8000000 deferred: true
I20260925 03:03:19.339358 8607 rpcz_store.cc:275] Call kudu.rpc.GenericCalculatorService.Sleep from 127.0.0.1:60200 (request call id 0) took 8004 ms. Trace:
I20260925 03:03:19.339797 8607 rpcz_store.cc:276] 0925 03:03:11.334786 (+ 0us) service_pool.cc:170] Inserting onto call queue
0925 03:03:11.334941 (+ 155us) service_pool.cc:227] Handling call
0925 03:03:19.339180 (+8004239us) inbound_call.cc:173] Queueing success response
Metrics: {}
[ OK ] Parameters/TestRpc.TestTCPKeepalive/SSL_TCP (8059 ms)
[ RUN ] Parameters/TestRpc.TestMaxSmallSidecars/SSL_TCP
I20260925 03:03:19.382413 8629 acceptor_pool.cc:254] collecting diagnostics on the listening RPC socket 0.0.0.0:32947 every 8 connection(s)
I20260925 03:03:19.383216 8630 acceptor_pool.cc:254] collecting diagnostics on the listening RPC socket 0.0.0.0:32947 every 8 connection(s)
[ OK ] Parameters/TestRpc.TestMaxSmallSidecars/SSL_TCP (210 ms)
[ RUN ] Parameters/TestRpc.TestCallTimeout/SSL_TCP
I20260925 03:03:19.598085 8654 acceptor_pool.cc:254] collecting diagnostics on the listening RPC socket 0.0.0.0:41195 every 8 connection(s)
I20260925 03:03:19.598778 8655 acceptor_pool.cc:254] collecting diagnostics on the listening RPC socket 0.0.0.0:41195 every 8 connection(s)
I20260925 03:03:19.615298 8349 rpc-test-base.h:595] status: Timed out: connection negotiation to 0.0.0.0:41195 for RPC Sleep timed out after 0.000s (ON_OUTBOUND_QUEUE), seconds elapsed: 0.0022418
I20260925 03:03:19.623174 8658 rpc-test-base.h:222] got call: sleep_micros: 700000
I20260925 03:03:19.817019 8349 rpc-test-base.h:595] status: Timed out: Sleep RPC to 0.0.0.0:41195 timed out after 0.200s (SENT), seconds elapsed: 0.201232
I20260925 03:03:19.818535 8657 rpc-test-base.h:222] got call: sleep_micros: 2000000
W20260925 03:03:20.323832 8658 rpcz_store.cc:267] Call kudu.rpc.GenericCalculatorService.Sleep from 127.0.0.1:53040 (request call id 1) took 700 ms (client timeout 200 ms). Trace:
W20260925 03:03:20.324208 8658 rpcz_store.cc:269] 0925 03:03:19.623018 (+ 0us) service_pool.cc:170] Inserting onto call queue
0925 03:03:19.623116 (+ 98us) service_pool.cc:227] Handling call
0925 03:03:20.323763 (+700647us) inbound_call.cc:173] Queueing success response
Metrics: {}
I20260925 03:03:21.319590 8349 rpc-test-base.h:595] status: Timed out: Sleep RPC to 0.0.0.0:41195 timed out after 1.500s (SENT), seconds elapsed: 1.50223
W20260925 03:03:21.819120 8657 rpcz_store.cc:267] Call kudu.rpc.GenericCalculatorService.Sleep from 127.0.0.1:53040 (request call id 2) took 2000 ms (client timeout 1500 ms). Trace:
W20260925 03:03:21.819450 8657 rpcz_store.cc:269] 0925 03:03:19.818237 (+ 0us) service_pool.cc:170] Inserting onto call queue
0925 03:03:19.818354 (+ 117us) service_pool.cc:227] Handling call
0925 03:03:21.819060 (+2000706us) inbound_call.cc:173] Queueing success response
Metrics: {}
W20260925 03:03:21.820000 8651 connection.cc:441] server connection from 127.0.0.1:53040 torn down before Call kudu.rpc.GenericCalculatorService.Sleep from 127.0.0.1:53040 (request call id 2) could send its response
[ OK ] Parameters/TestRpc.TestCallTimeout/SSL_TCP (2263 ms)
[ RUN ] Parameters/TestRpc.TestServerShutsDown/SSL_TCP
I20260925 03:03:21.828065 8349 rpc-test.cc:1125] Connecting to 0.0.0.0:36833
W20260925 03:03:21.837500 8671 negotiation.cc:337] Failed RPC negotiation. Trace:
0925 03:03:21.835946 (+ 0us) reactor.cc:625] Submitting negotiation task for client connection to 0.0.0.0:36833 (local address 127.0.0.1:52192)
0925 03:03:21.836395 (+ 449us) negotiation.cc:107] Waiting for socket to connect
0925 03:03:21.836425 (+ 30us) client_negotiation.cc:174] Beginning negotiation
0925 03:03:21.836670 (+ 245us) client_negotiation.cc:252] Sending NEGOTIATE NegotiatePB request
0925 03:03:21.836890 (+ 220us) negotiation.cc:327] Negotiation complete: Network error: Client connection negotiation failed: client connection to 0.0.0.0:36833: BlockingWrite error: write error: Broken pipe (error 32)
Metrics: {"client-negotiator.queue_time_us":119}
[ OK ] Parameters/TestRpc.TestServerShutsDown/SSL_TCP (13 ms)
[ RUN ] Parameters/TestRpc.TimedOutOnResponseMetric/SSL_TCP
I20260925 03:03:21.854051 8688 acceptor_pool.cc:254] collecting diagnostics on the listening RPC socket 0.0.0.0:46527 every 8 connection(s)
I20260925 03:03:21.854702 8689 acceptor_pool.cc:254] collecting diagnostics on the listening RPC socket 0.0.0.0:46527 every 8 connection(s)
W20260925 03:03:22.095772 8692 rpcz_store.cc:267] Call kudu.rpc_test.CalculatorService.Sleep from 127.0.0.1:47122 (request call id 3) took 50 ms (client timeout 25 ms). Trace:
W20260925 03:03:22.096068 8692 rpcz_store.cc:269] 0925 03:03:22.045156 (+ 0us) service_pool.cc:170] Inserting onto call queue
0925 03:03:22.045259 (+ 103us) service_pool.cc:227] Handling call
0925 03:03:22.095683 (+ 50424us) inbound_call.cc:173] Queueing success response
Related trace 'test_child':
Metrics: {"test_sleep_us":50000,"child_traces":[["test_child",{"related_trace_metric":1}]]}
W20260925 03:03:22.155607 8692 rpcz_store.cc:267] Call kudu.rpc_test.CalculatorService.Sleep from 127.0.0.1:47122 (request call id 4) took 50 ms (client timeout 50 ms). Trace:
W20260925 03:03:22.155911 8692 rpcz_store.cc:269] 0925 03:03:22.105014 (+ 0us) service_pool.cc:170] Inserting onto call queue
0925 03:03:22.105151 (+ 137us) service_pool.cc:227] Handling call
0925 03:03:22.155530 (+ 50379us) inbound_call.cc:173] Queueing success response
Related trace 'test_child':
Metrics: {"test_sleep_us":50000,"child_traces":[["test_child",{"related_trace_metric":1}]]}
[ OK ] Parameters/TestRpc.TimedOutOnResponseMetric/SSL_TCP (324 ms)
[ RUN ] Parameters/TestRpc.AcceptorDispatchingTimesMetric/SSL_TCP
I20260925 03:03:22.175343 8713 acceptor_pool.cc:254] collecting diagnostics on the listening RPC socket 0.0.0.0:41697 every 8 connection(s)
I20260925 03:03:22.176016 8714 acceptor_pool.cc:254] collecting diagnostics on the listening RPC socket 0.0.0.0:41697 every 8 connection(s)
W20260925 03:03:22.181078 8709 negotiation.cc:337] Failed RPC negotiation. Trace:
0925 03:03:22.179424 (+ 0us) reactor.cc:625] Submitting negotiation task for server connection from 127.0.0.1:33226 (local address 127.0.0.1:41697)
0925 03:03:22.180061 (+ 637us) server_negotiation.cc:206] Beginning negotiation
0925 03:03:22.180086 (+ 25us) server_negotiation.cc:399] Waiting for connection header
0925 03:03:22.180414 (+ 328us) negotiation.cc:327] Negotiation complete: Network error: Server connection negotiation failed: server connection from 127.0.0.1:33226: BlockingRecv error: recv got EOF from 127.0.0.1:33226 (error 108)
Metrics: {"server-negotiator.queue_time_us":257}
[ OK ] Parameters/TestRpc.AcceptorDispatchingTimesMetric/SSL_TCP (20 ms)
[ RUN ] Parameters/TestRpc.TestRpcCallbackDestroysMessenger/SSL_TCP
[ OK ] Parameters/TestRpc.TestRpcCallbackDestroysMessenger/SSL_TCP (21 ms)
[ RUN ] Parameters/TestRpc.TestApplicationFeatureFlag/SSL_TCP
I20260925 03:03:22.227298 8738 acceptor_pool.cc:254] collecting diagnostics on the listening RPC socket 0.0.0.0:43227 every 8 connection(s)
I20260925 03:03:22.228037 8739 acceptor_pool.cc:254] collecting diagnostics on the listening RPC socket 0.0.0.0:43227 every 8 connection(s)
W20260925 03:03:22.270509 8736 messenger.cc:357] Unable to handle RPC call: Not implemented: call requires unsupported application feature flags: 99
[ OK ] Parameters/TestRpc.TestApplicationFeatureFlag/SSL_TCP (72 ms)
[ RUN ] Parameters/TestRpc.TestCancellation/SSL_TCP
I20260925 03:03:22.297655 8763 acceptor_pool.cc:254] collecting diagnostics on the listening RPC socket 0.0.0.0:37811 every 8 connection(s)
I20260925 03:03:22.298374 8764 acceptor_pool.cc:254] collecting diagnostics on the listening RPC socket 0.0.0.0:37811 every 8 connection(s)
I20260925 03:03:22.301417 8349 rpc-test.cc:1648] Connecting to 0.0.0.0:37811
I20260925 03:03:22.408185 8349 rpc-test-base.h:595] status: Aborted: Sleep RPC to 0.0.0.0:37811 is cancelled in state READY, seconds elapsed: 0.000391067
I20260925 03:03:22.559508 8349 rpc-test-base.h:595] status: Aborted: Sleep RPC to 0.0.0.0:37811 is cancelled in state SENT, seconds elapsed: 0.00101279
I20260925 03:03:22.599319 8766 rpc-test-base.h:222] got call: sleep_micros: 510000
I20260925 03:03:22.735677 8349 rpc-test-base.h:595] status: Aborted: Sleep RPC to 0.0.0.0:37811 is cancelled in state SENT, seconds elapsed: 0.00092417
I20260925 03:03:22.773808 8765 rpc-test-base.h:222] got call: sleep_micros: 510000
I20260925 03:03:22.900125 8349 rpc-test-base.h:595] status: Aborted: Sleep RPC to 0.0.0.0:37811 is cancelled in state SENT, seconds elapsed: 0.000987879
W20260925 03:03:22.936137 8767 rpcz_store.cc:267] Call kudu.rpc.GenericCalculatorService.Sleep from 127.0.0.1:49502 (request call id 11) took 15 ms (client timeout 10 ms). Trace:
W20260925 03:03:22.936496 8767 rpcz_store.cc:269] 0925 03:03:22.920951 (+ 0us) service_pool.cc:170] Inserting onto call queue
0925 03:03:22.935877 (+ 14926us) service_pool.cc:214] Skipping call since client already timed out
0925 03:03:22.935968 (+ 91us) inbound_call.cc:173] Queueing failure response
Metrics: {}
I20260925 03:03:22.937000 8767 rpc-test-base.h:222] got call: sleep_micros: 1500000
W20260925 03:03:23.110049 8766 rpcz_store.cc:267] Call kudu.rpc.GenericCalculatorService.Sleep from 127.0.0.1:49502 (request call id 3) took 511 ms (client timeout 10 ms). Trace:
W20260925 03:03:23.110430 8766 rpcz_store.cc:269] 0925 03:03:22.598997 (+ 0us) service_pool.cc:170] Inserting onto call queue
0925 03:03:22.599230 (+ 233us) service_pool.cc:227] Handling call
0925 03:03:23.109978 (+510748us) inbound_call.cc:173] Queueing success response
Metrics: {}
W20260925 03:03:23.284406 8765 rpcz_store.cc:267] Call kudu.rpc.GenericCalculatorService.Sleep from 127.0.0.1:49502 (request call id 7) took 510 ms (client timeout 10 ms). Trace:
W20260925 03:03:23.284724 8765 rpcz_store.cc:269] 0925 03:03:22.773645 (+ 0us) service_pool.cc:170] Inserting onto call queue
0925 03:03:22.773748 (+ 103us) service_pool.cc:227] Handling call
0925 03:03:23.284352 (+510604us) inbound_call.cc:173] Queueing success response
Metrics: {}
I20260925 03:03:23.902635 8349 rpc-test-base.h:595] status: Timed out: Sleep RPC to 0.0.0.0:37811 timed out after 1.000s (SENT), seconds elapsed: 1.00208
I20260925 03:03:23.903911 8765 rpc-test-base.h:222] got call: sleep_micros: 1500000
W20260925 03:03:24.437554 8767 rpcz_store.cc:267] Call kudu.rpc.GenericCalculatorService.Sleep from 127.0.0.1:49502 (request call id 12) took 1516 ms (client timeout 1000 ms). Trace:
W20260925 03:03:24.437870 8767 rpcz_store.cc:269] 0925 03:03:22.921171 (+ 0us) service_pool.cc:170] Inserting onto call queue
0925 03:03:22.936966 (+ 15795us) service_pool.cc:227] Handling call
0925 03:03:24.437475 (+1500509us) inbound_call.cc:173] Queueing success response
Metrics: {}
I20260925 03:03:24.903991 8349 rpc-test-base.h:595] status: Timed out: Sleep RPC to 0.0.0.0:37811 timed out after 1.000s (SENT), seconds elapsed: 1.00098
W20260925 03:03:24.905485 8760 messenger.cc:357] Unable to handle RPC call: Not implemented: call requires unsupported application feature flags: 99, 1
W20260925 03:03:24.906930 8760 messenger.cc:357] Unable to handle RPC call: Not implemented: call requires unsupported application feature flags: 99, 1
W20260925 03:03:25.404438 8765 rpcz_store.cc:267] Call kudu.rpc.GenericCalculatorService.Sleep from 127.0.0.1:49502 (request call id 13) took 1500 ms (client timeout 1000 ms). Trace:
W20260925 03:03:25.404765 8765 rpcz_store.cc:269] 0925 03:03:23.903749 (+ 0us) service_pool.cc:170] Inserting onto call queue
0925 03:03:23.903856 (+ 107us) service_pool.cc:227] Handling call
0925 03:03:25.404381 (+1500525us) inbound_call.cc:173] Queueing success response
Metrics: {}
W20260925 03:03:25.405383 8760 connection.cc:441] server connection from 127.0.0.1:49502 torn down before Call kudu.rpc.GenericCalculatorService.Sleep from 127.0.0.1:49502 (request call id 13) could send its response
[ OK ] Parameters/TestRpc.TestCancellation/SSL_TCP (3132 ms)
[ RUN ] Parameters/TestRpc.TestCancellationMultiThreads/SSL_TCP
I20260925 03:03:25.452127 8788 acceptor_pool.cc:254] collecting diagnostics on the listening RPC socket 0.0.0.0:38663 every 8 connection(s)
I20260925 03:03:25.452795 8789 acceptor_pool.cc:254] collecting diagnostics on the listening RPC socket 0.0.0.0:38663 every 8 connection(s)
I20260925 03:03:25.455785 8349 rpc-test.cc:1808] Connecting to 0.0.0.0:38663
I20260925 03:03:25.594775 8802 test_util.cc:268] Using random seed: -172135302
I20260925 03:03:25.595873 8803 test_util.cc:268] Using random seed: -172134196
I20260925 03:03:25.597278 8804 test_util.cc:268] Using random seed: -172132798
I20260925 03:03:25.598920 8805 test_util.cc:268] Using random seed: -172131208
I20260925 03:03:25.600438 8806 test_util.cc:268] Using random seed: -172129776
I20260925 03:03:25.601833 8807 test_util.cc:268] Using random seed: -172128385
I20260925 03:03:25.603401 8808 test_util.cc:268] Using random seed: -172126822
I20260925 03:03:25.604839 8809 test_util.cc:268] Using random seed: -172125371
I20260925 03:03:25.606285 8810 test_util.cc:268] Using random seed: -172123933
I20260925 03:03:25.607753 8811 test_util.cc:268] Using random seed: -172122416
I20260925 03:03:25.609315 8812 test_util.cc:268] Using random seed: -172120908
I20260925 03:03:25.611004 8813 test_util.cc:268] Using random seed: -172119243
I20260925 03:03:25.612746 8814 test_util.cc:268] Using random seed: -172117547
I20260925 03:03:25.614511 8815 test_util.cc:268] Using random seed: -172115718
I20260925 03:03:25.616317 8816 test_util.cc:268] Using random seed: -172113909
I20260925 03:03:25.618105 8817 test_util.cc:268] Using random seed: -172112151
I20260925 03:03:25.623929 8818 test_util.cc:268] Using random seed: -172106342
I20260925 03:03:25.625748 8819 test_util.cc:268] Using random seed: -172104500
I20260925 03:03:25.627408 8820 test_util.cc:268] Using random seed: -172102816
I20260925 03:03:25.629557 8821 test_util.cc:268] Using random seed: -172100742
I20260925 03:03:25.631202 8822 test_util.cc:268] Using random seed: -172099039
I20260925 03:03:25.632889 8823 test_util.cc:268] Using random seed: -172097329
I20260925 03:03:25.634975 8824 test_util.cc:268] Using random seed: -172095333
I20260925 03:03:25.636548 8825 test_util.cc:268] Using random seed: -172093672
I20260925 03:03:25.638221 8826 test_util.cc:268] Using random seed: -172092038
I20260925 03:03:25.639961 8827 test_util.cc:268] Using random seed: -172090292
I20260925 03:03:25.641556 8828 test_util.cc:268] Using random seed: -172088675
I20260925 03:03:25.643333 8829 test_util.cc:268] Using random seed: -172086885
I20260925 03:03:25.644929 8830 test_util.cc:268] Using random seed: -172085327
I20260925 03:03:25.646858 8831 test_util.cc:268] Using random seed: -172083408
[ OK ] Parameters/TestRpc.TestCancellationMultiThreads/SSL_TCP (17020 ms)
[ RUN ] Parameters/TestRpc.TestCallId/SSL_TCP
I20260925 03:03:42.460337 8845 acceptor_pool.cc:254] collecting diagnostics on the listening RPC socket 0.0.0.0:34975 every 8 connection(s)
I20260925 03:03:42.461052 8846 acceptor_pool.cc:254] collecting diagnostics on the listening RPC socket 0.0.0.0:34975 every 8 connection(s)
[ OK ] Parameters/TestRpc.TestCallId/SSL_TCP (92 ms)
[----------] 20 tests from Parameters/TestRpc (36549 ms total)
[----------] Global test environment tear-down
[==========] 21 tests from 2 test suites ran. (36557 ms total)
[ PASSED ] 20 tests.
[ FAILED ] 1 test, listed below:
[ FAILED ] Parameters/TestRpc.TestCallWithChainCertAndRootCA/SSL_TCP, where GetParam() = (true, false)
1 FAILED TEST