Diagnosed failure

Parameters/TestRpc.TestCallWithChainCertAndChainCA/SSL_TCP: /data0/somelongdirectorytoavoidrpathissues/src/kudu/src/kudu/rpc/rpc-test.cc:270: Failure
Failed
Bad status: Runtime error: could not verify certificate chain (error with cert: subject=CN = localhost, ST = sadfjas, C = AS, emailAddress = sdflkdsajf, O = lskdfjlsad, OU = sldfkja, issuer=C = AS, ST = ASDfkjdhf, L = lskdjf, O = saldfja, OU = skdjf, CN = localhost, emailAddress = sadjflkadsj): : certificate has expired
Google Test trace:
/data0/somelongdirectorytoavoidrpathissues/src/kudu/src/kudu/rpc/rpc-test.cc:267: Connecting to 0.0.0.0:37653
I20260929 18:28:57.170393   383 test_util.cc:175] -----------------------------------------------
I20260929 18:28:57.170439   383 test_util.cc:176] Had fatal failures, leaving test files at /tmp/dist-test-taskhB3gzi/test-tmp/rpc-test.5.Parameters_TestRpc.TestCallWithChainCertAndChainCA_SSL_TCP.1790706537093410-383-0

Full log

Note: This is test shard 6 of 8.
[==========] Running 21 tests from 2 test suites.
[----------] Global test environment set-up.
[----------] 20 tests from Parameters/TestRpc
[ RUN      ] Parameters/TestRpc.TestMessengerCreateDestroy/SSL_TCP
WARNING: Logging before InitGoogleLogging() is written to STDERR
I20260929 18:28:57.123215   383 rpc-test.cc:169] started messenger TestCreateDestroy
[       OK ] Parameters/TestRpc.TestMessengerCreateDestroy/SSL_TCP (24 ms)
[ RUN      ] Parameters/TestRpc.TestNegotiationDeadlock/SSL_TCP
I20260929 18:28:57.138489   404 acceptor_pool.cc:254] collecting diagnostics on the listening RPC socket 0.0.0.0:36555 every 8 connection(s)
I20260929 18:28:57.138489   403 acceptor_pool.cc:254] collecting diagnostics on the listening RPC socket 0.0.0.0:36555 every 8 connection(s)
[       OK ] Parameters/TestRpc.TestNegotiationDeadlock/SSL_TCP (24 ms)
[ RUN      ] Parameters/TestRpc.TestCallWithChainCertAndChainCA/SSL_TCP
I20260929 18:28:57.165266   419 acceptor_pool.cc:254] collecting diagnostics on the listening RPC socket 0.0.0.0:37653 every 8 connection(s)
I20260929 18:28:57.165338   420 acceptor_pool.cc:254] collecting diagnostics on the listening RPC socket 0.0.0.0:37653 every 8 connection(s)
/data0/somelongdirectorytoavoidrpathissues/src/kudu/src/kudu/rpc/rpc-test.cc:270: Failure
Failed
Bad status: Runtime error: could not verify certificate chain (error with cert: subject=CN = localhost, ST = sadfjas, C = AS, emailAddress = sdflkdsajf, O = lskdfjlsad, OU = sldfkja, issuer=C = AS, ST = ASDfkjdhf, L = lskdjf, O = saldfja, OU = skdjf, CN = localhost, emailAddress = sadjflkadsj): : certificate has expired
Google Test trace:
/data0/somelongdirectorytoavoidrpathissues/src/kudu/src/kudu/rpc/rpc-test.cc:267: Connecting to 0.0.0.0:37653
I20260929 18:28:57.170393   383 test_util.cc:175] -----------------------------------------------
I20260929 18:28:57.170439   383 test_util.cc:176] Had fatal failures, leaving test files at /tmp/dist-test-taskhB3gzi/test-tmp/rpc-test.5.Parameters_TestRpc.TestCallWithChainCertAndChainCA_SSL_TCP.1790706537093410-383-0
[  FAILED  ] Parameters/TestRpc.TestCallWithChainCertAndChainCA/SSL_TCP, where GetParam() = (true, false) (21 ms)
[ RUN      ] Parameters/TestRpc.TestCallWithPasswordProtectedKey/SSL_TCP
I20260929 18:28:57.197283   444 acceptor_pool.cc:254] collecting diagnostics on the listening RPC socket 0.0.0.0:36407 every 8 connection(s)
I20260929 18:28:57.197299   445 acceptor_pool.cc:254] collecting diagnostics on the listening RPC socket 0.0.0.0:36407 every 8 connection(s)
[       OK ] Parameters/TestRpc.TestCallWithPasswordProtectedKey/SSL_TCP (39 ms)
[ RUN      ] Parameters/TestRpc.TestCallToBadServer/SSL_TCP
I20260929 18:28:57.218618   383 rpc-test.cc:394] Status: Network error: Client connection negotiation failed: client connection to 0.0.0.0:0: connect: Connection refused (error 111)
I20260929 18:28:57.218983   383 rpc-test.cc:394] Status: Network error: Client connection negotiation failed: client connection to 0.0.0.0:0: connect: Connection refused (error 111)
I20260929 18:28:57.219349   383 rpc-test.cc:394] Status: Network error: Client connection negotiation failed: client connection to 0.0.0.0:0: connect: Connection refused (error 111)
I20260929 18:28:57.219771   383 rpc-test.cc:394] Status: Network error: Client connection negotiation failed: client connection to 0.0.0.0:0: connect: Connection refused (error 111)
I20260929 18:28:57.220161   383 rpc-test.cc:394] Status: Network error: Client connection negotiation failed: client connection to 0.0.0.0:0: connect: Connection refused (error 111)
[       OK ] Parameters/TestRpc.TestCallToBadServer/SSL_TCP (10 ms)
[ RUN      ] Parameters/TestRpc.TestWrongService/SSL_TCP
I20260929 18:28:57.236757   479 acceptor_pool.cc:254] collecting diagnostics on the listening RPC socket 0.0.0.0:40429 every 8 connection(s)
I20260929 18:28:57.236805   480 acceptor_pool.cc:254] collecting diagnostics on the listening RPC socket 0.0.0.0:40429 every 8 connection(s)
I20260929 18:28:57.249480   478 messenger.cc:345] service WrongServiceName not registered on TestServer
[       OK ] Parameters/TestRpc.TestWrongService/SSL_TCP (30 ms)
[ RUN      ] Parameters/TestRpc.TestConnectionKeepalive/SSL_TCP
I20260929 18:28:57.260552   502 acceptor_pool.cc:254] collecting diagnostics on the listening RPC socket 0.0.0.0:44779 every 8 connection(s)
I20260929 18:28:57.260605   503 acceptor_pool.cc:254] collecting diagnostics on the listening RPC socket 0.0.0.0:44779 every 8 connection(s)
I20260929 18:28:57.260869   383 rpc-test.cc:488] Connecting to 0.0.0.0:44779
[       OK ] Parameters/TestRpc.TestConnectionKeepalive/SSL_TCP (1026 ms)
[ RUN      ] Parameters/TestRpc.TestClientConnectionMetrics/SSL_TCP
I20260929 18:28:58.295287   527 acceptor_pool.cc:254] collecting diagnostics on the listening RPC socket 0.0.0.0:43859 every 8 connection(s)
I20260929 18:28:58.295297   528 acceptor_pool.cc:254] collecting diagnostics on the listening RPC socket 0.0.0.0:43859 every 8 connection(s)
I20260929 18:28:58.295576   383 rpc-test.cc:569] Connecting to 0.0.0.0:43859
[       OK ] Parameters/TestRpc.TestClientConnectionMetrics/SSL_TCP (13328 ms)
[ RUN      ] Parameters/TestRpc.TestCredentialsPolicy/SSL_TCP
I20260929 18:29:11.625877   550 acceptor_pool.cc:254] collecting diagnostics on the listening RPC socket 0.0.0.0:43985 every 8 connection(s)
I20260929 18:29:11.625918   551 acceptor_pool.cc:254] collecting diagnostics on the listening RPC socket 0.0.0.0:43985 every 8 connection(s)
I20260929 18:29:11.626179   383 rpc-test.cc:700] Connecting to 0.0.0.0:43985
[       OK ] Parameters/TestRpc.TestCredentialsPolicy/SSL_TCP (43 ms)
[ RUN      ] Parameters/TestRpc.TestCallLongerThanKeepalive/SSL_TCP
I20260929 18:29:11.663901   575 acceptor_pool.cc:254] collecting diagnostics on the listening RPC socket 0.0.0.0:38909 every 8 connection(s)
I20260929 18:29:11.663973   576 acceptor_pool.cc:254] collecting diagnostics on the listening RPC socket 0.0.0.0:38909 every 8 connection(s)
I20260929 18:29:11.683332   579 rpc-test-base.h:222] got call: sleep_micros: 3000000 deferred: true
I20260929 18:29:14.684108   579 rpcz_store.cc:275] Call kudu.rpc.GenericCalculatorService.Sleep from 127.0.0.1:47136 (request call id 0) took 3000 ms. Trace:
I20260929 18:29:14.684214   579 rpcz_store.cc:276] 0929 18:29:11.683263 (+     0us) service_pool.cc:170] Inserting onto call queue
0929 18:29:11.683309 (+    46us) service_pool.cc:227] Handling call
0929 18:29:14.684090 (+3000781us) inbound_call.cc:173] Queueing success response
Metrics: {}
[       OK ] Parameters/TestRpc.TestCallLongerThanKeepalive/SSL_TCP (3036 ms)
[ RUN      ] Parameters/TestRpc.TestRpcSidecar/SSL_TCP
I20260929 18:29:14.697471   600 acceptor_pool.cc:254] collecting diagnostics on the listening RPC socket 0.0.0.0:45939 every 8 connection(s)
I20260929 18:29:14.697552   601 acceptor_pool.cc:254] collecting diagnostics on the listening RPC socket 0.0.0.0:45939 every 8 connection(s)
[       OK ] Parameters/TestRpc.TestRpcSidecar/SSL_TCP (59 ms)
[ RUN      ] Parameters/TestRpc.TestRpcSidecarLimits/SSL_TCP
I20260929 18:29:16.378036   625 acceptor_pool.cc:254] collecting diagnostics on the listening RPC socket 0.0.0.0:43309 every 8 connection(s)
I20260929 18:29:16.378077   626 acceptor_pool.cc:254] collecting diagnostics on the listening RPC socket 0.0.0.0:43309 every 8 connection(s)
W20260929 18:29:16.390709   383 serialization.cc:72] Serialized kudu.rpc_test.PushStringsRequestPB (2147483654 bytes) is larger than the maximum configured RPC message size (52428800 bytes). Sending anyway, but peer may reject the data.
W20260929 18:29:16.394450   622 connection.cc:535] server connection from 127.0.0.1:43396 recv error: Network error: RPC frame had a length of 2147483714, but we only support messages up to 52428800 bytes long.
W20260929 18:29:16.394507   622 connection.cc:158] shutting down server connection from 127.0.0.1:43396 with pending inbound data: 4/2147483714 bytes received; last active 0 ns ago: status Network error: RPC frame had a length of 2147483714, but we only support messages up to 52428800 bytes long.
W20260929 18:29:16.394775   638 connection.cc:196] Error closing socket: Network error: TlsSocket::Close: Connection reset by peer
I20260929 18:29:16.414350   650 acceptor_pool.cc:254] collecting diagnostics on the listening RPC socket 0.0.0.0:44713 every 8 connection(s)
I20260929 18:29:16.414541   651 acceptor_pool.cc:254] collecting diagnostics on the listening RPC socket 0.0.0.0:44713 every 8 connection(s)
W20260929 18:29:20.304304   647 connection.cc:577] server connection from 127.0.0.1:59650: received bad data: 'Corruption: Invalid packet: message had a length of 2147483710, but we only support messages up to 2147483647 bytes
'
[       OK ] Parameters/TestRpc.TestRpcSidecarLimits/SSL_TCP (5560 ms)
[ RUN      ] Parameters/TestRpc.TestCallTimeoutDoesntAffectNegotiation/SSL_TCP
I20260929 18:29:20.313874   675 acceptor_pool.cc:254] collecting diagnostics on the listening RPC socket 0.0.0.0:45285 every 8 connection(s)
I20260929 18:29:20.313980   676 acceptor_pool.cc:254] collecting diagnostics on the listening RPC socket 0.0.0.0:45285 every 8 connection(s)
W20260929 18:29:20.321022   671 negotiation.cc:266] Injecting 500ms delay in negotiation
I20260929 18:29:20.371316   383 rpc-test-base.h:595] status: Timed out: connection negotiation to 0.0.0.0:45285 for RPC Sleep timed out after 0.050s (ON_OUTBOUND_QUEUE), seconds elapsed: 0.0506494
[       OK ] Parameters/TestRpc.TestCallTimeoutDoesntAffectNegotiation/SSL_TCP (519 ms)
[ RUN      ] Parameters/TestRpc.TestRpcHandlerLatencyMetric/SSL_TCP
I20260929 18:29:20.838186   700 acceptor_pool.cc:254] collecting diagnostics on the listening RPC socket 0.0.0.0:34469 every 8 connection(s)
I20260929 18:29:20.838297   701 acceptor_pool.cc:254] collecting diagnostics on the listening RPC socket 0.0.0.0:34469 every 8 connection(s)
I20260929 18:29:20.887662   383 rpc-test.cc:1236] Sleep() min lat: 20290
I20260929 18:29:20.887732   383 rpc-test.cc:1237] Sleep() mean lat: 20290
I20260929 18:29:20.887781   383 rpc-test.cc:1238] Sleep() max lat: 20290
I20260929 18:29:20.887809   383 rpc-test.cc:1239] Sleep() #calls: 1
[       OK ] Parameters/TestRpc.TestRpcHandlerLatencyMetric/SSL_TCP (62 ms)
[ RUN      ] Parameters/TestRpc.TimedOutOnResponseMetricServiceQueue/SSL_TCP
I20260929 18:29:20.913664   726 acceptor_pool.cc:254] collecting diagnostics on the listening RPC socket 0.0.0.0:42679 every 8 connection(s)
I20260929 18:29:20.913709   727 acceptor_pool.cc:254] collecting diagnostics on the listening RPC socket 0.0.0.0:42679 every 8 connection(s)
W20260929 18:29:20.967504   728 rpcz_store.cc:267] Call kudu.rpc_test.CalculatorService.Sleep from 127.0.0.1:37368 (request call id 2) took 20 ms (client timeout 20 ms). Trace:
W20260929 18:29:20.967607   728 rpcz_store.cc:269] 0929 18:29:20.947252 (+     0us) service_pool.cc:170] Inserting onto call queue
0929 18:29:20.967474 (+ 20222us) service_pool.cc:214] Skipping call since client already timed out
0929 18:29:20.967493 (+    19us) inbound_call.cc:173] Queueing failure response
Metrics: {}
[       OK ] Parameters/TestRpc.TimedOutOnResponseMetricServiceQueue/SSL_TCP (79 ms)
[ RUN      ] Parameters/TestRpc.RpcPendingConnectionsMetric/SSL_TCP
I20260929 18:29:20.971385   749 acceptor_pool.cc:254] collecting diagnostics on the listening RPC socket 0.0.0.0:44941 every 8 connection(s)
I20260929 18:29:20.971441   750 acceptor_pool.cc:254] collecting diagnostics on the listening RPC socket 0.0.0.0:44941 every 8 connection(s)
W20260929 18:29:20.981202   745 negotiation.cc:337] Failed RPC negotiation. Trace:
0929 18:29:20.979549 (+     0us) reactor.cc:625] Submitting negotiation task for server connection from 127.0.0.1:52614 (local address 127.0.0.1:44941)
0929 18:29:20.980854 (+  1305us) server_negotiation.cc:206] Beginning negotiation
0929 18:29:20.980859 (+     5us) server_negotiation.cc:399] Waiting for connection header
0929 18:29:20.980965 (+   106us) negotiation.cc:327] Negotiation complete: Network error: Server connection negotiation failed: server connection from 127.0.0.1:52614: BlockingRecv error: recv got EOF from 127.0.0.1:52614 (error 108)
Metrics: {"server-negotiator.queue_time_us":1212}
[       OK ] Parameters/TestRpc.RpcPendingConnectionsMetric/SSL_TCP (21 ms)
[ RUN      ] Parameters/TestRpc.TestRpcContextClientDeadline/SSL_TCP
I20260929 18:29:20.999509   765 acceptor_pool.cc:254] collecting diagnostics on the listening RPC socket 0.0.0.0:37839 every 8 connection(s)
I20260929 18:29:20.999557   766 acceptor_pool.cc:254] collecting diagnostics on the listening RPC socket 0.0.0.0:37839 every 8 connection(s)
[       OK ] Parameters/TestRpc.TestRpcContextClientDeadline/SSL_TCP (42 ms)
[ RUN      ] Parameters/TestRpc.TestApplicationFeatureFlagUnsupportedServer/SSL_TCP
I20260929 18:29:21.066314   790 acceptor_pool.cc:254] collecting diagnostics on the listening RPC socket 0.0.0.0:38757 every 8 connection(s)
I20260929 18:29:21.066378   791 acceptor_pool.cc:254] collecting diagnostics on the listening RPC socket 0.0.0.0:38757 every 8 connection(s)
[       OK ] Parameters/TestRpc.TestApplicationFeatureFlagUnsupportedServer/SSL_TCP (53 ms)
[ RUN      ] Parameters/TestRpc.TestCancellationAsync/SSL_TCP
I20260929 18:29:21.110939   815 acceptor_pool.cc:254] collecting diagnostics on the listening RPC socket 0.0.0.0:44101 every 8 connection(s)
I20260929 18:29:21.110975   816 acceptor_pool.cc:254] collecting diagnostics on the listening RPC socket 0.0.0.0:44101 every 8 connection(s)
I20260929 18:29:21.111279   383 rpc-test.cc:1716] Connecting to 0.0.0.0:44101
I20260929 18:29:21.133699   383 test_util.cc:268] Using random seed: 1551445122
I20260929 18:29:21.152477   819 rpc-test-base.h:240] got call: sleep_micros: 500 pattern: 4294967295 num_repetitions: 2097152 sidecar_idx: 0
I20260929 18:29:21.171563   818 rpc-test-base.h:240] got call: sleep_micros: 500 pattern: 4294967295 num_repetitions: 2097152 sidecar_idx: 0
I20260929 18:29:21.186767   819 rpc-test-base.h:240] got call: sleep_micros: 500 pattern: 4294967295 num_repetitions: 2097152 sidecar_idx: 0
I20260929 18:29:21.202589   818 rpc-test-base.h:240] got call: sleep_micros: 500 pattern: 4294967295 num_repetitions: 2097152 sidecar_idx: 0
I20260929 18:29:21.224617   819 rpc-test-base.h:240] got call: sleep_micros: 500 pattern: 4294967295 num_repetitions: 2097152 sidecar_idx: 0
I20260929 18:29:21.240391   818 rpc-test-base.h:240] got call: sleep_micros: 500 pattern: 4294967295 num_repetitions: 2097152 sidecar_idx: 0
W20260929 18:29:21.265134   812 connection.cc:196] Error closing socket: Network error: TlsSocket::Close: Broken pipe
W20260929 18:29:21.268766   812 connection.cc:441] server connection from 127.0.0.1:37266 torn down before Call kudu.rpc.GenericCalculatorService.SleepWithSidecar from 127.0.0.1:37266 (request call id 8) could send its response
[       OK ] Parameters/TestRpc.TestCancellationAsync/SSL_TCP (183 ms)
[ RUN      ] Parameters/TestRpc.TestPerformanceBySocketType/SSL_TCP
I20260929 18:29:21.280536   840 acceptor_pool.cc:254] collecting diagnostics on the listening RPC socket 0.0.0.0:41905 every 8 connection(s)
I20260929 18:29:21.280606   841 acceptor_pool.cc:254] collecting diagnostics on the listening RPC socket 0.0.0.0:41905 every 8 connection(s)
I20260929 18:29:21.280895   383 rpc-test.cc:1846] Connecting to 0.0.0.0:41905
I20260929 18:29:23.369112   383 rpc-test.cc:1859] Sending 1024MB via ssl-enabled tcp socket: real 2.047s	user 2.163s	sys 1.502s
I20260929 18:29:25.455332   383 rpc-test.cc:1859] Sending 1024MB via ssl-enabled tcp socket: real 2.086s	user 2.179s	sys 1.540s
I20260929 18:29:27.505939   383 rpc-test.cc:1859] Sending 1024MB via ssl-enabled tcp socket: real 2.051s	user 2.057s	sys 1.591s
I20260929 18:29:29.586364   383 rpc-test.cc:1859] Sending 1024MB via ssl-enabled tcp socket: real 2.080s	user 2.032s	sys 1.671s
I20260929 18:29:31.637341   383 rpc-test.cc:1859] Sending 1024MB via ssl-enabled tcp socket: real 2.051s	user 2.025s	sys 1.623s
[       OK ] Parameters/TestRpc.TestPerformanceBySocketType/SSL_TCP (10369 ms)
[----------] 20 tests from Parameters/TestRpc (34539 ms total)

[----------] 1 test from Parameters/TestRpcSocketTxRxQueue
[ RUN      ] Parameters/TestRpcSocketTxRxQueue.OverCapacity/0
W20260929 18:29:31.908618   875 negotiation.cc:337] Failed RPC negotiation. Trace:
0929 18:29:31.644017 (+     0us) reactor.cc:625] Submitting negotiation task for client connection to 0.0.0.0:44865 (local address 127.0.0.1:44282)
0929 18:29:31.644123 (+   106us) negotiation.cc:107] Waiting for socket to connect
0929 18:29:31.644135 (+    12us) client_negotiation.cc:174] Beginning negotiation
0929 18:29:31.644217 (+    82us) client_negotiation.cc:252] Sending NEGOTIATE NegotiatePB request
0929 18:29:31.908416 (+264199us) negotiation.cc:327] Negotiation complete: Network error: Client connection negotiation failed: client connection to 0.0.0.0:44865: BlockingRecv error: recv error from unknown peer: Transport endpoint is not connected (error 107)
Metrics: {"client-negotiator.queue_time_us":42}
W20260929 18:29:31.908727   884 negotiation.cc:337] Failed RPC negotiation. Trace:
0929 18:29:31.645095 (+     0us) reactor.cc:625] Submitting negotiation task for client connection to 0.0.0.0:44865 (local address 127.0.0.1:44288)
0929 18:29:31.645199 (+   104us) negotiation.cc:107] Waiting for socket to connect
0929 18:29:31.645213 (+    14us) client_negotiation.cc:174] Beginning negotiation
0929 18:29:31.645287 (+    74us) client_negotiation.cc:252] Sending NEGOTIATE NegotiatePB request
0929 18:29:31.908416 (+263129us) negotiation.cc:327] Negotiation complete: Network error: Client connection negotiation failed: client connection to 0.0.0.0:44865: BlockingRecv error: recv error from unknown peer: Transport endpoint is not connected (error 107)
Metrics: {"client-negotiator.queue_time_us":22}
W20260929 18:29:31.908617   893 negotiation.cc:337] Failed RPC negotiation. Trace:
0929 18:29:31.646135 (+     0us) reactor.cc:625] Submitting negotiation task for client connection to 0.0.0.0:44865 (local address 127.0.0.1:44300)
0929 18:29:31.646240 (+   105us) negotiation.cc:107] Waiting for socket to connect
0929 18:29:31.646253 (+    13us) client_negotiation.cc:174] Beginning negotiation
0929 18:29:31.646340 (+    87us) client_negotiation.cc:252] Sending NEGOTIATE NegotiatePB request
0929 18:29:31.908531 (+262191us) negotiation.cc:327] Negotiation complete: Network error: Client connection negotiation failed: client connection to 0.0.0.0:44865: BlockingRecv error: recv error from unknown peer: Transport endpoint is not connected (error 107)
Metrics: {"client-negotiator.queue_time_us":29}
W20260929 18:29:31.908891   857 negotiation.cc:337] Failed RPC negotiation. Trace:
0929 18:29:31.641546 (+     0us) reactor.cc:625] Submitting negotiation task for client connection to 0.0.0.0:44865 (local address 127.0.0.1:44254)
0929 18:29:31.641890 (+   344us) negotiation.cc:107] Waiting for socket to connect
0929 18:29:31.641902 (+    12us) client_negotiation.cc:174] Beginning negotiation
0929 18:29:31.641993 (+    91us) client_negotiation.cc:252] Sending NEGOTIATE NegotiatePB request
0929 18:29:31.908416 (+266423us) negotiation.cc:327] Negotiation complete: Network error: Client connection negotiation failed: client connection to 0.0.0.0:44865: BlockingRecv error: recv error from unknown peer: Transport endpoint is not connected (error 107)
Metrics: {"client-negotiator.queue_time_us":267}
W20260929 18:29:31.908617   902 negotiation.cc:337] Failed RPC negotiation. Trace:
0929 18:29:31.647234 (+     0us) reactor.cc:625] Submitting negotiation task for client connection to 0.0.0.0:44865 (local address 127.0.0.1:44302)
0929 18:29:31.647319 (+    85us) negotiation.cc:107] Waiting for socket to connect
0929 18:29:31.647347 (+    28us) client_negotiation.cc:174] Beginning negotiation
0929 18:29:31.647419 (+    72us) client_negotiation.cc:252] Sending NEGOTIATE NegotiatePB request
0929 18:29:31.908544 (+261125us) negotiation.cc:327] Negotiation complete: Network error: Client connection negotiation failed: client connection to 0.0.0.0:44865: BlockingRecv error: recv error from unknown peer: Transport endpoint is not connected (error 107)
Metrics: {"client-negotiator.queue_time_us":25}
W20260929 18:29:31.909101   866 negotiation.cc:337] Failed RPC negotiation. Trace:
0929 18:29:31.642904 (+     0us) reactor.cc:625] Submitting negotiation task for client connection to 0.0.0.0:44865 (local address 127.0.0.1:44266)
0929 18:29:31.643010 (+   106us) negotiation.cc:107] Waiting for socket to connect
0929 18:29:31.643022 (+    12us) client_negotiation.cc:174] Beginning negotiation
0929 18:29:31.643095 (+    73us) client_negotiation.cc:252] Sending NEGOTIATE NegotiatePB request
0929 18:29:31.908416 (+265321us) negotiation.cc:327] Negotiation complete: Network error: Client connection negotiation failed: client connection to 0.0.0.0:44865: BlockingRecv error: recv error from unknown peer: Transport endpoint is not connected (error 107)
Metrics: {"client-negotiator.queue_time_us":24}
[       OK ] Parameters/TestRpcSocketTxRxQueue.OverCapacity/0 (1025 ms)
[----------] 1 test from Parameters/TestRpcSocketTxRxQueue (1025 ms total)

[----------] Global test environment tear-down
[==========] 21 tests from 2 test suites ran. (35565 ms total)
[  PASSED  ] 20 tests.
[  FAILED  ] 1 test, listed below:
[  FAILED  ] Parameters/TestRpc.TestCallWithChainCertAndChainCA/SSL_TCP, where GetParam() = (true, false)

 1 FAILED TEST