Diagnosed failure
Parameters/TestRpc.TestCallWithChainCertAndChainCA/SSL_UnixSocket: /data0/somelongdirectorytoavoidrpathissues/src/kudu/src/kudu/rpc/rpc-test.cc:270: Failure
Failed
Bad status: Runtime error: could not verify certificate chain (error with cert: subject=CN = localhost, ST = sadfjas, C = AS, emailAddress = sdflkdsajf, O = lskdfjlsad, OU = sldfkja, issuer=C = AS, ST = ASDfkjdhf, L = lskdjf, O = saldfja, OU = skdjf, CN = localhost, emailAddress = sadjflkadsj): : certificate has expired
Google Test trace:
/data0/somelongdirectorytoavoidrpathissues/src/kudu/src/kudu/rpc/rpc-test.cc:267: Connecting to unix:/tmp/dist-test-taskZ95oxJ/test-tmp/rpc-test-59d94b79a3d34c0abf786daabc8a92d4.sock
I20260929 10:50:58.929738 21678 test_util.cc:175] -----------------------------------------------
I20260929 10:50:58.929803 21678 test_util.cc:176] Had fatal failures, leaving test files at /tmp/dist-test-taskZ95oxJ/test-tmp/rpc-test.6.Parameters_TestRpc.TestCallWithChainCertAndChainCA_SSL_UnixSocket.1790679058856562-21678-0
Full log
Note: This is test shard 7 of 8.
[==========] Running 21 tests from 2 test suites.
[----------] Global test environment set-up.
[----------] 20 tests from Parameters/TestRpc
[ RUN ] Parameters/TestRpc.TestMessengerCreateDestroy/SSL_UnixSocket
WARNING: Logging before InitGoogleLogging() is written to STDERR
I20260929 10:50:58.896435 21678 rpc-test.cc:169] started messenger TestCreateDestroy
[ OK ] Parameters/TestRpc.TestMessengerCreateDestroy/SSL_UnixSocket (38 ms)
[ RUN ] Parameters/TestRpc.TestNegotiationDeadlock/SSL_UnixSocket
I20260929 10:50:58.906638 21698 acceptor_pool.cc:254] collecting diagnostics on the listening RPC socket unix:/tmp/dist-test-taskZ95oxJ/test-tmp/rpc-test-6e1ca01e451140f0a058b896917f972e.sock every 8 connection(s)
I20260929 10:50:58.906683 21699 acceptor_pool.cc:254] collecting diagnostics on the listening RPC socket unix:/tmp/dist-test-taskZ95oxJ/test-tmp/rpc-test-6e1ca01e451140f0a058b896917f972e.sock every 8 connection(s)
[ OK ] Parameters/TestRpc.TestNegotiationDeadlock/SSL_UnixSocket (15 ms)
[ RUN ] Parameters/TestRpc.TestCallWithChainCertAndChainCA/SSL_UnixSocket
I20260929 10:50:58.926095 21714 acceptor_pool.cc:254] collecting diagnostics on the listening RPC socket unix:/tmp/dist-test-taskZ95oxJ/test-tmp/rpc-test-59d94b79a3d34c0abf786daabc8a92d4.sock every 8 connection(s)
I20260929 10:50:58.926123 21715 acceptor_pool.cc:254] collecting diagnostics on the listening RPC socket unix:/tmp/dist-test-taskZ95oxJ/test-tmp/rpc-test-59d94b79a3d34c0abf786daabc8a92d4.sock every 8 connection(s)
/data0/somelongdirectorytoavoidrpathissues/src/kudu/src/kudu/rpc/rpc-test.cc:270: Failure
Failed
Bad status: Runtime error: could not verify certificate chain (error with cert: subject=CN = localhost, ST = sadfjas, C = AS, emailAddress = sdflkdsajf, O = lskdfjlsad, OU = sldfkja, issuer=C = AS, ST = ASDfkjdhf, L = lskdjf, O = saldfja, OU = skdjf, CN = localhost, emailAddress = sadjflkadsj): : certificate has expired
Google Test trace:
/data0/somelongdirectorytoavoidrpathissues/src/kudu/src/kudu/rpc/rpc-test.cc:267: Connecting to unix:/tmp/dist-test-taskZ95oxJ/test-tmp/rpc-test-59d94b79a3d34c0abf786daabc8a92d4.sock
I20260929 10:50:58.929738 21678 test_util.cc:175] -----------------------------------------------
I20260929 10:50:58.929803 21678 test_util.cc:176] Had fatal failures, leaving test files at /tmp/dist-test-taskZ95oxJ/test-tmp/rpc-test.6.Parameters_TestRpc.TestCallWithChainCertAndChainCA_SSL_UnixSocket.1790679058856562-21678-0
[ FAILED ] Parameters/TestRpc.TestCallWithChainCertAndChainCA/SSL_UnixSocket, where GetParam() = (true, true) (16 ms)
[ RUN ] Parameters/TestRpc.TestCallWithPasswordProtectedKey/SSL_UnixSocket
I20260929 10:50:58.954739 21739 acceptor_pool.cc:254] collecting diagnostics on the listening RPC socket unix:/tmp/dist-test-taskZ95oxJ/test-tmp/rpc-test-5f5362dbdbea43ab96227cbb0385f81e.sock every 8 connection(s)
I20260929 10:50:58.954770 21740 acceptor_pool.cc:254] collecting diagnostics on the listening RPC socket unix:/tmp/dist-test-taskZ95oxJ/test-tmp/rpc-test-5f5362dbdbea43ab96227cbb0385f81e.sock every 8 connection(s)
W20260929 10:50:58.966300 21736 connection.cc:196] Error closing socket: Network error: TlsSocket::Close: Broken pipe
[ OK ] Parameters/TestRpc.TestCallWithPasswordProtectedKey/SSL_UnixSocket (37 ms)
[ RUN ] Parameters/TestRpc.TestCallToBadServer/SSL_UnixSocket
I20260929 10:50:58.973699 21678 rpc-test.cc:394] Status: Network error: Client connection negotiation failed: client connection to 0.0.0.0:0: connect: Connection refused (error 111)
I20260929 10:50:58.973887 21678 rpc-test.cc:394] Status: Network error: Client connection negotiation failed: client connection to 0.0.0.0:0: connect: Connection refused (error 111)
I20260929 10:50:58.974037 21678 rpc-test.cc:394] Status: Network error: Client connection negotiation failed: client connection to 0.0.0.0:0: connect: Connection refused (error 111)
I20260929 10:50:58.974174 21678 rpc-test.cc:394] Status: Network error: Client connection negotiation failed: client connection to 0.0.0.0:0: connect: Connection refused (error 111)
I20260929 10:50:58.974306 21678 rpc-test.cc:394] Status: Network error: Client connection negotiation failed: client connection to 0.0.0.0:0: connect: Connection refused (error 111)
[ OK ] Parameters/TestRpc.TestCallToBadServer/SSL_UnixSocket (7 ms)
[ RUN ] Parameters/TestRpc.TestWrongService/SSL_UnixSocket
I20260929 10:50:58.995339 21774 acceptor_pool.cc:254] collecting diagnostics on the listening RPC socket unix:/tmp/dist-test-taskZ95oxJ/test-tmp/rpc-test-d1942bfa7bd14d9abcbafed43db90ee8.sock every 8 connection(s)
I20260929 10:50:58.995358 21775 acceptor_pool.cc:254] collecting diagnostics on the listening RPC socket unix:/tmp/dist-test-taskZ95oxJ/test-tmp/rpc-test-d1942bfa7bd14d9abcbafed43db90ee8.sock every 8 connection(s)
I20260929 10:50:59.005378 21771 messenger.cc:345] service WrongServiceName not registered on TestServer
[ OK ] Parameters/TestRpc.TestWrongService/SSL_UnixSocket (32 ms)
[ RUN ] Parameters/TestRpc.TestConnectionKeepalive/SSL_UnixSocket
I20260929 10:50:59.041220 21797 acceptor_pool.cc:254] collecting diagnostics on the listening RPC socket unix:/tmp/dist-test-taskZ95oxJ/test-tmp/rpc-test-9a291a600ee440ea9edf36458521e250.sock every 8 connection(s)
I20260929 10:50:59.041255 21798 acceptor_pool.cc:254] collecting diagnostics on the listening RPC socket unix:/tmp/dist-test-taskZ95oxJ/test-tmp/rpc-test-9a291a600ee440ea9edf36458521e250.sock every 8 connection(s)
I20260929 10:50:59.041379 21678 rpc-test.cc:488] Connecting to unix:/tmp/dist-test-taskZ95oxJ/test-tmp/rpc-test-9a291a600ee440ea9edf36458521e250.sock
W20260929 10:50:59.508881 21810 connection.cc:196] Error closing socket: Network error: TlsSocket::Close: Broken pipe
[ OK ] Parameters/TestRpc.TestConnectionKeepalive/SSL_UnixSocket (1061 ms)
[ RUN ] Parameters/TestRpc.TestClientConnectionMetrics/SSL_UnixSocket
I20260929 10:51:00.102900 21822 acceptor_pool.cc:254] collecting diagnostics on the listening RPC socket unix:/tmp/dist-test-taskZ95oxJ/test-tmp/rpc-test-4ec8b6f9fa764a3b8dc5d7b69052d15d.sock every 8 connection(s)
I20260929 10:51:00.102947 21823 acceptor_pool.cc:254] collecting diagnostics on the listening RPC socket unix:/tmp/dist-test-taskZ95oxJ/test-tmp/rpc-test-4ec8b6f9fa764a3b8dc5d7b69052d15d.sock every 8 connection(s)
I20260929 10:51:00.103080 21678 rpc-test.cc:569] Connecting to unix:/tmp/dist-test-taskZ95oxJ/test-tmp/rpc-test-4ec8b6f9fa764a3b8dc5d7b69052d15d.sock
W20260929 10:51:08.079345 21819 connection.cc:196] Error closing socket: Network error: TlsSocket::Close: Broken pipe
[ OK ] Parameters/TestRpc.TestClientConnectionMetrics/SSL_UnixSocket (8012 ms)
[ RUN ] Parameters/TestRpc.TestCredentialsPolicy/SSL_UnixSocket
I20260929 10:51:08.114219 21845 acceptor_pool.cc:254] collecting diagnostics on the listening RPC socket unix:/tmp/dist-test-taskZ95oxJ/test-tmp/rpc-test-d4225e958b884e3aafc432239ef9d25c.sock every 8 connection(s)
I20260929 10:51:08.114271 21846 acceptor_pool.cc:254] collecting diagnostics on the listening RPC socket unix:/tmp/dist-test-taskZ95oxJ/test-tmp/rpc-test-d4225e958b884e3aafc432239ef9d25c.sock every 8 connection(s)
I20260929 10:51:08.114396 21678 rpc-test.cc:700] Connecting to unix:/tmp/dist-test-taskZ95oxJ/test-tmp/rpc-test-d4225e958b884e3aafc432239ef9d25c.sock
W20260929 10:51:08.140568 21844 connection.cc:196] Error closing socket: Network error: TlsSocket::Close: Broken pipe
[ OK ] Parameters/TestRpc.TestCredentialsPolicy/SSL_UnixSocket (64 ms)
[ RUN ] Parameters/TestRpc.TestCallLongerThanKeepalive/SSL_UnixSocket
I20260929 10:51:08.172538 21870 acceptor_pool.cc:254] collecting diagnostics on the listening RPC socket unix:/tmp/dist-test-taskZ95oxJ/test-tmp/rpc-test-aafbe34a17c34f10b9fef598cefed079.sock every 8 connection(s)
I20260929 10:51:08.172590 21871 acceptor_pool.cc:254] collecting diagnostics on the listening RPC socket unix:/tmp/dist-test-taskZ95oxJ/test-tmp/rpc-test-aafbe34a17c34f10b9fef598cefed079.sock every 8 connection(s)
I20260929 10:51:08.185642 21874 rpc-test-base.h:222] got call: sleep_micros: 3000000 deferred: true
I20260929 10:51:11.186358 21874 rpcz_store.cc:275] Call kudu.rpc.GenericCalculatorService.Sleep from unix:<unnamed> (request call id 0) took 3000 ms. Trace:
I20260929 10:51:11.186462 21874 rpcz_store.cc:276] 0929 10:51:08.185532 (+ 0us) service_pool.cc:170] Inserting onto call queue
0929 10:51:08.185619 (+ 87us) service_pool.cc:227] Handling call
0929 10:51:11.186341 (+3000722us) inbound_call.cc:173] Queueing success response
Metrics: {}
W20260929 10:51:11.187361 21867 connection.cc:196] Error closing socket: Network error: TlsSocket::Close: Broken pipe
[ OK ] Parameters/TestRpc.TestCallLongerThanKeepalive/SSL_UnixSocket (3043 ms)
[ RUN ] Parameters/TestRpc.TestRpcSidecar/SSL_UnixSocket
I20260929 10:51:11.206243 21895 acceptor_pool.cc:254] collecting diagnostics on the listening RPC socket unix:/tmp/dist-test-taskZ95oxJ/test-tmp/rpc-test-52a8a797ab6f4bbd8ada12eb6e2735e6.sock every 8 connection(s)
I20260929 10:51:11.206284 21896 acceptor_pool.cc:254] collecting diagnostics on the listening RPC socket unix:/tmp/dist-test-taskZ95oxJ/test-tmp/rpc-test-52a8a797ab6f4bbd8ada12eb6e2735e6.sock every 8 connection(s)
[ OK ] Parameters/TestRpc.TestRpcSidecar/SSL_UnixSocket (64 ms)
[ RUN ] Parameters/TestRpc.TestRpcSidecarLimits/SSL_UnixSocket
I20260929 10:51:12.795656 21920 acceptor_pool.cc:254] collecting diagnostics on the listening RPC socket unix:/tmp/dist-test-taskZ95oxJ/test-tmp/rpc-test-fa383cd555a440c48ad911dee2756d0e.sock every 8 connection(s)
I20260929 10:51:12.795679 21921 acceptor_pool.cc:254] collecting diagnostics on the listening RPC socket unix:/tmp/dist-test-taskZ95oxJ/test-tmp/rpc-test-fa383cd555a440c48ad911dee2756d0e.sock every 8 connection(s)
W20260929 10:51:12.811110 21678 serialization.cc:72] Serialized kudu.rpc_test.PushStringsRequestPB (2147483654 bytes) is larger than the maximum configured RPC message size (52428800 bytes). Sending anyway, but peer may reject the data.
W20260929 10:51:12.814108 21917 connection.cc:535] server connection from unix:<unnamed> recv error: Network error: RPC frame had a length of 2147483714, but we only support messages up to 52428800 bytes long.
W20260929 10:51:12.814175 21917 connection.cc:158] shutting down server connection from unix:<unnamed> with pending inbound data: 4/2147483714 bytes received; last active 0 ns ago: status Network error: RPC frame had a length of 2147483714, but we only support messages up to 52428800 bytes long.
W20260929 10:51:12.814289 21933 connection.cc:698] client connection to unix:/tmp/dist-test-taskZ95oxJ/test-tmp/rpc-test-fa383cd555a440c48ad911dee2756d0e.sock send error: Network error: failed to write to TLS socket: Broken pipe
W20260929 10:51:12.814388 21933 connection.cc:196] Error closing socket: Network error: TlsSocket::Close: Success
I20260929 10:51:12.826196 21946 acceptor_pool.cc:254] collecting diagnostics on the listening RPC socket unix:/tmp/dist-test-taskZ95oxJ/test-tmp/rpc-test-fa383cd555a440c48ad911dee2756d0e.sock every 8 connection(s)
I20260929 10:51:12.826217 21945 acceptor_pool.cc:254] collecting diagnostics on the listening RPC socket unix:/tmp/dist-test-taskZ95oxJ/test-tmp/rpc-test-fa383cd555a440c48ad911dee2756d0e.sock every 8 connection(s)
W20260929 10:51:17.008278 21942 connection.cc:577] server connection from unix:<unnamed>: received bad data: 'Corruption: Invalid packet: message had a length of 2147483710, but we only support messages up to 2147483647 bytes
'
W20260929 10:51:17.008569 21958 connection.cc:196] Error closing socket: Network error: TlsSocket::Close: Broken pipe
[ OK ] Parameters/TestRpc.TestRpcSidecarLimits/SSL_UnixSocket (5757 ms)
[ RUN ] Parameters/TestRpc.TestCallTimeoutDoesntAffectNegotiation/SSL_UnixSocket
I20260929 10:51:17.027268 21970 acceptor_pool.cc:254] collecting diagnostics on the listening RPC socket unix:/tmp/dist-test-taskZ95oxJ/test-tmp/rpc-test-f783f202b7cc4332933d87ff67591f0a.sock every 8 connection(s)
I20260929 10:51:17.027326 21971 acceptor_pool.cc:254] collecting diagnostics on the listening RPC socket unix:/tmp/dist-test-taskZ95oxJ/test-tmp/rpc-test-f783f202b7cc4332933d87ff67591f0a.sock every 8 connection(s)
W20260929 10:51:17.051723 21964 negotiation.cc:266] Injecting 500ms delay in negotiation
I20260929 10:51:17.101882 21678 rpc-test-base.h:595] status: Timed out: connection negotiation to unix:/tmp/dist-test-taskZ95oxJ/test-tmp/rpc-test-f783f202b7cc4332933d87ff67591f0a.sock for RPC Sleep timed out after 0.050s (ON_OUTBOUND_QUEUE), seconds elapsed: 0.0505372
[ OK ] Parameters/TestRpc.TestCallTimeoutDoesntAffectNegotiation/SSL_UnixSocket (545 ms)
[ RUN ] Parameters/TestRpc.TestRpcHandlerLatencyMetric/SSL_UnixSocket
I20260929 10:51:17.570731 21995 acceptor_pool.cc:254] collecting diagnostics on the listening RPC socket unix:/tmp/dist-test-taskZ95oxJ/test-tmp/rpc-test-9f0f679388de40c19e8b6532e3b55143.sock every 8 connection(s)
I20260929 10:51:17.570751 21996 acceptor_pool.cc:254] collecting diagnostics on the listening RPC socket unix:/tmp/dist-test-taskZ95oxJ/test-tmp/rpc-test-9f0f679388de40c19e8b6532e3b55143.sock every 8 connection(s)
I20260929 10:51:17.599651 21678 rpc-test.cc:1236] Sleep() min lat: 20399
I20260929 10:51:17.599740 21678 rpc-test.cc:1237] Sleep() mean lat: 20399
I20260929 10:51:17.599766 21678 rpc-test.cc:1238] Sleep() max lat: 20399
I20260929 10:51:17.599777 21678 rpc-test.cc:1239] Sleep() #calls: 1
[ OK ] Parameters/TestRpc.TestRpcHandlerLatencyMetric/SSL_UnixSocket (44 ms)
[ RUN ] Parameters/TestRpc.TimedOutOnResponseMetricServiceQueue/SSL_UnixSocket
I20260929 10:51:17.624599 22021 acceptor_pool.cc:254] collecting diagnostics on the listening RPC socket unix:/tmp/dist-test-taskZ95oxJ/test-tmp/rpc-test-f4a3b6d1a3714e8793311adaa1cf80d3.sock every 8 connection(s)
I20260929 10:51:17.624627 22022 acceptor_pool.cc:254] collecting diagnostics on the listening RPC socket unix:/tmp/dist-test-taskZ95oxJ/test-tmp/rpc-test-f4a3b6d1a3714e8793311adaa1cf80d3.sock every 8 connection(s)
W20260929 10:51:17.680395 22023 rpcz_store.cc:267] Call kudu.rpc_test.CalculatorService.Sleep from unix:<unnamed> (request call id 2) took 20 ms (client timeout 20 ms). Trace:
W20260929 10:51:17.680508 22023 rpcz_store.cc:269] 0929 10:51:17.660114 (+ 0us) service_pool.cc:170] Inserting onto call queue
0929 10:51:17.680338 (+ 20224us) service_pool.cc:214] Skipping call since client already timed out
0929 10:51:17.680348 (+ 10us) inbound_call.cc:173] Queueing failure response
Metrics: {}
W20260929 10:51:17.681074 22018 connection.cc:196] Error closing socket: Network error: TlsSocket::Close: Broken pipe
[ OK ] Parameters/TestRpc.TimedOutOnResponseMetricServiceQueue/SSL_UnixSocket (80 ms)
[ RUN ] Parameters/TestRpc.RpcPendingConnectionsMetric/SSL_UnixSocket
I20260929 10:51:17.683516 22044 acceptor_pool.cc:254] collecting diagnostics on the listening RPC socket 0.0.0.0:46317 every 8 connection(s)
I20260929 10:51:17.683578 22045 acceptor_pool.cc:254] collecting diagnostics on the listening RPC socket 0.0.0.0:46317 every 8 connection(s)
W20260929 10:51:17.684077 22040 negotiation.cc:337] Failed RPC negotiation. Trace:
0929 10:51:17.683939 (+ 0us) reactor.cc:625] Submitting negotiation task for server connection from 127.0.0.1:34968 (local address 127.0.0.1:46317)
0929 10:51:17.683983 (+ 44us) server_negotiation.cc:206] Beginning negotiation
0929 10:51:17.683984 (+ 1us) server_negotiation.cc:399] Waiting for connection header
0929 10:51:17.684031 (+ 47us) negotiation.cc:327] Negotiation complete: Network error: Server connection negotiation failed: server connection from 127.0.0.1:34968: BlockingRecv error: recv got EOF from 127.0.0.1:34968 (error 108)
Metrics: {"server-negotiator.queue_time_us":16}
[ OK ] Parameters/TestRpc.RpcPendingConnectionsMetric/SSL_UnixSocket (13 ms)
[ RUN ] Parameters/TestRpc.TestRpcContextClientDeadline/SSL_UnixSocket
I20260929 10:51:17.708335 22060 acceptor_pool.cc:254] collecting diagnostics on the listening RPC socket unix:/tmp/dist-test-taskZ95oxJ/test-tmp/rpc-test-dad914439b1d415b802855d1e7486aeb.sock every 8 connection(s)
I20260929 10:51:17.708386 22061 acceptor_pool.cc:254] collecting diagnostics on the listening RPC socket unix:/tmp/dist-test-taskZ95oxJ/test-tmp/rpc-test-dad914439b1d415b802855d1e7486aeb.sock every 8 connection(s)
[ OK ] Parameters/TestRpc.TestRpcContextClientDeadline/SSL_UnixSocket (45 ms)
[ RUN ] Parameters/TestRpc.TestApplicationFeatureFlagUnsupportedServer/SSL_UnixSocket
I20260929 10:51:17.750597 22085 acceptor_pool.cc:254] collecting diagnostics on the listening RPC socket unix:/tmp/dist-test-taskZ95oxJ/test-tmp/rpc-test-6557fdfbf5414e0ead308478ffcaa308.sock every 8 connection(s)
I20260929 10:51:17.750609 22086 acceptor_pool.cc:254] collecting diagnostics on the listening RPC socket unix:/tmp/dist-test-taskZ95oxJ/test-tmp/rpc-test-6557fdfbf5414e0ead308478ffcaa308.sock every 8 connection(s)
[ OK ] Parameters/TestRpc.TestApplicationFeatureFlagUnsupportedServer/SSL_UnixSocket (27 ms)
[ RUN ] Parameters/TestRpc.TestCancellationAsync/SSL_UnixSocket
I20260929 10:51:17.791501 22110 acceptor_pool.cc:254] collecting diagnostics on the listening RPC socket unix:/tmp/dist-test-taskZ95oxJ/test-tmp/rpc-test-69081dc4c46946ed8e5d33e1344e2bef.sock every 8 connection(s)
I20260929 10:51:17.791519 22111 acceptor_pool.cc:254] collecting diagnostics on the listening RPC socket unix:/tmp/dist-test-taskZ95oxJ/test-tmp/rpc-test-69081dc4c46946ed8e5d33e1344e2bef.sock every 8 connection(s)
I20260929 10:51:17.791649 21678 rpc-test.cc:1716] Connecting to unix:/tmp/dist-test-taskZ95oxJ/test-tmp/rpc-test-69081dc4c46946ed8e5d33e1344e2bef.sock
I20260929 10:51:17.803345 21678 test_util.cc:268] Using random seed: -162081459
I20260929 10:51:17.820073 22114 rpc-test-base.h:240] got call: sleep_micros: 500 pattern: 4294967295 num_repetitions: 2097152 sidecar_idx: 0
I20260929 10:51:17.832943 22114 rpc-test-base.h:240] got call: sleep_micros: 500 pattern: 4294967295 num_repetitions: 2097152 sidecar_idx: 0
I20260929 10:51:17.845494 22114 rpc-test-base.h:240] got call: sleep_micros: 500 pattern: 4294967295 num_repetitions: 2097152 sidecar_idx: 0
I20260929 10:51:17.855875 22114 rpc-test-base.h:240] got call: sleep_micros: 500 pattern: 4294967295 num_repetitions: 2097152 sidecar_idx: 0
I20260929 10:51:17.866431 22114 rpc-test-base.h:240] got call: sleep_micros: 500 pattern: 4294967295 num_repetitions: 2097152 sidecar_idx: 0
I20260929 10:51:17.876840 22114 rpc-test-base.h:240] got call: sleep_micros: 500 pattern: 4294967295 num_repetitions: 2097152 sidecar_idx: 0
I20260929 10:51:17.887538 22114 rpc-test-base.h:240] got call: sleep_micros: 500 pattern: 4294967295 num_repetitions: 2097152 sidecar_idx: 0
I20260929 10:51:17.898849 22114 rpc-test-base.h:240] got call: sleep_micros: 500 pattern: 4294967295 num_repetitions: 2097152 sidecar_idx: 0
W20260929 10:51:17.900871 22107 connection.cc:196] Error closing socket: Network error: TlsSocket::Close: Broken pipe
W20260929 10:51:17.901998 22107 connection.cc:441] server connection from unix:<unnamed> torn down before Call kudu.rpc.GenericCalculatorService.SleepWithSidecar from unix:<unnamed> (request call id 9) could send its response
[ OK ] Parameters/TestRpc.TestCancellationAsync/SSL_UnixSocket (135 ms)
[ RUN ] Parameters/TestRpc.TestPerformanceBySocketType/SSL_UnixSocket
I20260929 10:51:17.922209 22136 acceptor_pool.cc:254] collecting diagnostics on the listening RPC socket unix:/tmp/dist-test-taskZ95oxJ/test-tmp/rpc-test-a4059058d3c149d494da65d2f9ef2c6a.sock every 8 connection(s)
I20260929 10:51:17.922189 22135 acceptor_pool.cc:254] collecting diagnostics on the listening RPC socket unix:/tmp/dist-test-taskZ95oxJ/test-tmp/rpc-test-a4059058d3c149d494da65d2f9ef2c6a.sock every 8 connection(s)
I20260929 10:51:17.922358 21678 rpc-test.cc:1846] Connecting to unix:/tmp/dist-test-taskZ95oxJ/test-tmp/rpc-test-a4059058d3c149d494da65d2f9ef2c6a.sock
I20260929 10:51:19.240767 21678 rpc-test.cc:1859] Sending 1024MB via ssl-enabled unix socket: real 1.304s user 1.394s sys 0.900s
I20260929 10:51:20.527004 21678 rpc-test.cc:1859] Sending 1024MB via ssl-enabled unix socket: real 1.286s user 1.422s sys 0.849s
I20260929 10:51:21.801411 21678 rpc-test.cc:1859] Sending 1024MB via ssl-enabled unix socket: real 1.274s user 1.418s sys 0.844s
I20260929 10:51:23.069012 21678 rpc-test.cc:1859] Sending 1024MB via ssl-enabled unix socket: real 1.267s user 1.485s sys 0.755s
I20260929 10:51:24.381728 21678 rpc-test.cc:1859] Sending 1024MB via ssl-enabled unix socket: real 1.313s user 1.409s sys 0.910s
W20260929 10:51:24.382503 22132 connection.cc:196] Error closing socket: Network error: TlsSocket::Close: Broken pipe
[ OK ] Parameters/TestRpc.TestPerformanceBySocketType/SSL_UnixSocket (6480 ms)
[----------] 20 tests from Parameters/TestRpc (25524 ms total)
[----------] 1 test from Parameters/TestRpcSocketTxRxQueue
[ RUN ] Parameters/TestRpcSocketTxRxQueue.AcceptorRxQueueSizeMetric/0
I20260929 10:51:24.389597 22160 acceptor_pool.cc:254] collecting diagnostics on the listening RPC socket 0.0.0.0:40975 every 1 connection(s)
I20260929 10:51:24.389696 22161 acceptor_pool.cc:254] collecting diagnostics on the listening RPC socket 0.0.0.0:40975 every 1 connection(s)
W20260929 10:51:24.390151 22156 negotiation.cc:337] Failed RPC negotiation. Trace:
0929 10:51:24.390019 (+ 0us) reactor.cc:625] Submitting negotiation task for server connection from 127.0.0.1:60892 (local address 127.0.0.1:40975)
0929 10:51:24.390065 (+ 46us) server_negotiation.cc:206] Beginning negotiation
0929 10:51:24.390067 (+ 2us) server_negotiation.cc:399] Waiting for connection header
0929 10:51:24.390123 (+ 56us) negotiation.cc:327] Negotiation complete: Network error: Server connection negotiation failed: server connection from 127.0.0.1:60892: BlockingRecv error: recv got EOF from 127.0.0.1:60892 (error 108)
Metrics: {"server-negotiator.queue_time_us":18}
[ OK ] Parameters/TestRpcSocketTxRxQueue.AcceptorRxQueueSizeMetric/0 (8 ms)
[----------] 1 test from Parameters/TestRpcSocketTxRxQueue (8 ms total)
[----------] Global test environment tear-down
[==========] 21 tests from 2 test suites ran. (25533 ms total)
[ PASSED ] 20 tests.
[ FAILED ] 1 test, listed below:
[ FAILED ] Parameters/TestRpc.TestCallWithChainCertAndChainCA/SSL_UnixSocket, where GetParam() = (true, true)
1 FAILED TEST