Diagnosed failure

Parameters/TestRpc.TestCallWithChainCertAndChainCA/SSL_UnixSocket: /data0/somelongdirectorytoavoidrpathissues/src/kudu/src/kudu/rpc/rpc-test.cc:270: Failure
Failed
Bad status: Runtime error: could not verify certificate chain (error with cert: subject=CN = localhost, ST = sadfjas, C = AS, emailAddress = sdflkdsajf, O = lskdfjlsad, OU = sldfkja, issuer=C = AS, ST = ASDfkjdhf, L = lskdjf, O = saldfja, OU = skdjf, CN = localhost, emailAddress = sadjflkadsj): : certificate has expired
Google Test trace:
/data0/somelongdirectorytoavoidrpathissues/src/kudu/src/kudu/rpc/rpc-test.cc:267: Connecting to unix:/tmp/dist-test-taskHUM6Wr/test-tmp/rpc-test-c425e034aaeb49369eb09c16c2496b89.sock
I20260925 14:51:56.276917 10390 test_util.cc:175] -----------------------------------------------
I20260925 14:51:56.276968 10390 test_util.cc:176] Had fatal failures, leaving test files at /tmp/dist-test-taskHUM6Wr/test-tmp/rpc-test.6.Parameters_TestRpc.TestCallWithChainCertAndChainCA_SSL_UnixSocket.1790347916209191-10390-0

Full log

Note: This is test shard 7 of 8.
[==========] Running 21 tests from 2 test suites.
[----------] Global test environment set-up.
[----------] 20 tests from Parameters/TestRpc
[ RUN      ] Parameters/TestRpc.TestMessengerCreateDestroy/SSL_UnixSocket
WARNING: Logging before InitGoogleLogging() is written to STDERR
I20260925 14:51:56.235661 10390 rpc-test.cc:169] started messenger TestCreateDestroy
[       OK ] Parameters/TestRpc.TestMessengerCreateDestroy/SSL_UnixSocket (24 ms)
[ RUN      ] Parameters/TestRpc.TestNegotiationDeadlock/SSL_UnixSocket
I20260925 14:51:56.246795 10410 acceptor_pool.cc:254] collecting diagnostics on the listening RPC socket unix:/tmp/dist-test-taskHUM6Wr/test-tmp/rpc-test-1b6b09af247b426db3435deec078e663.sock every 8 connection(s)
I20260925 14:51:56.246795 10411 acceptor_pool.cc:254] collecting diagnostics on the listening RPC socket unix:/tmp/dist-test-taskHUM6Wr/test-tmp/rpc-test-1b6b09af247b426db3435deec078e663.sock every 8 connection(s)
[       OK ] Parameters/TestRpc.TestNegotiationDeadlock/SSL_UnixSocket (16 ms)
[ RUN      ] Parameters/TestRpc.TestCallWithChainCertAndChainCA/SSL_UnixSocket
I20260925 14:51:56.273321 10426 acceptor_pool.cc:254] collecting diagnostics on the listening RPC socket unix:/tmp/dist-test-taskHUM6Wr/test-tmp/rpc-test-c425e034aaeb49369eb09c16c2496b89.sock every 8 connection(s)
I20260925 14:51:56.273343 10427 acceptor_pool.cc:254] collecting diagnostics on the listening RPC socket unix:/tmp/dist-test-taskHUM6Wr/test-tmp/rpc-test-c425e034aaeb49369eb09c16c2496b89.sock every 8 connection(s)
/data0/somelongdirectorytoavoidrpathissues/src/kudu/src/kudu/rpc/rpc-test.cc:270: Failure
Failed
Bad status: Runtime error: could not verify certificate chain (error with cert: subject=CN = localhost, ST = sadfjas, C = AS, emailAddress = sdflkdsajf, O = lskdfjlsad, OU = sldfkja, issuer=C = AS, ST = ASDfkjdhf, L = lskdjf, O = saldfja, OU = skdjf, CN = localhost, emailAddress = sadjflkadsj): : certificate has expired
Google Test trace:
/data0/somelongdirectorytoavoidrpathissues/src/kudu/src/kudu/rpc/rpc-test.cc:267: Connecting to unix:/tmp/dist-test-taskHUM6Wr/test-tmp/rpc-test-c425e034aaeb49369eb09c16c2496b89.sock
I20260925 14:51:56.276917 10390 test_util.cc:175] -----------------------------------------------
I20260925 14:51:56.276968 10390 test_util.cc:176] Had fatal failures, leaving test files at /tmp/dist-test-taskHUM6Wr/test-tmp/rpc-test.6.Parameters_TestRpc.TestCallWithChainCertAndChainCA_SSL_UnixSocket.1790347916209191-10390-0
[  FAILED  ] Parameters/TestRpc.TestCallWithChainCertAndChainCA/SSL_UnixSocket, where GetParam() = (true, true) (23 ms)
[ RUN      ] Parameters/TestRpc.TestCallWithPasswordProtectedKey/SSL_UnixSocket
I20260925 14:51:56.291455 10452 acceptor_pool.cc:254] collecting diagnostics on the listening RPC socket unix:/tmp/dist-test-taskHUM6Wr/test-tmp/rpc-test-4f1e9f21841f4a689c922f9e71a71893.sock every 8 connection(s)
I20260925 14:51:56.291443 10451 acceptor_pool.cc:254] collecting diagnostics on the listening RPC socket unix:/tmp/dist-test-taskHUM6Wr/test-tmp/rpc-test-4f1e9f21841f4a689c922f9e71a71893.sock every 8 connection(s)
W20260925 14:51:56.302413 10448 connection.cc:196] Error closing socket: Network error: TlsSocket::Close: Broken pipe
[       OK ] Parameters/TestRpc.TestCallWithPasswordProtectedKey/SSL_UnixSocket (26 ms)
[ RUN      ] Parameters/TestRpc.TestCallToBadServer/SSL_UnixSocket
I20260925 14:51:56.314497 10390 rpc-test.cc:394] Status: Network error: Client connection negotiation failed: client connection to 0.0.0.0:0: connect: Connection refused (error 111)
I20260925 14:51:56.314759 10390 rpc-test.cc:394] Status: Network error: Client connection negotiation failed: client connection to 0.0.0.0:0: connect: Connection refused (error 111)
I20260925 14:51:56.314967 10390 rpc-test.cc:394] Status: Network error: Client connection negotiation failed: client connection to 0.0.0.0:0: connect: Connection refused (error 111)
I20260925 14:51:56.315132 10390 rpc-test.cc:394] Status: Network error: Client connection negotiation failed: client connection to 0.0.0.0:0: connect: Connection refused (error 111)
I20260925 14:51:56.315276 10390 rpc-test.cc:394] Status: Network error: Client connection negotiation failed: client connection to 0.0.0.0:0: connect: Connection refused (error 111)
[       OK ] Parameters/TestRpc.TestCallToBadServer/SSL_UnixSocket (12 ms)
[ RUN      ] Parameters/TestRpc.TestWrongService/SSL_UnixSocket
I20260925 14:51:56.327013 10486 acceptor_pool.cc:254] collecting diagnostics on the listening RPC socket unix:/tmp/dist-test-taskHUM6Wr/test-tmp/rpc-test-22d4de16e9934c0aa35019f0a91c0a38.sock every 8 connection(s)
I20260925 14:51:56.327044 10487 acceptor_pool.cc:254] collecting diagnostics on the listening RPC socket unix:/tmp/dist-test-taskHUM6Wr/test-tmp/rpc-test-22d4de16e9934c0aa35019f0a91c0a38.sock every 8 connection(s)
I20260925 14:51:56.343092 10483 messenger.cc:345] service WrongServiceName not registered on TestServer
[       OK ] Parameters/TestRpc.TestWrongService/SSL_UnixSocket (28 ms)
[ RUN      ] Parameters/TestRpc.TestConnectionKeepalive/SSL_UnixSocket
I20260925 14:51:56.352416 10509 acceptor_pool.cc:254] collecting diagnostics on the listening RPC socket unix:/tmp/dist-test-taskHUM6Wr/test-tmp/rpc-test-48b845f6d4f8463185c478f21dc4fe33.sock every 8 connection(s)
I20260925 14:51:56.352470 10510 acceptor_pool.cc:254] collecting diagnostics on the listening RPC socket unix:/tmp/dist-test-taskHUM6Wr/test-tmp/rpc-test-48b845f6d4f8463185c478f21dc4fe33.sock every 8 connection(s)
I20260925 14:51:56.352598 10390 rpc-test.cc:488] Connecting to unix:/tmp/dist-test-taskHUM6Wr/test-tmp/rpc-test-48b845f6d4f8463185c478f21dc4fe33.sock
W20260925 14:51:56.846431 10522 connection.cc:196] Error closing socket: Network error: TlsSocket::Close: Broken pipe
[       OK ] Parameters/TestRpc.TestConnectionKeepalive/SSL_UnixSocket (1026 ms)
[ RUN      ] Parameters/TestRpc.TestClientConnectionMetrics/SSL_UnixSocket
I20260925 14:51:57.376026 10534 acceptor_pool.cc:254] collecting diagnostics on the listening RPC socket unix:/tmp/dist-test-taskHUM6Wr/test-tmp/rpc-test-6c45ea832f114385b7ee5569aa7a4263.sock every 8 connection(s)
I20260925 14:51:57.376029 10535 acceptor_pool.cc:254] collecting diagnostics on the listening RPC socket unix:/tmp/dist-test-taskHUM6Wr/test-tmp/rpc-test-6c45ea832f114385b7ee5569aa7a4263.sock every 8 connection(s)
I20260925 14:51:57.376183 10390 rpc-test.cc:569] Connecting to unix:/tmp/dist-test-taskHUM6Wr/test-tmp/rpc-test-6c45ea832f114385b7ee5569aa7a4263.sock
W20260925 14:52:05.796090 10531 connection.cc:196] Error closing socket: Network error: TlsSocket::Close: Broken pipe
[       OK ] Parameters/TestRpc.TestClientConnectionMetrics/SSL_UnixSocket (8426 ms)
[ RUN      ] Parameters/TestRpc.TestCredentialsPolicy/SSL_UnixSocket
I20260925 14:52:05.806299 10557 acceptor_pool.cc:254] collecting diagnostics on the listening RPC socket unix:/tmp/dist-test-taskHUM6Wr/test-tmp/rpc-test-5c402fa11e604258adb7eddc05eed538.sock every 8 connection(s)
I20260925 14:52:05.806368 10558 acceptor_pool.cc:254] collecting diagnostics on the listening RPC socket unix:/tmp/dist-test-taskHUM6Wr/test-tmp/rpc-test-5c402fa11e604258adb7eddc05eed538.sock every 8 connection(s)
I20260925 14:52:05.806500 10390 rpc-test.cc:700] Connecting to unix:/tmp/dist-test-taskHUM6Wr/test-tmp/rpc-test-5c402fa11e604258adb7eddc05eed538.sock
W20260925 14:52:05.820004 10556 connection.cc:196] Error closing socket: Network error: TlsSocket::Close: Broken pipe
W20260925 14:52:05.823460 10556 connection.cc:196] Error closing socket: Network error: TlsSocket::Close: Broken pipe
[       OK ] Parameters/TestRpc.TestCredentialsPolicy/SSL_UnixSocket (27 ms)
[ RUN      ] Parameters/TestRpc.TestCallLongerThanKeepalive/SSL_UnixSocket
I20260925 14:52:05.841800 10582 acceptor_pool.cc:254] collecting diagnostics on the listening RPC socket unix:/tmp/dist-test-taskHUM6Wr/test-tmp/rpc-test-ad494cf8f4854738ac5ad0967e2d79bb.sock every 8 connection(s)
I20260925 14:52:05.841805 10583 acceptor_pool.cc:254] collecting diagnostics on the listening RPC socket unix:/tmp/dist-test-taskHUM6Wr/test-tmp/rpc-test-ad494cf8f4854738ac5ad0967e2d79bb.sock every 8 connection(s)
I20260925 14:52:05.863428 10586 rpc-test-base.h:222] got call: sleep_micros: 3000000 deferred: true
I20260925 14:52:08.864084 10586 rpcz_store.cc:275] Call kudu.rpc.GenericCalculatorService.Sleep from unix:<unnamed> (request call id 0) took 3000 ms. Trace:
I20260925 14:52:08.864187 10586 rpcz_store.cc:276] 0925 14:52:05.863371 (+     0us) service_pool.cc:170] Inserting onto call queue
0925 14:52:05.863410 (+    39us) service_pool.cc:227] Handling call
0925 14:52:08.864068 (+3000658us) inbound_call.cc:173] Queueing success response
Metrics: {}
[       OK ] Parameters/TestRpc.TestCallLongerThanKeepalive/SSL_UnixSocket (3041 ms)
[ RUN      ] Parameters/TestRpc.TestRpcSidecar/SSL_UnixSocket
I20260925 14:52:08.886435 10607 acceptor_pool.cc:254] collecting diagnostics on the listening RPC socket unix:/tmp/dist-test-taskHUM6Wr/test-tmp/rpc-test-5577f5fa94be496b84a9c679db477815.sock every 8 connection(s)
I20260925 14:52:08.886474 10608 acceptor_pool.cc:254] collecting diagnostics on the listening RPC socket unix:/tmp/dist-test-taskHUM6Wr/test-tmp/rpc-test-5577f5fa94be496b84a9c679db477815.sock every 8 connection(s)
W20260925 14:52:08.921285 10604 connection.cc:196] Error closing socket: Network error: TlsSocket::Close: Broken pipe
[       OK ] Parameters/TestRpc.TestRpcSidecar/SSL_UnixSocket (55 ms)
[ RUN      ] Parameters/TestRpc.TestRpcSidecarLimits/SSL_UnixSocket
I20260925 14:52:10.453534 10632 acceptor_pool.cc:254] collecting diagnostics on the listening RPC socket unix:/tmp/dist-test-taskHUM6Wr/test-tmp/rpc-test-f41773d0d3ed475d99de9feb69a91573.sock every 8 connection(s)
I20260925 14:52:10.453558 10633 acceptor_pool.cc:254] collecting diagnostics on the listening RPC socket unix:/tmp/dist-test-taskHUM6Wr/test-tmp/rpc-test-f41773d0d3ed475d99de9feb69a91573.sock every 8 connection(s)
W20260925 14:52:10.460481 10390 serialization.cc:72] Serialized kudu.rpc_test.PushStringsRequestPB (2147483654 bytes) is larger than the maximum configured RPC message size (52428800 bytes). Sending anyway, but peer may reject the data.
W20260925 14:52:10.463249 10629 connection.cc:535] server connection from unix:<unnamed> recv error: Network error: RPC frame had a length of 2147483714, but we only support messages up to 52428800 bytes long.
W20260925 14:52:10.463310 10629 connection.cc:158] shutting down server connection from unix:<unnamed> with pending inbound data: 4/2147483714 bytes received; last active 0 ns ago: status Network error: RPC frame had a length of 2147483714, but we only support messages up to 52428800 bytes long.
W20260925 14:52:10.463424 10645 connection.cc:698] client connection to unix:/tmp/dist-test-taskHUM6Wr/test-tmp/rpc-test-f41773d0d3ed475d99de9feb69a91573.sock send error: Network error: failed to write to TLS socket: Broken pipe
W20260925 14:52:10.463544 10645 connection.cc:196] Error closing socket: Network error: TlsSocket::Close: Success
I20260925 14:52:10.483767 10658 acceptor_pool.cc:254] collecting diagnostics on the listening RPC socket unix:/tmp/dist-test-taskHUM6Wr/test-tmp/rpc-test-f41773d0d3ed475d99de9feb69a91573.sock every 8 connection(s)
I20260925 14:52:10.483780 10657 acceptor_pool.cc:254] collecting diagnostics on the listening RPC socket unix:/tmp/dist-test-taskHUM6Wr/test-tmp/rpc-test-f41773d0d3ed475d99de9feb69a91573.sock every 8 connection(s)
W20260925 14:52:14.889288 10654 connection.cc:577] server connection from unix:<unnamed>: received bad data: 'Corruption: Invalid packet: message had a length of 2147483710, but we only support messages up to 2147483647 bytes
'
W20260925 14:52:14.889590 10670 connection.cc:196] Error closing socket: Network error: TlsSocket::Close: Broken pipe
[       OK ] Parameters/TestRpc.TestRpcSidecarLimits/SSL_UnixSocket (5968 ms)
[ RUN      ] Parameters/TestRpc.TestCallTimeoutDoesntAffectNegotiation/SSL_UnixSocket
I20260925 14:52:14.907523 10682 acceptor_pool.cc:254] collecting diagnostics on the listening RPC socket unix:/tmp/dist-test-taskHUM6Wr/test-tmp/rpc-test-85e0c3fecd534a3c9590992a8ea4e953.sock every 8 connection(s)
I20260925 14:52:14.907567 10683 acceptor_pool.cc:254] collecting diagnostics on the listening RPC socket unix:/tmp/dist-test-taskHUM6Wr/test-tmp/rpc-test-85e0c3fecd534a3c9590992a8ea4e953.sock every 8 connection(s)
W20260925 14:52:14.920123 10678 negotiation.cc:266] Injecting 500ms delay in negotiation
I20260925 14:52:14.970330 10390 rpc-test-base.h:595] status: Timed out: connection negotiation to unix:/tmp/dist-test-taskHUM6Wr/test-tmp/rpc-test-85e0c3fecd534a3c9590992a8ea4e953.sock for RPC Sleep timed out after 0.050s (ON_OUTBOUND_QUEUE), seconds elapsed: 0.0505039
W20260925 14:52:15.424073 10679 connection.cc:196] Error closing socket: Network error: TlsSocket::Close: Broken pipe
[       OK ] Parameters/TestRpc.TestCallTimeoutDoesntAffectNegotiation/SSL_UnixSocket (533 ms)
[ RUN      ] Parameters/TestRpc.TestRpcHandlerLatencyMetric/SSL_UnixSocket
I20260925 14:52:15.447060 10707 acceptor_pool.cc:254] collecting diagnostics on the listening RPC socket unix:/tmp/dist-test-taskHUM6Wr/test-tmp/rpc-test-dd11d5abddef4387bad5210809c414b4.sock every 8 connection(s)
I20260925 14:52:15.447083 10708 acceptor_pool.cc:254] collecting diagnostics on the listening RPC socket unix:/tmp/dist-test-taskHUM6Wr/test-tmp/rpc-test-dd11d5abddef4387bad5210809c414b4.sock every 8 connection(s)
I20260925 14:52:15.482854 10390 rpc-test.cc:1236] Sleep() min lat: 20239
I20260925 14:52:15.482933 10390 rpc-test.cc:1237] Sleep() mean lat: 20239
I20260925 14:52:15.482966 10390 rpc-test.cc:1238] Sleep() max lat: 20239
I20260925 14:52:15.482982 10390 rpc-test.cc:1239] Sleep() #calls: 1
W20260925 14:52:15.483529 10704 connection.cc:196] Error closing socket: Network error: TlsSocket::Close: Broken pipe
[       OK ] Parameters/TestRpc.TestRpcHandlerLatencyMetric/SSL_UnixSocket (59 ms)
[ RUN      ] Parameters/TestRpc.TimedOutOnResponseMetricServiceQueue/SSL_UnixSocket
I20260925 14:52:15.492100 10733 acceptor_pool.cc:254] collecting diagnostics on the listening RPC socket unix:/tmp/dist-test-taskHUM6Wr/test-tmp/rpc-test-f097fd239600413bbbffd68d06a788e0.sock every 8 connection(s)
I20260925 14:52:15.492125 10734 acceptor_pool.cc:254] collecting diagnostics on the listening RPC socket unix:/tmp/dist-test-taskHUM6Wr/test-tmp/rpc-test-f097fd239600413bbbffd68d06a788e0.sock every 8 connection(s)
W20260925 14:52:15.542966 10735 rpcz_store.cc:267] Call kudu.rpc_test.CalculatorService.Sleep from unix:<unnamed> (request call id 2) took 20 ms (client timeout 20 ms). Trace:
W20260925 14:52:15.543069 10735 rpcz_store.cc:269] 0925 14:52:15.522706 (+     0us) service_pool.cc:170] Inserting onto call queue
0925 14:52:15.542925 (+ 20219us) service_pool.cc:214] Skipping call since client already timed out
0925 14:52:15.542934 (+     9us) inbound_call.cc:173] Queueing failure response
Metrics: {}
W20260925 14:52:15.543638 10730 connection.cc:196] Error closing socket: Network error: TlsSocket::Close: Broken pipe
[       OK ] Parameters/TestRpc.TimedOutOnResponseMetricServiceQueue/SSL_UnixSocket (59 ms)
[ RUN      ] Parameters/TestRpc.RpcPendingConnectionsMetric/SSL_UnixSocket
I20260925 14:52:15.546099 10756 acceptor_pool.cc:254] collecting diagnostics on the listening RPC socket 0.0.0.0:44575 every 8 connection(s)
I20260925 14:52:15.546161 10757 acceptor_pool.cc:254] collecting diagnostics on the listening RPC socket 0.0.0.0:44575 every 8 connection(s)
W20260925 14:52:15.546667 10752 negotiation.cc:337] Failed RPC negotiation. Trace:
0925 14:52:15.546499 (+     0us) reactor.cc:625] Submitting negotiation task for server connection from 127.0.0.1:43648 (local address 127.0.0.1:44575)
0925 14:52:15.546537 (+    38us) server_negotiation.cc:206] Beginning negotiation
0925 14:52:15.546538 (+     1us) server_negotiation.cc:399] Waiting for connection header
0925 14:52:15.546618 (+    80us) negotiation.cc:327] Negotiation complete: Network error: Server connection negotiation failed: server connection from 127.0.0.1:43648: BlockingRecv error: recv got EOF from 127.0.0.1:43648 (error 108)
Metrics: {"server-negotiator.queue_time_us":12}
[       OK ] Parameters/TestRpc.RpcPendingConnectionsMetric/SSL_UnixSocket (13 ms)
[ RUN      ] Parameters/TestRpc.TestRpcContextClientDeadline/SSL_UnixSocket
I20260925 14:52:15.571430 10772 acceptor_pool.cc:254] collecting diagnostics on the listening RPC socket unix:/tmp/dist-test-taskHUM6Wr/test-tmp/rpc-test-e4f00528048d460797bfa649a48c161c.sock every 8 connection(s)
I20260925 14:52:15.571452 10773 acceptor_pool.cc:254] collecting diagnostics on the listening RPC socket unix:/tmp/dist-test-taskHUM6Wr/test-tmp/rpc-test-e4f00528048d460797bfa649a48c161c.sock every 8 connection(s)
W20260925 14:52:15.648342 10769 connection.cc:196] Error closing socket: Network error: TlsSocket::Close: Broken pipe
[       OK ] Parameters/TestRpc.TestRpcContextClientDeadline/SSL_UnixSocket (91 ms)
[ RUN      ] Parameters/TestRpc.TestApplicationFeatureFlagUnsupportedServer/SSL_UnixSocket
I20260925 14:52:15.659058 10797 acceptor_pool.cc:254] collecting diagnostics on the listening RPC socket unix:/tmp/dist-test-taskHUM6Wr/test-tmp/rpc-test-c6830b1857054770b9870049f516b661.sock every 8 connection(s)
I20260925 14:52:15.659086 10798 acceptor_pool.cc:254] collecting diagnostics on the listening RPC socket unix:/tmp/dist-test-taskHUM6Wr/test-tmp/rpc-test-c6830b1857054770b9870049f516b661.sock every 8 connection(s)
[       OK ] Parameters/TestRpc.TestApplicationFeatureFlagUnsupportedServer/SSL_UnixSocket (25 ms)
[ RUN      ] Parameters/TestRpc.TestCancellationAsync/SSL_UnixSocket
I20260925 14:52:15.685871 10823 acceptor_pool.cc:254] collecting diagnostics on the listening RPC socket unix:/tmp/dist-test-taskHUM6Wr/test-tmp/rpc-test-736af117c2c14b42b10a6413bd725626.sock every 8 connection(s)
I20260925 14:52:15.685837 10822 acceptor_pool.cc:254] collecting diagnostics on the listening RPC socket unix:/tmp/dist-test-taskHUM6Wr/test-tmp/rpc-test-736af117c2c14b42b10a6413bd725626.sock every 8 connection(s)
I20260925 14:52:15.686021 10390 rpc-test.cc:1716] Connecting to unix:/tmp/dist-test-taskHUM6Wr/test-tmp/rpc-test-736af117c2c14b42b10a6413bd725626.sock
I20260925 14:52:15.703003 10390 test_util.cc:268] Using random seed: -591700009
I20260925 14:52:15.715427 10826 rpc-test-base.h:240] got call: sleep_micros: 500 pattern: 4294967295 num_repetitions: 2097152 sidecar_idx: 0
I20260925 14:52:15.725710 10826 rpc-test-base.h:240] got call: sleep_micros: 500 pattern: 4294967295 num_repetitions: 2097152 sidecar_idx: 0
I20260925 14:52:15.735749 10826 rpc-test-base.h:240] got call: sleep_micros: 500 pattern: 4294967295 num_repetitions: 2097152 sidecar_idx: 0
I20260925 14:52:15.747611 10826 rpc-test-base.h:240] got call: sleep_micros: 500 pattern: 4294967295 num_repetitions: 2097152 sidecar_idx: 0
I20260925 14:52:15.759601 10826 rpc-test-base.h:240] got call: sleep_micros: 500 pattern: 4294967295 num_repetitions: 2097152 sidecar_idx: 0
I20260925 14:52:15.771798 10826 rpc-test-base.h:240] got call: sleep_micros: 500 pattern: 4294967295 num_repetitions: 2097152 sidecar_idx: 0
I20260925 14:52:15.783993 10826 rpc-test-base.h:240] got call: sleep_micros: 500 pattern: 4294967295 num_repetitions: 2097152 sidecar_idx: 0
I20260925 14:52:15.796008 10826 rpc-test-base.h:240] got call: sleep_micros: 500 pattern: 4294967295 num_repetitions: 2097152 sidecar_idx: 0
W20260925 14:52:15.797432 10819 connection.cc:196] Error closing socket: Network error: TlsSocket::Close: Broken pipe
W20260925 14:52:15.798957 10819 connection.cc:441] server connection from unix:<unnamed> torn down before Call kudu.rpc.GenericCalculatorService.SleepWithSidecar from unix:<unnamed> (request call id 9) could send its response
[       OK ] Parameters/TestRpc.TestCancellationAsync/SSL_UnixSocket (125 ms)
[ RUN      ] Parameters/TestRpc.TestPerformanceBySocketType/SSL_UnixSocket
I20260925 14:52:15.811646 10847 acceptor_pool.cc:254] collecting diagnostics on the listening RPC socket unix:/tmp/dist-test-taskHUM6Wr/test-tmp/rpc-test-68e0d66af30d4fc1a53e413c3d2c83bc.sock every 8 connection(s)
I20260925 14:52:15.811687 10848 acceptor_pool.cc:254] collecting diagnostics on the listening RPC socket unix:/tmp/dist-test-taskHUM6Wr/test-tmp/rpc-test-68e0d66af30d4fc1a53e413c3d2c83bc.sock every 8 connection(s)
I20260925 14:52:15.811813 10390 rpc-test.cc:1846] Connecting to unix:/tmp/dist-test-taskHUM6Wr/test-tmp/rpc-test-68e0d66af30d4fc1a53e413c3d2c83bc.sock
I20260925 14:52:17.104846 10390 rpc-test.cc:1859] Sending 1024MB via ssl-enabled unix socket: real 1.286s	user 1.466s	sys 0.830s
I20260925 14:52:18.408492 10390 rpc-test.cc:1859] Sending 1024MB via ssl-enabled unix socket: real 1.304s	user 1.469s	sys 0.862s
I20260925 14:52:19.714957 10390 rpc-test.cc:1859] Sending 1024MB via ssl-enabled unix socket: real 1.306s	user 1.422s	sys 0.917s
I20260925 14:52:21.029196 10390 rpc-test.cc:1859] Sending 1024MB via ssl-enabled unix socket: real 1.314s	user 1.411s	sys 0.942s
I20260925 14:52:22.282485 10390 rpc-test.cc:1859] Sending 1024MB via ssl-enabled unix socket: real 1.253s	user 1.272s	sys 0.979s
W20260925 14:52:22.283239 10844 connection.cc:196] Error closing socket: Network error: TlsSocket::Close: Broken pipe
[       OK ] Parameters/TestRpc.TestPerformanceBySocketType/SSL_UnixSocket (6484 ms)
[----------] 20 tests from Parameters/TestRpc (26072 ms total)

[----------] 1 test from Parameters/TestRpcSocketTxRxQueue
[ RUN      ] Parameters/TestRpcSocketTxRxQueue.AcceptorRxQueueSizeMetric/0
I20260925 14:52:22.289098 10872 acceptor_pool.cc:254] collecting diagnostics on the listening RPC socket 0.0.0.0:45707 every 1 connection(s)
I20260925 14:52:22.289157 10873 acceptor_pool.cc:254] collecting diagnostics on the listening RPC socket 0.0.0.0:45707 every 1 connection(s)
W20260925 14:52:22.289619 10868 negotiation.cc:337] Failed RPC negotiation. Trace:
0925 14:52:22.289488 (+     0us) reactor.cc:625] Submitting negotiation task for server connection from 127.0.0.1:45160 (local address 127.0.0.1:45707)
0925 14:52:22.289529 (+    41us) server_negotiation.cc:206] Beginning negotiation
0925 14:52:22.289530 (+     1us) server_negotiation.cc:399] Waiting for connection header
0925 14:52:22.289588 (+    58us) negotiation.cc:327] Negotiation complete: Network error: Server connection negotiation failed: server connection from 127.0.0.1:45160: BlockingRecv error: recv got EOF from 127.0.0.1:45160 (error 108)
Metrics: {"server-negotiator.queue_time_us":15}
[       OK ] Parameters/TestRpcSocketTxRxQueue.AcceptorRxQueueSizeMetric/0 (7 ms)
[----------] 1 test from Parameters/TestRpcSocketTxRxQueue (7 ms total)

[----------] Global test environment tear-down
[==========] 21 tests from 2 test suites ran. (26080 ms total)
[  PASSED  ] 20 tests.
[  FAILED  ] 1 test, listed below:
[  FAILED  ] Parameters/TestRpc.TestCallWithChainCertAndChainCA/SSL_UnixSocket, where GetParam() = (true, true)

 1 FAILED TEST