Parameters/TestRpc.TestCallWithChainCertAndRootCA/SSL_UnixSocket: /data0/somelongdirectorytoavoidrpathissues/src/kudu/src/kudu/rpc/rpc-test.cc:303: Failure
Failed
Bad status: Runtime error: could not verify certificate chain (error with cert: subject=CN = localhost, ST = sadfjas, C = AS, emailAddress = sdflkdsajf, O = lskdfjlsad, OU = sldfkja, issuer=C = AS, ST = ASDfkjdhf, L = lskdjf, O = saldfja, OU = skdjf, CN = localhost, emailAddress = sadjflkadsj): : certificate has expired
Google Test trace:
/data0/somelongdirectorytoavoidrpathissues/src/kudu/src/kudu/rpc/rpc-test.cc:300: Connecting to unix:/tmp/dist-test-taskR6mfdH/test-tmp/rpc-test-bc82a81c176e42739af77a68ec7c99ce.sock
I20260925 19:30:52.660099 391 test_util.cc:175] -----------------------------------------------
I20260925 19:30:52.660312 391 test_util.cc:176] Had fatal failures, leaving test files at /tmp/dist-test-taskR6mfdH/test-tmp/rpc-test.2.Parameters_TestRpc.TestCallWithChainCertAndRootCA_SSL_UnixSocket.1790364649017329-391-0
Note: This is test shard 3 of 8.
[==========] Running 21 tests from 2 test suites.
[----------] Global test environment set-up.
[----------] 1 test from TestRpc
[ RUN ] TestRpc.TestNegotiationTimeout
WARNING: Logging before InitGoogleLogging() is written to STDERR
I20260925 19:30:49.210395 391 rpc-test-base.h:595] status: Timed out: connection negotiation to 0.0.0.0:40257 for RPC Sleep timed out after 0.100s (ON_OUTBOUND_QUEUE), seconds elapsed: 0.10178
W20260925 19:30:52.366147 401 negotiation.cc:337] Failed RPC negotiation. Trace:
0925 19:30:49.109539 (+ 0us) reactor.cc:625] Submitting negotiation task for client connection to 0.0.0.0:40257 (local address 127.0.0.1:38000)
0925 19:30:49.110342 (+ 803us) negotiation.cc:107] Waiting for socket to connect
0925 19:30:49.110389 (+ 47us) client_negotiation.cc:174] Beginning negotiation
0925 19:30:49.126030 (+ 15641us) client_negotiation.cc:252] Sending NEGOTIATE NegotiatePB request
0925 19:30:52.365093 (+3239063us) negotiation.cc:327] Negotiation complete: Timed out: Client connection negotiation failed: client connection to 0.0.0.0:40257: received 0 of 4 requested bytes
Metrics: {"client-negotiator.queue_time_us":225}
[ OK ] TestRpc.TestNegotiationTimeout (3301 ms)
[----------] 1 test from TestRpc (3301 ms total)
[----------] 20 tests from Parameters/TestRpc
[ RUN ] Parameters/TestRpc.TestAcceptorPoolStartStop/SSL_UnixSocket
I20260925 19:30:52.398247 417 acceptor_pool.cc:254] collecting diagnostics on the listening RPC socket unix:/tmp/dist-test-taskR6mfdH/test-tmp/rpc-test-61c248fe32aa4f0e85e92b6577b2f5f4.sock every 8 connection(s)
I20260925 19:30:52.400266 418 acceptor_pool.cc:254] collecting diagnostics on the listening RPC socket unix:/tmp/dist-test-taskR6mfdH/test-tmp/rpc-test-61c248fe32aa4f0e85e92b6577b2f5f4.sock every 8 connection(s)
I20260925 19:30:52.435634 428 acceptor_pool.cc:254] collecting diagnostics on the listening RPC socket unix:/tmp/dist-test-taskR6mfdH/test-tmp/rpc-test-61c248fe32aa4f0e85e92b6577b2f5f4.sock every 8 connection(s)
I20260925 19:30:52.437602 429 acceptor_pool.cc:254] collecting diagnostics on the listening RPC socket unix:/tmp/dist-test-taskR6mfdH/test-tmp/rpc-test-61c248fe32aa4f0e85e92b6577b2f5f4.sock every 8 connection(s)
I20260925 19:30:52.468750 439 acceptor_pool.cc:254] collecting diagnostics on the listening RPC socket unix:/tmp/dist-test-taskR6mfdH/test-tmp/rpc-test-61c248fe32aa4f0e85e92b6577b2f5f4.sock every 8 connection(s)
I20260925 19:30:52.469458 440 acceptor_pool.cc:254] collecting diagnostics on the listening RPC socket unix:/tmp/dist-test-taskR6mfdH/test-tmp/rpc-test-61c248fe32aa4f0e85e92b6577b2f5f4.sock every 8 connection(s)
I20260925 19:30:52.496130 450 acceptor_pool.cc:254] collecting diagnostics on the listening RPC socket unix:/tmp/dist-test-taskR6mfdH/test-tmp/rpc-test-61c248fe32aa4f0e85e92b6577b2f5f4.sock every 8 connection(s)
I20260925 19:30:52.496935 451 acceptor_pool.cc:254] collecting diagnostics on the listening RPC socket unix:/tmp/dist-test-taskR6mfdH/test-tmp/rpc-test-61c248fe32aa4f0e85e92b6577b2f5f4.sock every 8 connection(s)
I20260925 19:30:52.519431 461 acceptor_pool.cc:254] collecting diagnostics on the listening RPC socket unix:/tmp/dist-test-taskR6mfdH/test-tmp/rpc-test-61c248fe32aa4f0e85e92b6577b2f5f4.sock every 8 connection(s)
I20260925 19:30:52.520730 462 acceptor_pool.cc:254] collecting diagnostics on the listening RPC socket unix:/tmp/dist-test-taskR6mfdH/test-tmp/rpc-test-61c248fe32aa4f0e85e92b6577b2f5f4.sock every 8 connection(s)
[ OK ] Parameters/TestRpc.TestAcceptorPoolStartStop/SSL_UnixSocket (154 ms)
[ RUN ] Parameters/TestRpc.TestCall/SSL_UnixSocket
I20260925 19:30:52.553858 474 acceptor_pool.cc:254] collecting diagnostics on the listening RPC socket unix:/tmp/dist-test-taskR6mfdH/test-tmp/rpc-test-6f52cdee28d443fbb78f5d9626df5f27.sock every 8 connection(s)
I20260925 19:30:52.555823 475 acceptor_pool.cc:254] collecting diagnostics on the listening RPC socket unix:/tmp/dist-test-taskR6mfdH/test-tmp/rpc-test-6f52cdee28d443fbb78f5d9626df5f27.sock every 8 connection(s)
I20260925 19:30:52.561666 391 rpc-test.cc:234] Connecting to unix:/tmp/dist-test-taskR6mfdH/test-tmp/rpc-test-6f52cdee28d443fbb78f5d9626df5f27.sock
W20260925 19:30:52.617775 471 connection.cc:196] Error closing socket: Network error: TlsSocket::Close: Broken pipe
[ OK ] Parameters/TestRpc.TestCall/SSL_UnixSocket (98 ms)
[ RUN ] Parameters/TestRpc.TestCallWithChainCertAndRootCA/SSL_UnixSocket
I20260925 19:30:52.638427 499 acceptor_pool.cc:254] collecting diagnostics on the listening RPC socket unix:/tmp/dist-test-taskR6mfdH/test-tmp/rpc-test-bc82a81c176e42739af77a68ec7c99ce.sock every 8 connection(s)
I20260925 19:30:52.639160 500 acceptor_pool.cc:254] collecting diagnostics on the listening RPC socket unix:/tmp/dist-test-taskR6mfdH/test-tmp/rpc-test-bc82a81c176e42739af77a68ec7c99ce.sock every 8 connection(s)
/data0/somelongdirectorytoavoidrpathissues/src/kudu/src/kudu/rpc/rpc-test.cc:303: Failure
Failed
Bad status: Runtime error: could not verify certificate chain (error with cert: subject=CN = localhost, ST = sadfjas, C = AS, emailAddress = sdflkdsajf, O = lskdfjlsad, OU = sldfkja, issuer=C = AS, ST = ASDfkjdhf, L = lskdjf, O = saldfja, OU = skdjf, CN = localhost, emailAddress = sadjflkadsj): : certificate has expired
Google Test trace:
/data0/somelongdirectorytoavoidrpathissues/src/kudu/src/kudu/rpc/rpc-test.cc:300: Connecting to unix:/tmp/dist-test-taskR6mfdH/test-tmp/rpc-test-bc82a81c176e42739af77a68ec7c99ce.sock
I20260925 19:30:52.660099 391 test_util.cc:175] -----------------------------------------------
I20260925 19:30:52.660312 391 test_util.cc:176] Had fatal failures, leaving test files at /tmp/dist-test-taskR6mfdH/test-tmp/rpc-test.2.Parameters_TestRpc.TestCallWithChainCertAndRootCA_SSL_UnixSocket.1790364649017329-391-0
[ FAILED ] Parameters/TestRpc.TestCallWithChainCertAndRootCA/SSL_UnixSocket, where GetParam() = (true, true) (37 ms)
[ RUN ] Parameters/TestRpc.TestCallWithBadPasswordProtectedKey/SSL_UnixSocket
[ OK ] Parameters/TestRpc.TestCallWithBadPasswordProtectedKey/SSL_UnixSocket (30 ms)
[ RUN ] Parameters/TestRpc.TestInvalidMethodCall/SSL_UnixSocket
I20260925 19:30:52.706303 536 acceptor_pool.cc:254] collecting diagnostics on the listening RPC socket unix:/tmp/dist-test-taskR6mfdH/test-tmp/rpc-test-c3e85ddbaf2247768eaaaa69b4bf0d97.sock every 8 connection(s)
I20260925 19:30:52.707144 537 acceptor_pool.cc:254] collecting diagnostics on the listening RPC socket unix:/tmp/dist-test-taskR6mfdH/test-tmp/rpc-test-c3e85ddbaf2247768eaaaa69b4bf0d97.sock every 8 connection(s)
I20260925 19:30:52.710546 391 rpc-test.cc:406] Connecting to unix:/tmp/dist-test-taskR6mfdH/test-tmp/rpc-test-c3e85ddbaf2247768eaaaa69b4bf0d97.sock
[ OK ] Parameters/TestRpc.TestInvalidMethodCall/SSL_UnixSocket (72 ms)
[ RUN ] Parameters/TestRpc.TestHighFDs/SSL_UnixSocket
I20260925 19:30:52.973520 561 acceptor_pool.cc:254] collecting diagnostics on the listening RPC socket unix:/tmp/dist-test-taskR6mfdH/test-tmp/rpc-test-184aa769b6ad471ba472cd0a7fd07665.sock every 8 connection(s)
I20260925 19:30:52.974233 562 acceptor_pool.cc:254] collecting diagnostics on the listening RPC socket unix:/tmp/dist-test-taskR6mfdH/test-tmp/rpc-test-184aa769b6ad471ba472cd0a7fd07665.sock every 8 connection(s)
[ OK ] Parameters/TestRpc.TestHighFDs/SSL_UnixSocket (265 ms)
[ RUN ] Parameters/TestRpc.TestConnectionAlwaysKeepalive/SSL_UnixSocket
I20260925 19:30:53.054459 584 acceptor_pool.cc:254] collecting diagnostics on the listening RPC socket unix:/tmp/dist-test-taskR6mfdH/test-tmp/rpc-test-61a9dee45ecf43f6a4d1f1302c2c289d.sock every 8 connection(s)
I20260925 19:30:53.055191 585 acceptor_pool.cc:254] collecting diagnostics on the listening RPC socket unix:/tmp/dist-test-taskR6mfdH/test-tmp/rpc-test-61a9dee45ecf43f6a4d1f1302c2c289d.sock every 8 connection(s)
I20260925 19:30:53.058236 391 rpc-test.cc:532] Connecting to unix:/tmp/dist-test-taskR6mfdH/test-tmp/rpc-test-61a9dee45ecf43f6a4d1f1302c2c289d.sock
[ OK ] Parameters/TestRpc.TestConnectionAlwaysKeepalive/SSL_UnixSocket (3079 ms)
[ RUN ] Parameters/TestRpc.TestReopenOutboundConnections/SSL_UnixSocket
I20260925 19:30:56.134496 607 acceptor_pool.cc:254] collecting diagnostics on the listening RPC socket unix:/tmp/dist-test-taskR6mfdH/test-tmp/rpc-test-adc8ce275bef46ef94eccd2db868bbf1.sock every 8 connection(s)
I20260925 19:30:56.135214 608 acceptor_pool.cc:254] collecting diagnostics on the listening RPC socket unix:/tmp/dist-test-taskR6mfdH/test-tmp/rpc-test-adc8ce275bef46ef94eccd2db868bbf1.sock every 8 connection(s)
I20260925 19:30:56.138275 391 rpc-test.cc:658] Connecting to unix:/tmp/dist-test-taskR6mfdH/test-tmp/rpc-test-adc8ce275bef46ef94eccd2db868bbf1.sock
W20260925 19:30:56.182027 606 connection.cc:196] Error closing socket: Network error: TlsSocket::Close: Broken pipe
W20260925 19:30:56.192008 606 connection.cc:196] Error closing socket: Network error: TlsSocket::Close: Broken pipe
W20260925 19:30:56.201781 606 connection.cc:196] Error closing socket: Network error: TlsSocket::Close: Broken pipe
W20260925 19:30:56.211299 606 connection.cc:196] Error closing socket: Network error: TlsSocket::Close: Broken pipe
W20260925 19:30:56.220894 606 connection.cc:196] Error closing socket: Network error: TlsSocket::Close: Broken pipe
W20260925 19:30:56.230649 606 connection.cc:196] Error closing socket: Network error: TlsSocket::Close: Broken pipe
W20260925 19:30:56.240509 606 connection.cc:196] Error closing socket: Network error: TlsSocket::Close: Broken pipe
W20260925 19:30:56.250191 606 connection.cc:196] Error closing socket: Network error: TlsSocket::Close: Broken pipe
W20260925 19:30:56.260160 606 connection.cc:196] Error closing socket: Network error: TlsSocket::Close: Broken pipe
W20260925 19:30:56.269452 606 connection.cc:196] Error closing socket: Network error: TlsSocket::Close: Broken pipe
W20260925 19:30:56.278864 606 connection.cc:196] Error closing socket: Network error: TlsSocket::Close: Broken pipe
W20260925 19:30:56.289065 606 connection.cc:196] Error closing socket: Network error: TlsSocket::Close: Broken pipe
W20260925 19:30:56.299842 606 connection.cc:196] Error closing socket: Network error: TlsSocket::Close: Broken pipe
W20260925 19:30:56.310491 606 connection.cc:196] Error closing socket: Network error: TlsSocket::Close: Broken pipe
W20260925 19:30:56.310529 607 acceptor_pool.cc:285] unable to collect diagnostics on RPC socket unix:/tmp/dist-test-taskR6mfdH/test-tmp/rpc-test-adc8ce275bef46ef94eccd2db868bbf1.sock: Not implemented: netlink diagnostics is currently supported only on IPv4 TCP sockets
W20260925 19:30:56.319927 606 connection.cc:196] Error closing socket: Network error: TlsSocket::Close: Broken pipe
W20260925 19:30:56.330430 606 connection.cc:196] Error closing socket: Network error: TlsSocket::Close: Broken pipe
W20260925 19:30:56.340785 606 connection.cc:196] Error closing socket: Network error: TlsSocket::Close: Broken pipe
W20260925 19:30:56.350955 606 connection.cc:196] Error closing socket: Network error: TlsSocket::Close: Broken pipe
W20260925 19:30:56.361759 606 connection.cc:196] Error closing socket: Network error: TlsSocket::Close: Broken pipe
W20260925 19:30:56.385357 606 connection.cc:196] Error closing socket: Network error: TlsSocket::Close: Broken pipe
W20260925 19:30:56.395447 606 connection.cc:196] Error closing socket: Network error: TlsSocket::Close: Broken pipe
W20260925 19:30:56.406003 606 connection.cc:196] Error closing socket: Network error: TlsSocket::Close: Broken pipe
W20260925 19:30:56.416913 606 connection.cc:196] Error closing socket: Network error: TlsSocket::Close: Broken pipe
W20260925 19:30:56.428499 606 connection.cc:196] Error closing socket: Network error: TlsSocket::Close: Broken pipe
W20260925 19:30:56.440395 606 connection.cc:196] Error closing socket: Network error: TlsSocket::Close: Broken pipe
W20260925 19:30:56.451706 606 connection.cc:196] Error closing socket: Network error: TlsSocket::Close: Broken pipe
W20260925 19:30:56.461846 606 connection.cc:196] Error closing socket: Network error: TlsSocket::Close: Broken pipe
W20260925 19:30:56.472704 606 connection.cc:196] Error closing socket: Network error: TlsSocket::Close: Broken pipe
W20260925 19:30:56.484586 606 connection.cc:196] Error closing socket: Network error: TlsSocket::Close: Broken pipe
W20260925 19:30:56.493125 606 connection.cc:196] Error closing socket: Network error: TlsSocket::Close: Broken pipe
W20260925 19:30:56.503033 606 connection.cc:196] Error closing socket: Network error: TlsSocket::Close: Broken pipe
[ OK ] Parameters/TestRpc.TestReopenOutboundConnections/SSL_UnixSocket (398 ms)
[ RUN ] Parameters/TestRpc.TestConnectionNetworkPlane/SSL_UnixSocket
I20260925 19:30:56.558635 630 acceptor_pool.cc:254] collecting diagnostics on the listening RPC socket unix:/tmp/dist-test-taskR6mfdH/test-tmp/rpc-test-44d41c557bf046698eb8fc16291a3a36.sock every 8 connection(s)
I20260925 19:30:56.559366 631 acceptor_pool.cc:254] collecting diagnostics on the listening RPC socket unix:/tmp/dist-test-taskR6mfdH/test-tmp/rpc-test-44d41c557bf046698eb8fc16291a3a36.sock every 8 connection(s)
I20260925 19:30:56.562426 391 rpc-test.cc:772] Connecting to unix:/tmp/dist-test-taskR6mfdH/test-tmp/rpc-test-44d41c557bf046698eb8fc16291a3a36.sock
[ OK ] Parameters/TestRpc.TestConnectionNetworkPlane/SSL_UnixSocket (100 ms)
[ RUN ] Parameters/TestRpc.TestTCPKeepalive/SSL_UnixSocket
I20260925 19:30:56.630157 655 acceptor_pool.cc:254] collecting diagnostics on the listening RPC socket unix:/tmp/dist-test-taskR6mfdH/test-tmp/rpc-test-cc9bdbd932484a22b3a86b5b8a7096e2.sock every 8 connection(s)
I20260925 19:30:56.630823 656 acceptor_pool.cc:254] collecting diagnostics on the listening RPC socket unix:/tmp/dist-test-taskR6mfdH/test-tmp/rpc-test-cc9bdbd932484a22b3a86b5b8a7096e2.sock every 8 connection(s)
I20260925 19:30:56.662449 659 rpc-test-base.h:222] got call: sleep_micros: 8000000 deferred: true
I20260925 19:31:04.666492 659 rpcz_store.cc:275] Call kudu.rpc.GenericCalculatorService.Sleep from unix:<unnamed> (request call id 0) took 8004 ms. Trace:
I20260925 19:31:04.666885 659 rpcz_store.cc:276] 0925 19:30:56.662273 (+ 0us) service_pool.cc:170] Inserting onto call queue
0925 19:30:56.662389 (+ 116us) service_pool.cc:227] Handling call
0925 19:31:04.666300 (+8003911us) inbound_call.cc:173] Queueing success response
Metrics: {}
W20260925 19:31:04.673130 652 connection.cc:196] Error closing socket: Network error: TlsSocket::Close: Broken pipe
[ OK ] Parameters/TestRpc.TestTCPKeepalive/SSL_UnixSocket (8072 ms)
[ RUN ] Parameters/TestRpc.TestMaxSmallSidecars/SSL_UnixSocket
I20260925 19:31:04.728911 681 acceptor_pool.cc:254] collecting diagnostics on the listening RPC socket unix:/tmp/dist-test-taskR6mfdH/test-tmp/rpc-test-8c4686b59d904390b6d06992048e196d.sock every 8 connection(s)
I20260925 19:31:04.729772 682 acceptor_pool.cc:254] collecting diagnostics on the listening RPC socket unix:/tmp/dist-test-taskR6mfdH/test-tmp/rpc-test-8c4686b59d904390b6d06992048e196d.sock every 8 connection(s)
W20260925 19:31:04.900849 678 connection.cc:196] Error closing socket: Network error: TlsSocket::Close: Broken pipe
[ OK ] Parameters/TestRpc.TestMaxSmallSidecars/SSL_UnixSocket (224 ms)
[ RUN ] Parameters/TestRpc.TestCallTimeout/SSL_UnixSocket
I20260925 19:31:04.943495 706 acceptor_pool.cc:254] collecting diagnostics on the listening RPC socket unix:/tmp/dist-test-taskR6mfdH/test-tmp/rpc-test-1d1b457f06ef47b68ec42ba3d33f1bb8.sock every 8 connection(s)
I20260925 19:31:04.944219 707 acceptor_pool.cc:254] collecting diagnostics on the listening RPC socket unix:/tmp/dist-test-taskR6mfdH/test-tmp/rpc-test-1d1b457f06ef47b68ec42ba3d33f1bb8.sock every 8 connection(s)
I20260925 19:31:04.966745 391 rpc-test-base.h:595] status: Timed out: connection negotiation to unix:/tmp/dist-test-taskR6mfdH/test-tmp/rpc-test-1d1b457f06ef47b68ec42ba3d33f1bb8.sock for RPC Sleep timed out after 0.000s (ON_OUTBOUND_QUEUE), seconds elapsed: 0.00287751
I20260925 19:31:04.972858 710 rpc-test-base.h:222] got call: sleep_micros: 700000
I20260925 19:31:05.168672 391 rpc-test-base.h:595] status: Timed out: Sleep RPC to unix:/tmp/dist-test-taskR6mfdH/test-tmp/rpc-test-1d1b457f06ef47b68ec42ba3d33f1bb8.sock timed out after 0.200s (SENT), seconds elapsed: 0.201597
I20260925 19:31:05.170028 709 rpc-test-base.h:222] got call: sleep_micros: 2000000
W20260925 19:31:05.673465 710 rpcz_store.cc:267] Call kudu.rpc.GenericCalculatorService.Sleep from unix:<unnamed> (request call id 1) took 700 ms (client timeout 200 ms). Trace:
W20260925 19:31:05.673813 710 rpcz_store.cc:269] 0925 19:31:04.972708 (+ 0us) service_pool.cc:170] Inserting onto call queue
0925 19:31:04.972816 (+ 108us) service_pool.cc:227] Handling call
0925 19:31:05.673410 (+700594us) inbound_call.cc:173] Queueing success response
Metrics: {}
I20260925 19:31:06.671286 391 rpc-test-base.h:595] status: Timed out: Sleep RPC to unix:/tmp/dist-test-taskR6mfdH/test-tmp/rpc-test-1d1b457f06ef47b68ec42ba3d33f1bb8.sock timed out after 1.500s (SENT), seconds elapsed: 1.50223
W20260925 19:31:07.170550 709 rpcz_store.cc:267] Call kudu.rpc.GenericCalculatorService.Sleep from unix:<unnamed> (request call id 2) took 2000 ms (client timeout 1500 ms). Trace:
W20260925 19:31:07.170974 709 rpcz_store.cc:269] 0925 19:31:05.169832 (+ 0us) service_pool.cc:170] Inserting onto call queue
0925 19:31:05.169969 (+ 137us) service_pool.cc:227] Handling call
0925 19:31:07.170494 (+2000525us) inbound_call.cc:173] Queueing success response
Metrics: {}
W20260925 19:31:07.171554 703 connection.cc:441] server connection from unix:<unnamed> torn down before Call kudu.rpc.GenericCalculatorService.Sleep from unix:<unnamed> (request call id 2) could send its response
[ OK ] Parameters/TestRpc.TestCallTimeout/SSL_UnixSocket (2271 ms)
[ RUN ] Parameters/TestRpc.TestServerShutsDown/SSL_UnixSocket
I20260925 19:31:07.179343 391 rpc-test.cc:1125] Connecting to 0.0.0.0:46581
W20260925 19:31:07.192812 723 negotiation.cc:337] Failed RPC negotiation. Trace:
0925 19:31:07.191347 (+ 0us) reactor.cc:625] Submitting negotiation task for client connection to 0.0.0.0:46581 (local address 127.0.0.1:51728)
0925 19:31:07.191801 (+ 454us) negotiation.cc:107] Waiting for socket to connect
0925 19:31:07.191831 (+ 30us) client_negotiation.cc:174] Beginning negotiation
0925 19:31:07.192041 (+ 210us) client_negotiation.cc:252] Sending NEGOTIATE NegotiatePB request
0925 19:31:07.192248 (+ 207us) negotiation.cc:327] Negotiation complete: Network error: Client connection negotiation failed: client connection to 0.0.0.0:46581: BlockingWrite error: write error: Broken pipe (error 32)
Metrics: {"client-negotiator.queue_time_us":123}
[ OK ] Parameters/TestRpc.TestServerShutsDown/SSL_UnixSocket (17 ms)
[ RUN ] Parameters/TestRpc.TimedOutOnResponseMetric/SSL_UnixSocket
I20260925 19:31:07.220530 740 acceptor_pool.cc:254] collecting diagnostics on the listening RPC socket unix:/tmp/dist-test-taskR6mfdH/test-tmp/rpc-test-617f602bbac24979bcbcf6d1ea9454cc.sock every 8 connection(s)
I20260925 19:31:07.221253 741 acceptor_pool.cc:254] collecting diagnostics on the listening RPC socket unix:/tmp/dist-test-taskR6mfdH/test-tmp/rpc-test-617f602bbac24979bcbcf6d1ea9454cc.sock every 8 connection(s)
W20260925 19:31:07.458400 744 rpcz_store.cc:267] Call kudu.rpc_test.CalculatorService.Sleep from unix:<unnamed> (request call id 3) took 50 ms (client timeout 25 ms). Trace:
W20260925 19:31:07.458747 744 rpcz_store.cc:269] 0925 19:31:07.407770 (+ 0us) service_pool.cc:170] Inserting onto call queue
0925 19:31:07.407884 (+ 114us) service_pool.cc:227] Handling call
0925 19:31:07.458327 (+ 50443us) inbound_call.cc:173] Queueing success response
Related trace 'test_child':
Metrics: {"test_sleep_us":50000,"child_traces":[["test_child",{"related_trace_metric":1}]]}
W20260925 19:31:07.517591 744 rpcz_store.cc:267] Call kudu.rpc_test.CalculatorService.Sleep from unix:<unnamed> (request call id 4) took 50 ms (client timeout 50 ms). Trace:
W20260925 19:31:07.517892 744 rpcz_store.cc:269] 0925 19:31:07.467118 (+ 0us) service_pool.cc:170] Inserting onto call queue
0925 19:31:07.467221 (+ 103us) service_pool.cc:227] Handling call
0925 19:31:07.517537 (+ 50316us) inbound_call.cc:173] Queueing success response
Related trace 'test_child':
Metrics: {"test_sleep_us":50000,"child_traces":[["test_child",{"related_trace_metric":1}]]}
W20260925 19:31:07.521697 737 connection.cc:196] Error closing socket: Network error: TlsSocket::Close: Broken pipe
[ OK ] Parameters/TestRpc.TimedOutOnResponseMetric/SSL_UnixSocket (330 ms)
[ RUN ] Parameters/TestRpc.AcceptorDispatchingTimesMetric/SSL_UnixSocket
I20260925 19:31:07.536857 765 acceptor_pool.cc:254] collecting diagnostics on the listening RPC socket 0.0.0.0:45601 every 8 connection(s)
I20260925 19:31:07.537446 766 acceptor_pool.cc:254] collecting diagnostics on the listening RPC socket 0.0.0.0:45601 every 8 connection(s)
W20260925 19:31:07.543768 761 negotiation.cc:337] Failed RPC negotiation. Trace:
0925 19:31:07.541621 (+ 0us) reactor.cc:625] Submitting negotiation task for server connection from 127.0.0.1:38752 (local address 127.0.0.1:45601)
0925 19:31:07.542181 (+ 560us) server_negotiation.cc:206] Beginning negotiation
0925 19:31:07.542207 (+ 26us) server_negotiation.cc:399] Waiting for connection header
0925 19:31:07.542534 (+ 327us) negotiation.cc:327] Negotiation complete: Network error: Server connection negotiation failed: server connection from 127.0.0.1:38752: BlockingRecv error: recv got EOF from 127.0.0.1:38752 (error 108)
Metrics: {"server-negotiator.queue_time_us":118}
[ OK ] Parameters/TestRpc.AcceptorDispatchingTimesMetric/SSL_UnixSocket (20 ms)
[ RUN ] Parameters/TestRpc.TestRpcCallbackDestroysMessenger/SSL_UnixSocket
[ OK ] Parameters/TestRpc.TestRpcCallbackDestroysMessenger/SSL_UnixSocket (28 ms)
[ RUN ] Parameters/TestRpc.TestApplicationFeatureFlag/SSL_UnixSocket
I20260925 19:31:07.602188 790 acceptor_pool.cc:254] collecting diagnostics on the listening RPC socket unix:/tmp/dist-test-taskR6mfdH/test-tmp/rpc-test-bf28320ec7ea4c7f96dee8bd6f26bc55.sock every 8 connection(s)
I20260925 19:31:07.602902 791 acceptor_pool.cc:254] collecting diagnostics on the listening RPC socket unix:/tmp/dist-test-taskR6mfdH/test-tmp/rpc-test-bf28320ec7ea4c7f96dee8bd6f26bc55.sock every 8 connection(s)
W20260925 19:31:07.629595 787 messenger.cc:357] Unable to handle RPC call: Not implemented: call requires unsupported application feature flags: 99
[ OK ] Parameters/TestRpc.TestApplicationFeatureFlag/SSL_UnixSocket (62 ms)
[ RUN ] Parameters/TestRpc.TestCancellation/SSL_UnixSocket
I20260925 19:31:07.674626 815 acceptor_pool.cc:254] collecting diagnostics on the listening RPC socket unix:/tmp/dist-test-taskR6mfdH/test-tmp/rpc-test-8814644f696145639a511fa5363ff301.sock every 8 connection(s)
I20260925 19:31:07.675340 816 acceptor_pool.cc:254] collecting diagnostics on the listening RPC socket unix:/tmp/dist-test-taskR6mfdH/test-tmp/rpc-test-8814644f696145639a511fa5363ff301.sock every 8 connection(s)
I20260925 19:31:07.678436 391 rpc-test.cc:1648] Connecting to unix:/tmp/dist-test-taskR6mfdH/test-tmp/rpc-test-8814644f696145639a511fa5363ff301.sock
I20260925 19:31:07.792548 391 rpc-test-base.h:595] status: Aborted: Sleep RPC to unix:/tmp/dist-test-taskR6mfdH/test-tmp/rpc-test-8814644f696145639a511fa5363ff301.sock is cancelled in state READY, seconds elapsed: 0.000378786
I20260925 19:31:07.968338 391 rpc-test-base.h:595] status: Aborted: Sleep RPC to unix:/tmp/dist-test-taskR6mfdH/test-tmp/rpc-test-8814644f696145639a511fa5363ff301.sock is cancelled in state SENT, seconds elapsed: 0.00089028
I20260925 19:31:07.968564 818 rpc-test-base.h:222] got call: sleep_micros: 510000
I20260925 19:31:08.167393 391 rpc-test-base.h:595] status: Aborted: Sleep RPC to unix:/tmp/dist-test-taskR6mfdH/test-tmp/rpc-test-8814644f696145639a511fa5363ff301.sock is cancelled in state SENT, seconds elapsed: 0.000711809
I20260925 19:31:08.167761 817 rpc-test-base.h:222] got call: sleep_micros: 510000
I20260925 19:31:08.338999 391 rpc-test-base.h:595] status: Aborted: Sleep RPC to unix:/tmp/dist-test-taskR6mfdH/test-tmp/rpc-test-8814644f696145639a511fa5363ff301.sock is cancelled in state SENT, seconds elapsed: 0.000827159
W20260925 19:31:08.349748 819 rpcz_store.cc:267] Call kudu.rpc.GenericCalculatorService.Sleep from unix:<unnamed> (request call id 11) took 10 ms (client timeout 10 ms). Trace:
W20260925 19:31:08.350054 819 rpcz_store.cc:269] 0925 19:31:08.339063 (+ 0us) service_pool.cc:170] Inserting onto call queue
0925 19:31:08.349479 (+ 10416us) service_pool.cc:214] Skipping call since client already timed out
0925 19:31:08.349554 (+ 75us) inbound_call.cc:173] Queueing failure response
Metrics: {}
I20260925 19:31:08.350600 819 rpc-test-base.h:222] got call: sleep_micros: 1500000
W20260925 19:31:08.479130 818 rpcz_store.cc:267] Call kudu.rpc.GenericCalculatorService.Sleep from unix:<unnamed> (request call id 3) took 510 ms (client timeout 10 ms). Trace:
W20260925 19:31:08.479445 818 rpcz_store.cc:269] 0925 19:31:07.968367 (+ 0us) service_pool.cc:170] Inserting onto call queue
0925 19:31:07.968508 (+ 141us) service_pool.cc:227] Handling call
0925 19:31:08.479076 (+510568us) inbound_call.cc:173] Queueing success response
Metrics: {}
W20260925 19:31:08.678306 817 rpcz_store.cc:267] Call kudu.rpc.GenericCalculatorService.Sleep from unix:<unnamed> (request call id 7) took 510 ms (client timeout 10 ms). Trace:
W20260925 19:31:08.678644 817 rpcz_store.cc:269] 0925 19:31:08.167538 (+ 0us) service_pool.cc:170] Inserting onto call queue
0925 19:31:08.167713 (+ 175us) service_pool.cc:227] Handling call
0925 19:31:08.678244 (+510531us) inbound_call.cc:173] Queueing success response
Metrics: {}
I20260925 19:31:09.341478 391 rpc-test-base.h:595] status: Timed out: Sleep RPC to unix:/tmp/dist-test-taskR6mfdH/test-tmp/rpc-test-8814644f696145639a511fa5363ff301.sock timed out after 1.000s (SENT), seconds elapsed: 1.00197
I20260925 19:31:09.343360 817 rpc-test-base.h:222] got call: sleep_micros: 1500000
W20260925 19:31:09.851287 819 rpcz_store.cc:267] Call kudu.rpc.GenericCalculatorService.Sleep from unix:<unnamed> (request call id 12) took 1511 ms (client timeout 1000 ms). Trace:
W20260925 19:31:09.851622 819 rpcz_store.cc:269] 0925 19:31:08.340134 (+ 0us) service_pool.cc:170] Inserting onto call queue
0925 19:31:08.350554 (+ 10420us) service_pool.cc:227] Handling call
0925 19:31:09.851133 (+1500579us) inbound_call.cc:173] Queueing success response
Metrics: {}
I20260925 19:31:10.343816 391 rpc-test-base.h:595] status: Timed out: Sleep RPC to unix:/tmp/dist-test-taskR6mfdH/test-tmp/rpc-test-8814644f696145639a511fa5363ff301.sock timed out after 1.000s (SENT), seconds elapsed: 1.00183
W20260925 19:31:10.345291 812 messenger.cc:357] Unable to handle RPC call: Not implemented: call requires unsupported application feature flags: 99, 1
W20260925 19:31:10.346741 812 messenger.cc:357] Unable to handle RPC call: Not implemented: call requires unsupported application feature flags: 99, 1
W20260925 19:31:10.569252 812 connection.cc:196] Error closing socket: Network error: TlsSocket::Close: Broken pipe
W20260925 19:31:10.843950 817 rpcz_store.cc:267] Call kudu.rpc.GenericCalculatorService.Sleep from unix:<unnamed> (request call id 13) took 1501 ms (client timeout 1000 ms). Trace:
W20260925 19:31:10.844238 817 rpcz_store.cc:269] 0925 19:31:09.343067 (+ 0us) service_pool.cc:170] Inserting onto call queue
0925 19:31:09.343250 (+ 183us) service_pool.cc:227] Handling call
0925 19:31:10.843900 (+1500650us) inbound_call.cc:173] Queueing success response
Metrics: {}
W20260925 19:31:10.844869 812 connection.cc:441] server connection from unix:<unnamed> torn down before Call kudu.rpc.GenericCalculatorService.Sleep from unix:<unnamed> (request call id 13) could send its response
[ OK ] Parameters/TestRpc.TestCancellation/SSL_UnixSocket (3215 ms)
[ RUN ] Parameters/TestRpc.TestCancellationMultiThreads/SSL_UnixSocket
I20260925 19:31:10.872275 841 acceptor_pool.cc:254] collecting diagnostics on the listening RPC socket unix:/tmp/dist-test-taskR6mfdH/test-tmp/rpc-test-52b23037b9dd48e5856678fd169c0cd7.sock every 8 connection(s)
I20260925 19:31:10.873186 842 acceptor_pool.cc:254] collecting diagnostics on the listening RPC socket unix:/tmp/dist-test-taskR6mfdH/test-tmp/rpc-test-52b23037b9dd48e5856678fd169c0cd7.sock every 8 connection(s)
I20260925 19:31:10.876267 391 rpc-test.cc:1808] Connecting to unix:/tmp/dist-test-taskR6mfdH/test-tmp/rpc-test-52b23037b9dd48e5856678fd169c0cd7.sock
I20260925 19:31:11.038512 855 test_util.cc:268] Using random seed: -1036233783
I20260925 19:31:11.039637 856 test_util.cc:268] Using random seed: -1036232575
I20260925 19:31:11.041137 857 test_util.cc:268] Using random seed: -1036231172
I20260925 19:31:11.042507 858 test_util.cc:268] Using random seed: -1036229727
I20260925 19:31:11.043905 859 test_util.cc:268] Using random seed: -1036228413
I20260925 19:31:11.045240 860 test_util.cc:268] Using random seed: -1036227071
I20260925 19:31:11.047147 861 test_util.cc:268] Using random seed: -1036225185
I20260925 19:31:11.048872 862 test_util.cc:268] Using random seed: -1036223433
I20260925 19:31:11.050520 863 test_util.cc:268] Using random seed: -1036221779
I20260925 19:31:11.051750 864 test_util.cc:268] Using random seed: -1036220549
I20260925 19:31:11.053409 865 test_util.cc:268] Using random seed: -1036218930
I20260925 19:31:11.055387 866 test_util.cc:268] Using random seed: -1036217030
I20260925 19:31:11.057312 867 test_util.cc:268] Using random seed: -1036215733
I20260925 19:31:11.061118 868 test_util.cc:268] Using random seed: -1036211640
I20260925 19:31:11.065410 869 test_util.cc:268] Using random seed: -1036207378
I20260925 19:31:11.069502 870 test_util.cc:268] Using random seed: -1036203331
I20260925 19:31:11.073638 871 test_util.cc:268] Using random seed: -1036199151
I20260925 19:31:11.075598 872 test_util.cc:268] Using random seed: -1036196887
I20260925 19:31:11.077932 873 test_util.cc:268] Using random seed: -1036194468
I20260925 19:31:11.081444 874 test_util.cc:268] Using random seed: -1036191390
I20260925 19:31:11.083825 875 test_util.cc:268] Using random seed: -1036189067
I20260925 19:31:11.085145 876 test_util.cc:268] Using random seed: -1036187169
I20260925 19:31:11.087118 877 test_util.cc:268] Using random seed: -1036185248
I20260925 19:31:11.088934 878 test_util.cc:268] Using random seed: -1036183410
I20260925 19:31:11.090912 879 test_util.cc:268] Using random seed: -1036181873
I20260925 19:31:11.092701 880 test_util.cc:268] Using random seed: -1036179644
I20260925 19:31:11.094802 881 test_util.cc:268] Using random seed: -1036177612
I20260925 19:31:11.097255 882 test_util.cc:268] Using random seed: -1036175107
I20260925 19:31:11.099411 883 test_util.cc:268] Using random seed: -1036172973
I20260925 19:31:11.101647 884 test_util.cc:268] Using random seed: -1036170746
W20260925 19:31:30.644686 838 connection.cc:196] Error closing socket: Network error: TlsSocket::Close: Broken pipe
[ OK ] Parameters/TestRpc.TestCancellationMultiThreads/SSL_UnixSocket (19809 ms)
[ RUN ] Parameters/TestRpc.TestCallId/SSL_UnixSocket
I20260925 19:31:30.688499 898 acceptor_pool.cc:254] collecting diagnostics on the listening RPC socket unix:/tmp/dist-test-taskR6mfdH/test-tmp/rpc-test-66d37a7e6fe34e7bbd6902fab7b51040.sock every 8 connection(s)
I20260925 19:31:30.689513 899 acceptor_pool.cc:254] collecting diagnostics on the listening RPC socket unix:/tmp/dist-test-taskR6mfdH/test-tmp/rpc-test-66d37a7e6fe34e7bbd6902fab7b51040.sock every 8 connection(s)
W20260925 19:31:30.737965 895 connection.cc:196] Error closing socket: Network error: TlsSocket::Close: Broken pipe
[ OK ] Parameters/TestRpc.TestCallId/SSL_UnixSocket (83 ms)
[----------] 20 tests from Parameters/TestRpc (38375 ms total)
[----------] Global test environment tear-down
[==========] 21 tests from 2 test suites ran. (41677 ms total)
[ PASSED ] 20 tests.
[ FAILED ] 1 test, listed below:
[ FAILED ] Parameters/TestRpc.TestCallWithChainCertAndRootCA/SSL_UnixSocket, where GetParam() = (true, true)
1 FAILED TEST
I20260925 19:31:30.762830 391 logging.cc:424] LogThrottler /data0/somelongdirectorytoavoidrpathissues/src/kudu/src/kudu/rpc/acceptor_pool.cc:285: suppressed but not reported on 3 messages since previous log ~34 seconds ago