Parameters/TestRpc.TestCallWithChainCertAndRootCA/SSL_UnixSocket: /data0/somelongdirectorytoavoidrpathissues/src/kudu/src/kudu/rpc/rpc-test.cc:303: Failure
Failed
Bad status: Runtime error: could not verify certificate chain (error with cert: subject=CN = localhost, ST = sadfjas, C = AS, emailAddress = sdflkdsajf, O = lskdfjlsad, OU = sldfkja, issuer=C = AS, ST = ASDfkjdhf, L = lskdjf, O = saldfja, OU = skdjf, CN = localhost, emailAddress = sadjflkadsj): : certificate has expired
Google Test trace:
/data0/somelongdirectorytoavoidrpathissues/src/kudu/src/kudu/rpc/rpc-test.cc:300: Connecting to unix:/tmp/dist-test-task12nalU/test-tmp/rpc-test-1eb3d0779f5f4cbdb1fa7ac339df0a53.sock
I20260929 21:42:08.851706 390 test_util.cc:175] -----------------------------------------------
I20260929 21:42:08.851874 390 test_util.cc:176] Had fatal failures, leaving test files at /tmp/dist-test-task12nalU/test-tmp/rpc-test.2.Parameters_TestRpc.TestCallWithChainCertAndRootCA_SSL_UnixSocket.1790718125305636-390-0
Note: This is test shard 3 of 8.
[==========] Running 21 tests from 2 test suites.
[----------] Global test environment set-up.
[----------] 1 test from TestRpc
[ RUN ] TestRpc.TestNegotiationTimeout
WARNING: Logging before InitGoogleLogging() is written to STDERR
I20260929 21:42:05.494207 390 rpc-test-base.h:595] status: Timed out: connection negotiation to 0.0.0.0:35251 for RPC Sleep timed out after 0.100s (ON_OUTBOUND_QUEUE), seconds elapsed: 0.101787
W20260929 21:42:08.571002 400 negotiation.cc:337] Failed RPC negotiation. Trace:
0929 21:42:05.393308 (+ 0us) reactor.cc:625] Submitting negotiation task for client connection to 0.0.0.0:35251 (local address 127.0.0.1:50740)
0929 21:42:05.393998 (+ 690us) negotiation.cc:107] Waiting for socket to connect
0929 21:42:05.394046 (+ 48us) client_negotiation.cc:174] Beginning negotiation
0929 21:42:05.407027 (+ 12981us) client_negotiation.cc:252] Sending NEGOTIATE NegotiatePB request
0929 21:42:08.569899 (+3162872us) negotiation.cc:327] Negotiation complete: Timed out: Client connection negotiation failed: client connection to 0.0.0.0:35251: received 0 of 4 requested bytes
Metrics: {"client-negotiator.queue_time_us":201}
[ OK ] TestRpc.TestNegotiationTimeout (3217 ms)
[----------] 1 test from TestRpc (3217 ms total)
[----------] 20 tests from Parameters/TestRpc
[ RUN ] Parameters/TestRpc.TestAcceptorPoolStartStop/SSL_UnixSocket
I20260929 21:42:08.604019 416 acceptor_pool.cc:254] collecting diagnostics on the listening RPC socket unix:/tmp/dist-test-task12nalU/test-tmp/rpc-test-3f2c00e203084439b18dd977d6c85004.sock every 8 connection(s)
I20260929 21:42:08.606086 417 acceptor_pool.cc:254] collecting diagnostics on the listening RPC socket unix:/tmp/dist-test-task12nalU/test-tmp/rpc-test-3f2c00e203084439b18dd977d6c85004.sock every 8 connection(s)
I20260929 21:42:08.641028 427 acceptor_pool.cc:254] collecting diagnostics on the listening RPC socket unix:/tmp/dist-test-task12nalU/test-tmp/rpc-test-3f2c00e203084439b18dd977d6c85004.sock every 8 connection(s)
I20260929 21:42:08.642809 428 acceptor_pool.cc:254] collecting diagnostics on the listening RPC socket unix:/tmp/dist-test-task12nalU/test-tmp/rpc-test-3f2c00e203084439b18dd977d6c85004.sock every 8 connection(s)
I20260929 21:42:08.659417 438 acceptor_pool.cc:254] collecting diagnostics on the listening RPC socket unix:/tmp/dist-test-task12nalU/test-tmp/rpc-test-3f2c00e203084439b18dd977d6c85004.sock every 8 connection(s)
I20260929 21:42:08.660295 439 acceptor_pool.cc:254] collecting diagnostics on the listening RPC socket unix:/tmp/dist-test-task12nalU/test-tmp/rpc-test-3f2c00e203084439b18dd977d6c85004.sock every 8 connection(s)
I20260929 21:42:08.680554 449 acceptor_pool.cc:254] collecting diagnostics on the listening RPC socket unix:/tmp/dist-test-task12nalU/test-tmp/rpc-test-3f2c00e203084439b18dd977d6c85004.sock every 8 connection(s)
I20260929 21:42:08.681263 450 acceptor_pool.cc:254] collecting diagnostics on the listening RPC socket unix:/tmp/dist-test-task12nalU/test-tmp/rpc-test-3f2c00e203084439b18dd977d6c85004.sock every 8 connection(s)
I20260929 21:42:08.699132 460 acceptor_pool.cc:254] collecting diagnostics on the listening RPC socket unix:/tmp/dist-test-task12nalU/test-tmp/rpc-test-3f2c00e203084439b18dd977d6c85004.sock every 8 connection(s)
I20260929 21:42:08.699806 461 acceptor_pool.cc:254] collecting diagnostics on the listening RPC socket unix:/tmp/dist-test-task12nalU/test-tmp/rpc-test-3f2c00e203084439b18dd977d6c85004.sock every 8 connection(s)
[ OK ] Parameters/TestRpc.TestAcceptorPoolStartStop/SSL_UnixSocket (128 ms)
[ RUN ] Parameters/TestRpc.TestCall/SSL_UnixSocket
I20260929 21:42:08.729787 473 acceptor_pool.cc:254] collecting diagnostics on the listening RPC socket unix:/tmp/dist-test-task12nalU/test-tmp/rpc-test-56410f356a2c43cba5bc13642b33999c.sock every 8 connection(s)
I20260929 21:42:08.732231 474 acceptor_pool.cc:254] collecting diagnostics on the listening RPC socket unix:/tmp/dist-test-task12nalU/test-tmp/rpc-test-56410f356a2c43cba5bc13642b33999c.sock every 8 connection(s)
I20260929 21:42:08.737188 390 rpc-test.cc:234] Connecting to unix:/tmp/dist-test-task12nalU/test-tmp/rpc-test-56410f356a2c43cba5bc13642b33999c.sock
W20260929 21:42:08.797184 470 connection.cc:196] Error closing socket: Network error: TlsSocket::Close: Broken pipe
[ OK ] Parameters/TestRpc.TestCall/SSL_UnixSocket (98 ms)
[ RUN ] Parameters/TestRpc.TestCallWithChainCertAndRootCA/SSL_UnixSocket
I20260929 21:42:08.831959 498 acceptor_pool.cc:254] collecting diagnostics on the listening RPC socket unix:/tmp/dist-test-task12nalU/test-tmp/rpc-test-1eb3d0779f5f4cbdb1fa7ac339df0a53.sock every 8 connection(s)
I20260929 21:42:08.832724 499 acceptor_pool.cc:254] collecting diagnostics on the listening RPC socket unix:/tmp/dist-test-task12nalU/test-tmp/rpc-test-1eb3d0779f5f4cbdb1fa7ac339df0a53.sock every 8 connection(s)
/data0/somelongdirectorytoavoidrpathissues/src/kudu/src/kudu/rpc/rpc-test.cc:303: Failure
Failed
Bad status: Runtime error: could not verify certificate chain (error with cert: subject=CN = localhost, ST = sadfjas, C = AS, emailAddress = sdflkdsajf, O = lskdfjlsad, OU = sldfkja, issuer=C = AS, ST = ASDfkjdhf, L = lskdjf, O = saldfja, OU = skdjf, CN = localhost, emailAddress = sadjflkadsj): : certificate has expired
Google Test trace:
/data0/somelongdirectorytoavoidrpathissues/src/kudu/src/kudu/rpc/rpc-test.cc:300: Connecting to unix:/tmp/dist-test-task12nalU/test-tmp/rpc-test-1eb3d0779f5f4cbdb1fa7ac339df0a53.sock
I20260929 21:42:08.851706 390 test_util.cc:175] -----------------------------------------------
I20260929 21:42:08.851874 390 test_util.cc:176] Had fatal failures, leaving test files at /tmp/dist-test-task12nalU/test-tmp/rpc-test.2.Parameters_TestRpc.TestCallWithChainCertAndRootCA_SSL_UnixSocket.1790718125305636-390-0
[ FAILED ] Parameters/TestRpc.TestCallWithChainCertAndRootCA/SSL_UnixSocket, where GetParam() = (true, true) (50 ms)
[ RUN ] Parameters/TestRpc.TestCallWithBadPasswordProtectedKey/SSL_UnixSocket
[ OK ] Parameters/TestRpc.TestCallWithBadPasswordProtectedKey/SSL_UnixSocket (28 ms)
[ RUN ] Parameters/TestRpc.TestInvalidMethodCall/SSL_UnixSocket
I20260929 21:42:08.897624 535 acceptor_pool.cc:254] collecting diagnostics on the listening RPC socket unix:/tmp/dist-test-task12nalU/test-tmp/rpc-test-5dd35a35d0594c2d9ab9a6892cdf6585.sock every 8 connection(s)
I20260929 21:42:08.898360 536 acceptor_pool.cc:254] collecting diagnostics on the listening RPC socket unix:/tmp/dist-test-task12nalU/test-tmp/rpc-test-5dd35a35d0594c2d9ab9a6892cdf6585.sock every 8 connection(s)
I20260929 21:42:08.901703 390 rpc-test.cc:406] Connecting to unix:/tmp/dist-test-task12nalU/test-tmp/rpc-test-5dd35a35d0594c2d9ab9a6892cdf6585.sock
W20260929 21:42:08.938913 532 connection.cc:196] Error closing socket: Network error: TlsSocket::Close: Broken pipe
[ OK ] Parameters/TestRpc.TestInvalidMethodCall/SSL_UnixSocket (62 ms)
[ RUN ] Parameters/TestRpc.TestHighFDs/SSL_UnixSocket
I20260929 21:42:09.149763 560 acceptor_pool.cc:254] collecting diagnostics on the listening RPC socket unix:/tmp/dist-test-task12nalU/test-tmp/rpc-test-94c5b131480540f18fd225cc0dea636f.sock every 8 connection(s)
I20260929 21:42:09.150441 561 acceptor_pool.cc:254] collecting diagnostics on the listening RPC socket unix:/tmp/dist-test-task12nalU/test-tmp/rpc-test-94c5b131480540f18fd225cc0dea636f.sock every 8 connection(s)
W20260929 21:42:09.181538 557 connection.cc:196] Error closing socket: Network error: TlsSocket::Close: Broken pipe
[ OK ] Parameters/TestRpc.TestHighFDs/SSL_UnixSocket (248 ms)
[ RUN ] Parameters/TestRpc.TestConnectionAlwaysKeepalive/SSL_UnixSocket
I20260929 21:42:09.218779 583 acceptor_pool.cc:254] collecting diagnostics on the listening RPC socket unix:/tmp/dist-test-task12nalU/test-tmp/rpc-test-62d3463d5ccd4da6b6cd89c9a52a3e0c.sock every 8 connection(s)
I20260929 21:42:09.219477 584 acceptor_pool.cc:254] collecting diagnostics on the listening RPC socket unix:/tmp/dist-test-task12nalU/test-tmp/rpc-test-62d3463d5ccd4da6b6cd89c9a52a3e0c.sock every 8 connection(s)
I20260929 21:42:09.222460 390 rpc-test.cc:532] Connecting to unix:/tmp/dist-test-task12nalU/test-tmp/rpc-test-62d3463d5ccd4da6b6cd89c9a52a3e0c.sock
W20260929 21:42:12.252960 582 connection.cc:196] Error closing socket: Network error: TlsSocket::Close: Broken pipe
[ OK ] Parameters/TestRpc.TestConnectionAlwaysKeepalive/SSL_UnixSocket (3065 ms)
[ RUN ] Parameters/TestRpc.TestReopenOutboundConnections/SSL_UnixSocket
I20260929 21:42:12.290707 606 acceptor_pool.cc:254] collecting diagnostics on the listening RPC socket unix:/tmp/dist-test-task12nalU/test-tmp/rpc-test-ef2c76c98d60463b9b3446de89b0006d.sock every 8 connection(s)
I20260929 21:42:12.291359 607 acceptor_pool.cc:254] collecting diagnostics on the listening RPC socket unix:/tmp/dist-test-task12nalU/test-tmp/rpc-test-ef2c76c98d60463b9b3446de89b0006d.sock every 8 connection(s)
I20260929 21:42:12.294315 390 rpc-test.cc:658] Connecting to unix:/tmp/dist-test-task12nalU/test-tmp/rpc-test-ef2c76c98d60463b9b3446de89b0006d.sock
W20260929 21:42:12.319213 605 connection.cc:196] Error closing socket: Network error: TlsSocket::Close: Broken pipe
W20260929 21:42:12.328444 605 connection.cc:196] Error closing socket: Network error: TlsSocket::Close: Broken pipe
W20260929 21:42:12.337766 605 connection.cc:196] Error closing socket: Network error: TlsSocket::Close: Broken pipe
W20260929 21:42:12.347213 605 connection.cc:196] Error closing socket: Network error: TlsSocket::Close: Broken pipe
W20260929 21:42:12.357043 605 connection.cc:196] Error closing socket: Network error: TlsSocket::Close: Broken pipe
W20260929 21:42:12.366247 605 connection.cc:196] Error closing socket: Network error: TlsSocket::Close: Broken pipe
W20260929 21:42:12.375481 605 connection.cc:196] Error closing socket: Network error: TlsSocket::Close: Broken pipe
W20260929 21:42:12.384578 605 connection.cc:196] Error closing socket: Network error: TlsSocket::Close: Broken pipe
W20260929 21:42:12.394310 605 connection.cc:196] Error closing socket: Network error: TlsSocket::Close: Broken pipe
W20260929 21:42:12.403512 605 connection.cc:196] Error closing socket: Network error: TlsSocket::Close: Broken pipe
W20260929 21:42:12.413033 605 connection.cc:196] Error closing socket: Network error: TlsSocket::Close: Broken pipe
W20260929 21:42:12.422720 605 connection.cc:196] Error closing socket: Network error: TlsSocket::Close: Broken pipe
W20260929 21:42:12.432837 605 connection.cc:196] Error closing socket: Network error: TlsSocket::Close: Broken pipe
W20260929 21:42:12.442252 605 connection.cc:196] Error closing socket: Network error: TlsSocket::Close: Broken pipe
W20260929 21:42:12.442351 606 acceptor_pool.cc:285] unable to collect diagnostics on RPC socket unix:/tmp/dist-test-task12nalU/test-tmp/rpc-test-ef2c76c98d60463b9b3446de89b0006d.sock: Not implemented: netlink diagnostics is currently supported only on IPv4 TCP sockets
W20260929 21:42:12.452181 605 connection.cc:196] Error closing socket: Network error: TlsSocket::Close: Broken pipe
W20260929 21:42:12.462394 605 connection.cc:196] Error closing socket: Network error: TlsSocket::Close: Broken pipe
W20260929 21:42:12.472406 605 connection.cc:196] Error closing socket: Network error: TlsSocket::Close: Broken pipe
W20260929 21:42:12.482682 605 connection.cc:196] Error closing socket: Network error: TlsSocket::Close: Broken pipe
W20260929 21:42:12.494277 605 connection.cc:196] Error closing socket: Network error: TlsSocket::Close: Broken pipe
W20260929 21:42:12.504124 605 connection.cc:196] Error closing socket: Network error: TlsSocket::Close: Broken pipe
W20260929 21:42:12.514187 605 connection.cc:196] Error closing socket: Network error: TlsSocket::Close: Broken pipe
W20260929 21:42:12.524137 605 connection.cc:196] Error closing socket: Network error: TlsSocket::Close: Broken pipe
W20260929 21:42:12.534220 605 connection.cc:196] Error closing socket: Network error: TlsSocket::Close: Broken pipe
W20260929 21:42:12.543888 605 connection.cc:196] Error closing socket: Network error: TlsSocket::Close: Broken pipe
W20260929 21:42:12.553386 605 connection.cc:196] Error closing socket: Network error: TlsSocket::Close: Broken pipe
W20260929 21:42:12.562647 605 connection.cc:196] Error closing socket: Network error: TlsSocket::Close: Broken pipe
W20260929 21:42:12.572177 605 connection.cc:196] Error closing socket: Network error: TlsSocket::Close: Broken pipe
W20260929 21:42:12.580899 605 connection.cc:196] Error closing socket: Network error: TlsSocket::Close: Broken pipe
W20260929 21:42:12.590155 605 connection.cc:196] Error closing socket: Network error: TlsSocket::Close: Broken pipe
W20260929 21:42:12.598945 605 connection.cc:196] Error closing socket: Network error: TlsSocket::Close: Broken pipe
W20260929 21:42:12.608254 605 connection.cc:196] Error closing socket: Network error: TlsSocket::Close: Broken pipe
W20260929 21:42:12.618659 605 connection.cc:196] Error closing socket: Network error: TlsSocket::Close: Broken pipe
[ OK ] Parameters/TestRpc.TestReopenOutboundConnections/SSL_UnixSocket (365 ms)
[ RUN ] Parameters/TestRpc.TestConnectionNetworkPlane/SSL_UnixSocket
I20260929 21:42:12.640013 629 acceptor_pool.cc:254] collecting diagnostics on the listening RPC socket unix:/tmp/dist-test-task12nalU/test-tmp/rpc-test-3f2382842a784a1d8cda2adc8bd3bb06.sock every 8 connection(s)
I20260929 21:42:12.640658 630 acceptor_pool.cc:254] collecting diagnostics on the listening RPC socket unix:/tmp/dist-test-task12nalU/test-tmp/rpc-test-3f2382842a784a1d8cda2adc8bd3bb06.sock every 8 connection(s)
I20260929 21:42:12.643540 390 rpc-test.cc:772] Connecting to unix:/tmp/dist-test-task12nalU/test-tmp/rpc-test-3f2382842a784a1d8cda2adc8bd3bb06.sock
W20260929 21:42:12.695174 628 connection.cc:196] Error closing socket: Network error: TlsSocket::Close: Broken pipe
W20260929 21:42:12.696096 628 connection.cc:196] Error closing socket: Network error: TlsSocket::Close: Broken pipe
[ OK ] Parameters/TestRpc.TestConnectionNetworkPlane/SSL_UnixSocket (76 ms)
[ RUN ] Parameters/TestRpc.TestTCPKeepalive/SSL_UnixSocket
I20260929 21:42:12.720278 654 acceptor_pool.cc:254] collecting diagnostics on the listening RPC socket unix:/tmp/dist-test-task12nalU/test-tmp/rpc-test-f5f95578f5914f14adec196c7d825199.sock every 8 connection(s)
I20260929 21:42:12.721117 655 acceptor_pool.cc:254] collecting diagnostics on the listening RPC socket unix:/tmp/dist-test-task12nalU/test-tmp/rpc-test-f5f95578f5914f14adec196c7d825199.sock every 8 connection(s)
I20260929 21:42:12.761498 658 rpc-test-base.h:222] got call: sleep_micros: 8000000 deferred: true
I20260929 21:42:20.765409 658 rpcz_store.cc:275] Call kudu.rpc.GenericCalculatorService.Sleep from unix:<unnamed> (request call id 0) took 8004 ms. Trace:
I20260929 21:42:20.765821 658 rpcz_store.cc:276] 0929 21:42:12.761358 (+ 0us) service_pool.cc:170] Inserting onto call queue
0929 21:42:12.761446 (+ 88us) service_pool.cc:227] Handling call
0929 21:42:20.765246 (+8003800us) inbound_call.cc:173] Queueing success response
Metrics: {}
[ OK ] Parameters/TestRpc.TestTCPKeepalive/SSL_UnixSocket (8078 ms)
[ RUN ] Parameters/TestRpc.TestMaxSmallSidecars/SSL_UnixSocket
I20260929 21:42:20.796752 680 acceptor_pool.cc:254] collecting diagnostics on the listening RPC socket unix:/tmp/dist-test-task12nalU/test-tmp/rpc-test-f5f2ff955a084e1ab77616fbadedfd0b.sock every 8 connection(s)
I20260929 21:42:20.797541 681 acceptor_pool.cc:254] collecting diagnostics on the listening RPC socket unix:/tmp/dist-test-task12nalU/test-tmp/rpc-test-f5f2ff955a084e1ab77616fbadedfd0b.sock every 8 connection(s)
W20260929 21:42:20.966853 677 connection.cc:196] Error closing socket: Network error: TlsSocket::Close: Broken pipe
[ OK ] Parameters/TestRpc.TestMaxSmallSidecars/SSL_UnixSocket (192 ms)
[ RUN ] Parameters/TestRpc.TestCallTimeout/SSL_UnixSocket
I20260929 21:42:21.004537 705 acceptor_pool.cc:254] collecting diagnostics on the listening RPC socket unix:/tmp/dist-test-task12nalU/test-tmp/rpc-test-7461e0ce0fe34dd7a39ba0097a2e9ce7.sock every 8 connection(s)
I20260929 21:42:21.005151 706 acceptor_pool.cc:254] collecting diagnostics on the listening RPC socket unix:/tmp/dist-test-task12nalU/test-tmp/rpc-test-7461e0ce0fe34dd7a39ba0097a2e9ce7.sock every 8 connection(s)
I20260929 21:42:21.025282 390 rpc-test-base.h:595] status: Timed out: connection negotiation to unix:/tmp/dist-test-task12nalU/test-tmp/rpc-test-7461e0ce0fe34dd7a39ba0097a2e9ce7.sock for RPC Sleep timed out after 0.000s (ON_OUTBOUND_QUEUE), seconds elapsed: 0.00227801
I20260929 21:42:21.032603 709 rpc-test-base.h:222] got call: sleep_micros: 700000
I20260929 21:42:21.226424 390 rpc-test-base.h:595] status: Timed out: Sleep RPC to unix:/tmp/dist-test-task12nalU/test-tmp/rpc-test-7461e0ce0fe34dd7a39ba0097a2e9ce7.sock timed out after 0.200s (SENT), seconds elapsed: 0.200821
I20260929 21:42:21.227792 708 rpc-test-base.h:222] got call: sleep_micros: 2000000
W20260929 21:42:21.733249 709 rpcz_store.cc:267] Call kudu.rpc.GenericCalculatorService.Sleep from unix:<unnamed> (request call id 1) took 700 ms (client timeout 200 ms). Trace:
W20260929 21:42:21.733598 709 rpcz_store.cc:269] 0929 21:42:21.032443 (+ 0us) service_pool.cc:170] Inserting onto call queue
0929 21:42:21.032541 (+ 98us) service_pool.cc:227] Handling call
0929 21:42:21.733172 (+700631us) inbound_call.cc:173] Queueing success response
Metrics: {}
I20260929 21:42:22.728830 390 rpc-test-base.h:595] status: Timed out: Sleep RPC to unix:/tmp/dist-test-task12nalU/test-tmp/rpc-test-7461e0ce0fe34dd7a39ba0097a2e9ce7.sock timed out after 1.500s (SENT), seconds elapsed: 1.5021
W20260929 21:42:22.732297 702 connection.cc:196] Error closing socket: Network error: TlsSocket::Close: Broken pipe
W20260929 21:42:23.228312 708 rpcz_store.cc:267] Call kudu.rpc.GenericCalculatorService.Sleep from unix:<unnamed> (request call id 2) took 2000 ms (client timeout 1500 ms). Trace:
W20260929 21:42:23.228605 708 rpcz_store.cc:269] 0929 21:42:21.227497 (+ 0us) service_pool.cc:170] Inserting onto call queue
0929 21:42:21.227641 (+ 144us) service_pool.cc:227] Handling call
0929 21:42:23.228243 (+2000602us) inbound_call.cc:173] Queueing success response
Metrics: {}
W20260929 21:42:23.229192 702 connection.cc:441] server connection from unix:<unnamed> torn down before Call kudu.rpc.GenericCalculatorService.Sleep from unix:<unnamed> (request call id 2) could send its response
[ OK ] Parameters/TestRpc.TestCallTimeout/SSL_UnixSocket (2262 ms)
[ RUN ] Parameters/TestRpc.TestServerShutsDown/SSL_UnixSocket
I20260929 21:42:23.235374 390 rpc-test.cc:1125] Connecting to 0.0.0.0:36145
W20260929 21:42:23.244459 722 negotiation.cc:337] Failed RPC negotiation. Trace:
0929 21:42:23.243079 (+ 0us) reactor.cc:625] Submitting negotiation task for client connection to 0.0.0.0:36145 (local address 127.0.0.1:55168)
0929 21:42:23.243514 (+ 435us) negotiation.cc:107] Waiting for socket to connect
0929 21:42:23.243544 (+ 30us) client_negotiation.cc:174] Beginning negotiation
0929 21:42:23.243755 (+ 211us) client_negotiation.cc:252] Sending NEGOTIATE NegotiatePB request
0929 21:42:23.243961 (+ 206us) negotiation.cc:327] Negotiation complete: Network error: Client connection negotiation failed: client connection to 0.0.0.0:36145: BlockingWrite error: write error: Broken pipe (error 32)
Metrics: {"client-negotiator.queue_time_us":112}
[ OK ] Parameters/TestRpc.TestServerShutsDown/SSL_UnixSocket (13 ms)
[ RUN ] Parameters/TestRpc.TimedOutOnResponseMetric/SSL_UnixSocket
I20260929 21:42:23.276190 739 acceptor_pool.cc:254] collecting diagnostics on the listening RPC socket unix:/tmp/dist-test-task12nalU/test-tmp/rpc-test-b2e6b5360d5948cb9d7cf27b9c46db97.sock every 8 connection(s)
I20260929 21:42:23.276832 740 acceptor_pool.cc:254] collecting diagnostics on the listening RPC socket unix:/tmp/dist-test-task12nalU/test-tmp/rpc-test-b2e6b5360d5948cb9d7cf27b9c46db97.sock every 8 connection(s)
W20260929 21:42:23.531328 743 rpcz_store.cc:267] Call kudu.rpc_test.CalculatorService.Sleep from unix:<unnamed> (request call id 3) took 50 ms (client timeout 25 ms). Trace:
W20260929 21:42:23.531603 743 rpcz_store.cc:269] 0929 21:42:23.480756 (+ 0us) service_pool.cc:170] Inserting onto call queue
0929 21:42:23.480869 (+ 113us) service_pool.cc:227] Handling call
0929 21:42:23.531257 (+ 50388us) inbound_call.cc:173] Queueing success response
Related trace 'test_child':
Metrics: {"test_sleep_us":50000,"child_traces":[["test_child",{"related_trace_metric":1}]]}
W20260929 21:42:23.590611 743 rpcz_store.cc:267] Call kudu.rpc_test.CalculatorService.Sleep from unix:<unnamed> (request call id 4) took 50 ms (client timeout 50 ms). Trace:
W20260929 21:42:23.591017 743 rpcz_store.cc:269] 0929 21:42:23.540056 (+ 0us) service_pool.cc:170] Inserting onto call queue
0929 21:42:23.540186 (+ 130us) service_pool.cc:227] Handling call
0929 21:42:23.590533 (+ 50347us) inbound_call.cc:173] Queueing success response
Related trace 'test_child':
Metrics: {"test_sleep_us":50000,"child_traces":[["test_child",{"related_trace_metric":1}]]}
W20260929 21:42:23.593170 736 connection.cc:196] Error closing socket: Network error: TlsSocket::Close: Broken pipe
[ OK ] Parameters/TestRpc.TimedOutOnResponseMetric/SSL_UnixSocket (350 ms)
[ RUN ] Parameters/TestRpc.AcceptorDispatchingTimesMetric/SSL_UnixSocket
I20260929 21:42:23.608572 764 acceptor_pool.cc:254] collecting diagnostics on the listening RPC socket 0.0.0.0:38593 every 8 connection(s)
I20260929 21:42:23.609236 765 acceptor_pool.cc:254] collecting diagnostics on the listening RPC socket 0.0.0.0:38593 every 8 connection(s)
W20260929 21:42:23.616086 760 negotiation.cc:337] Failed RPC negotiation. Trace:
0929 21:42:23.613504 (+ 0us) reactor.cc:625] Submitting negotiation task for server connection from 127.0.0.1:45518 (local address 127.0.0.1:38593)
0929 21:42:23.614132 (+ 628us) server_negotiation.cc:206] Beginning negotiation
0929 21:42:23.614157 (+ 25us) server_negotiation.cc:399] Waiting for connection header
0929 21:42:23.614439 (+ 282us) negotiation.cc:327] Negotiation complete: Network error: Server connection negotiation failed: server connection from 127.0.0.1:45518: BlockingRecv error: recv got EOF from 127.0.0.1:45518 (error 108)
Metrics: {"server-negotiator.queue_time_us":124}
[ OK ] Parameters/TestRpc.AcceptorDispatchingTimesMetric/SSL_UnixSocket (20 ms)
[ RUN ] Parameters/TestRpc.TestRpcCallbackDestroysMessenger/SSL_UnixSocket
[ OK ] Parameters/TestRpc.TestRpcCallbackDestroysMessenger/SSL_UnixSocket (23 ms)
[ RUN ] Parameters/TestRpc.TestApplicationFeatureFlag/SSL_UnixSocket
I20260929 21:42:23.657562 789 acceptor_pool.cc:254] collecting diagnostics on the listening RPC socket unix:/tmp/dist-test-task12nalU/test-tmp/rpc-test-752cfa16a1804583b43ea2e0f538adaa.sock every 8 connection(s)
I20260929 21:42:23.658222 790 acceptor_pool.cc:254] collecting diagnostics on the listening RPC socket unix:/tmp/dist-test-task12nalU/test-tmp/rpc-test-752cfa16a1804583b43ea2e0f538adaa.sock every 8 connection(s)
W20260929 21:42:23.683833 786 messenger.cc:357] Unable to handle RPC call: Not implemented: call requires unsupported application feature flags: 99
W20260929 21:42:23.686784 786 connection.cc:196] Error closing socket: Network error: TlsSocket::Close: Broken pipe
[ OK ] Parameters/TestRpc.TestApplicationFeatureFlag/SSL_UnixSocket (49 ms)
[ RUN ] Parameters/TestRpc.TestCancellation/SSL_UnixSocket
I20260929 21:42:23.720816 814 acceptor_pool.cc:254] collecting diagnostics on the listening RPC socket unix:/tmp/dist-test-task12nalU/test-tmp/rpc-test-fc09f2cee6eb4733904539e90f3513b9.sock every 8 connection(s)
I20260929 21:42:23.721485 815 acceptor_pool.cc:254] collecting diagnostics on the listening RPC socket unix:/tmp/dist-test-task12nalU/test-tmp/rpc-test-fc09f2cee6eb4733904539e90f3513b9.sock every 8 connection(s)
I20260929 21:42:23.724443 390 rpc-test.cc:1648] Connecting to unix:/tmp/dist-test-task12nalU/test-tmp/rpc-test-fc09f2cee6eb4733904539e90f3513b9.sock
I20260929 21:42:23.832305 390 rpc-test-base.h:595] status: Aborted: Sleep RPC to unix:/tmp/dist-test-task12nalU/test-tmp/rpc-test-fc09f2cee6eb4733904539e90f3513b9.sock is cancelled in state READY, seconds elapsed: 0.000437814
I20260929 21:42:24.004917 390 rpc-test-base.h:595] status: Aborted: Sleep RPC to unix:/tmp/dist-test-task12nalU/test-tmp/rpc-test-fc09f2cee6eb4733904539e90f3513b9.sock is cancelled in state SENT, seconds elapsed: 0.000850633
I20260929 21:42:24.005133 817 rpc-test-base.h:222] got call: sleep_micros: 510000
I20260929 21:42:24.171111 390 rpc-test-base.h:595] status: Aborted: Sleep RPC to unix:/tmp/dist-test-task12nalU/test-tmp/rpc-test-fc09f2cee6eb4733904539e90f3513b9.sock is cancelled in state SENT, seconds elapsed: 0.00085239
I20260929 21:42:24.171305 816 rpc-test-base.h:222] got call: sleep_micros: 510000
I20260929 21:42:24.336301 390 rpc-test-base.h:595] status: Aborted: Sleep RPC to unix:/tmp/dist-test-task12nalU/test-tmp/rpc-test-fc09f2cee6eb4733904539e90f3513b9.sock is cancelled in state SENT, seconds elapsed: 0.000680885
W20260929 21:42:24.346850 818 rpcz_store.cc:267] Call kudu.rpc.GenericCalculatorService.Sleep from unix:<unnamed> (request call id 11) took 10 ms (client timeout 10 ms). Trace:
W20260929 21:42:24.347127 818 rpcz_store.cc:269] 0929 21:42:24.336457 (+ 0us) service_pool.cc:170] Inserting onto call queue
0929 21:42:24.346585 (+ 10128us) service_pool.cc:214] Skipping call since client already timed out
0929 21:42:24.346688 (+ 103us) inbound_call.cc:173] Queueing failure response
Metrics: {}
I20260929 21:42:24.347604 818 rpc-test-base.h:222] got call: sleep_micros: 1500000
W20260929 21:42:24.515882 817 rpcz_store.cc:267] Call kudu.rpc.GenericCalculatorService.Sleep from unix:<unnamed> (request call id 3) took 511 ms (client timeout 10 ms). Trace:
W20260929 21:42:24.516233 817 rpcz_store.cc:269] 0929 21:42:24.004949 (+ 0us) service_pool.cc:170] Inserting onto call queue
0929 21:42:24.005074 (+ 125us) service_pool.cc:227] Handling call
0929 21:42:24.515827 (+510753us) inbound_call.cc:173] Queueing success response
Metrics: {}
W20260929 21:42:24.681902 816 rpcz_store.cc:267] Call kudu.rpc.GenericCalculatorService.Sleep from unix:<unnamed> (request call id 7) took 510 ms (client timeout 10 ms). Trace:
W20260929 21:42:24.682207 816 rpcz_store.cc:269] 0929 21:42:24.171123 (+ 0us) service_pool.cc:170] Inserting onto call queue
0929 21:42:24.171249 (+ 126us) service_pool.cc:227] Handling call
0929 21:42:24.681849 (+510600us) inbound_call.cc:173] Queueing success response
Metrics: {}
I20260929 21:42:25.338138 390 rpc-test-base.h:595] status: Timed out: Sleep RPC to unix:/tmp/dist-test-task12nalU/test-tmp/rpc-test-fc09f2cee6eb4733904539e90f3513b9.sock timed out after 1.000s (SENT), seconds elapsed: 1.00153
I20260929 21:42:25.339310 816 rpc-test-base.h:222] got call: sleep_micros: 1500000
W20260929 21:42:25.848310 818 rpcz_store.cc:267] Call kudu.rpc.GenericCalculatorService.Sleep from unix:<unnamed> (request call id 12) took 1511 ms (client timeout 1000 ms). Trace:
W20260929 21:42:25.848726 818 rpcz_store.cc:269] 0929 21:42:24.337289 (+ 0us) service_pool.cc:170] Inserting onto call queue
0929 21:42:24.347576 (+ 10287us) service_pool.cc:227] Handling call
0929 21:42:25.848155 (+1500579us) inbound_call.cc:173] Queueing success response
Metrics: {}
I20260929 21:42:26.340535 390 rpc-test-base.h:595] status: Timed out: Sleep RPC to unix:/tmp/dist-test-task12nalU/test-tmp/rpc-test-fc09f2cee6eb4733904539e90f3513b9.sock timed out after 1.000s (SENT), seconds elapsed: 1.00201
W20260929 21:42:26.342269 811 messenger.cc:357] Unable to handle RPC call: Not implemented: call requires unsupported application feature flags: 99, 1
W20260929 21:42:26.343696 811 messenger.cc:357] Unable to handle RPC call: Not implemented: call requires unsupported application feature flags: 99, 1
W20260929 21:42:26.560439 811 connection.cc:196] Error closing socket: Network error: TlsSocket::Close: Broken pipe
W20260929 21:42:26.839943 816 rpcz_store.cc:267] Call kudu.rpc.GenericCalculatorService.Sleep from unix:<unnamed> (request call id 13) took 1500 ms (client timeout 1000 ms). Trace:
W20260929 21:42:26.840241 816 rpcz_store.cc:269] 0929 21:42:25.339153 (+ 0us) service_pool.cc:170] Inserting onto call queue
0929 21:42:25.339264 (+ 111us) service_pool.cc:227] Handling call
0929 21:42:26.839786 (+1500522us) inbound_call.cc:173] Queueing success response
Metrics: {}
W20260929 21:42:26.840762 811 connection.cc:441] server connection from unix:<unnamed> torn down before Call kudu.rpc.GenericCalculatorService.Sleep from unix:<unnamed> (request call id 13) could send its response
[ OK ] Parameters/TestRpc.TestCancellation/SSL_UnixSocket (3156 ms)
[ RUN ] Parameters/TestRpc.TestCancellationMultiThreads/SSL_UnixSocket
I20260929 21:42:26.881577 840 acceptor_pool.cc:254] collecting diagnostics on the listening RPC socket unix:/tmp/dist-test-task12nalU/test-tmp/rpc-test-569c4e832971444aa89893d33d4f40b8.sock every 8 connection(s)
I20260929 21:42:26.882349 841 acceptor_pool.cc:254] collecting diagnostics on the listening RPC socket unix:/tmp/dist-test-task12nalU/test-tmp/rpc-test-569c4e832971444aa89893d33d4f40b8.sock every 8 connection(s)
I20260929 21:42:26.885318 390 rpc-test.cc:1808] Connecting to unix:/tmp/dist-test-task12nalU/test-tmp/rpc-test-569c4e832971444aa89893d33d4f40b8.sock
I20260929 21:42:27.029254 854 test_util.cc:268] Using random seed: 252438665
I20260929 21:42:27.030548 855 test_util.cc:268] Using random seed: 252440033
I20260929 21:42:27.032070 856 test_util.cc:268] Using random seed: 252441511
I20260929 21:42:27.033449 857 test_util.cc:268] Using random seed: 252442943
I20260929 21:42:27.034758 858 test_util.cc:268] Using random seed: 252444155
I20260929 21:42:27.036803 859 test_util.cc:268] Using random seed: 252446193
I20260929 21:42:27.038671 860 test_util.cc:268] Using random seed: 252448069
I20260929 21:42:27.040350 861 test_util.cc:268] Using random seed: 252449316
I20260929 21:42:27.042049 862 test_util.cc:268] Using random seed: 252451078
I20260929 21:42:27.043238 863 test_util.cc:268] Using random seed: 252452637
I20260929 21:42:27.045038 864 test_util.cc:268] Using random seed: 252454434
I20260929 21:42:27.046736 865 test_util.cc:268] Using random seed: 252456171
I20260929 21:42:27.048609 866 test_util.cc:268] Using random seed: 252457541
I20260929 21:42:27.050386 867 test_util.cc:268] Using random seed: 252459436
I20260929 21:42:27.051697 868 test_util.cc:268] Using random seed: 252461089
I20260929 21:42:27.053475 869 test_util.cc:268] Using random seed: 252462897
I20260929 21:42:27.055472 870 test_util.cc:268] Using random seed: 252464851
I20260929 21:42:27.057649 871 test_util.cc:268] Using random seed: 252467013
I20260929 21:42:27.059005 872 test_util.cc:268] Using random seed: 252468374
I20260929 21:42:27.061369 873 test_util.cc:268] Using random seed: 252470352
I20260929 21:42:27.062698 874 test_util.cc:268] Using random seed: 252472082
I20260929 21:42:27.064656 875 test_util.cc:268] Using random seed: 252474020
I20260929 21:42:27.066524 876 test_util.cc:268] Using random seed: 252475926
I20260929 21:42:27.068624 877 test_util.cc:268] Using random seed: 252477984
I20260929 21:42:27.070454 878 test_util.cc:268] Using random seed: 252479382
I20260929 21:42:27.072453 879 test_util.cc:268] Using random seed: 252481412
I20260929 21:42:27.074590 880 test_util.cc:268] Using random seed: 252483970
I20260929 21:42:27.076732 881 test_util.cc:268] Using random seed: 252486113
I20260929 21:42:27.078459 882 test_util.cc:268] Using random seed: 252487847
I20260929 21:42:27.080475 883 test_util.cc:268] Using random seed: 252489868
W20260929 21:42:46.294348 837 connection.cc:196] Error closing socket: Network error: TlsSocket::Close: Broken pipe
[ OK ] Parameters/TestRpc.TestCancellationMultiThreads/SSL_UnixSocket (19462 ms)
[ RUN ] Parameters/TestRpc.TestCallId/SSL_UnixSocket
I20260929 21:42:46.352936 897 acceptor_pool.cc:254] collecting diagnostics on the listening RPC socket unix:/tmp/dist-test-task12nalU/test-tmp/rpc-test-3bf51b2a54bf45fc8b694f376cd6fdcd.sock every 8 connection(s)
I20260929 21:42:46.353734 898 acceptor_pool.cc:254] collecting diagnostics on the listening RPC socket unix:/tmp/dist-test-task12nalU/test-tmp/rpc-test-3bf51b2a54bf45fc8b694f376cd6fdcd.sock every 8 connection(s)
[ OK ] Parameters/TestRpc.TestCallId/SSL_UnixSocket (89 ms)
[----------] 20 tests from Parameters/TestRpc (37825 ms total)
[----------] Global test environment tear-down
[==========] 21 tests from 2 test suites ran. (41044 ms total)
[ PASSED ] 20 tests.
[ FAILED ] 1 test, listed below:
[ FAILED ] Parameters/TestRpc.TestCallWithChainCertAndRootCA/SSL_UnixSocket, where GetParam() = (true, true)
1 FAILED TEST
I20260929 21:42:46.417078 390 logging.cc:424] LogThrottler /data0/somelongdirectorytoavoidrpathissues/src/kudu/src/kudu/rpc/acceptor_pool.cc:285: suppressed but not reported on 3 messages since previous log ~33 seconds ago