Diagnosed failure

Parameters/TestRpc.TestCallWithChainCertAndChainCA/SSL_TCP: /data0/somelongdirectorytoavoidrpathissues/src/kudu/src/kudu/rpc/rpc-test.cc:270: Failure
Failed
Bad status: Runtime error: could not verify certificate chain (error with cert: subject=CN = localhost, ST = sadfjas, C = AS, emailAddress = sdflkdsajf, O = lskdfjlsad, OU = sldfkja, issuer=C = AS, ST = ASDfkjdhf, L = lskdjf, O = saldfja, OU = skdjf, CN = localhost, emailAddress = sadjflkadsj): : certificate has expired
Google Test trace:
/data0/somelongdirectorytoavoidrpathissues/src/kudu/src/kudu/rpc/rpc-test.cc:267: Connecting to 0.0.0.0:33507
I20260926 13:38:44.395768   379 test_util.cc:175] -----------------------------------------------
I20260926 13:38:44.395853   379 test_util.cc:176] Had fatal failures, leaving test files at /tmp/dist-test-taskSXPcpV/test-tmp/rpc-test.5.Parameters_TestRpc.TestCallWithChainCertAndChainCA_SSL_TCP.1790429924270980-379-0

Full log

Note: This is test shard 6 of 8.
[==========] Running 21 tests from 2 test suites.
[----------] Global test environment set-up.
[----------] 20 tests from Parameters/TestRpc
[ RUN      ] Parameters/TestRpc.TestMessengerCreateDestroy/SSL_TCP
WARNING: Logging before InitGoogleLogging() is written to STDERR
I20260926 13:38:44.311612   379 rpc-test.cc:169] started messenger TestCreateDestroy
[       OK ] Parameters/TestRpc.TestMessengerCreateDestroy/SSL_TCP (23 ms)
[ RUN      ] Parameters/TestRpc.TestNegotiationDeadlock/SSL_TCP
I20260926 13:38:44.341215   400 acceptor_pool.cc:254] collecting diagnostics on the listening RPC socket 0.0.0.0:36671 every 8 connection(s)
I20260926 13:38:44.340931   399 acceptor_pool.cc:254] collecting diagnostics on the listening RPC socket 0.0.0.0:36671 every 8 connection(s)
[       OK ] Parameters/TestRpc.TestNegotiationDeadlock/SSL_TCP (50 ms)
[ RUN      ] Parameters/TestRpc.TestCallWithChainCertAndChainCA/SSL_TCP
I20260926 13:38:44.383255   415 acceptor_pool.cc:254] collecting diagnostics on the listening RPC socket 0.0.0.0:33507 every 8 connection(s)
I20260926 13:38:44.383572   416 acceptor_pool.cc:254] collecting diagnostics on the listening RPC socket 0.0.0.0:33507 every 8 connection(s)
/data0/somelongdirectorytoavoidrpathissues/src/kudu/src/kudu/rpc/rpc-test.cc:270: Failure
Failed
Bad status: Runtime error: could not verify certificate chain (error with cert: subject=CN = localhost, ST = sadfjas, C = AS, emailAddress = sdflkdsajf, O = lskdfjlsad, OU = sldfkja, issuer=C = AS, ST = ASDfkjdhf, L = lskdjf, O = saldfja, OU = skdjf, CN = localhost, emailAddress = sadjflkadsj): : certificate has expired
Google Test trace:
/data0/somelongdirectorytoavoidrpathissues/src/kudu/src/kudu/rpc/rpc-test.cc:267: Connecting to 0.0.0.0:33507
I20260926 13:38:44.395768   379 test_util.cc:175] -----------------------------------------------
I20260926 13:38:44.395853   379 test_util.cc:176] Had fatal failures, leaving test files at /tmp/dist-test-taskSXPcpV/test-tmp/rpc-test.5.Parameters_TestRpc.TestCallWithChainCertAndChainCA_SSL_TCP.1790429924270980-379-0
[  FAILED  ] Parameters/TestRpc.TestCallWithChainCertAndChainCA/SSL_TCP, where GetParam() = (true, false) (30 ms)
[ RUN      ] Parameters/TestRpc.TestCallWithPasswordProtectedKey/SSL_TCP
I20260926 13:38:44.410593   440 acceptor_pool.cc:254] collecting diagnostics on the listening RPC socket 0.0.0.0:40587 every 8 connection(s)
I20260926 13:38:44.410833   441 acceptor_pool.cc:254] collecting diagnostics on the listening RPC socket 0.0.0.0:40587 every 8 connection(s)
[       OK ] Parameters/TestRpc.TestCallWithPasswordProtectedKey/SSL_TCP (52 ms)
[ RUN      ] Parameters/TestRpc.TestCallToBadServer/SSL_TCP
I20260926 13:38:44.469637   379 rpc-test.cc:394] Status: Network error: Client connection negotiation failed: client connection to 0.0.0.0:0: connect: Connection refused (error 111)
I20260926 13:38:44.470615   379 rpc-test.cc:394] Status: Network error: Client connection negotiation failed: client connection to 0.0.0.0:0: connect: Connection refused (error 111)
I20260926 13:38:44.471342   379 rpc-test.cc:394] Status: Network error: Client connection negotiation failed: client connection to 0.0.0.0:0: connect: Connection refused (error 111)
I20260926 13:38:44.472034   379 rpc-test.cc:394] Status: Network error: Client connection negotiation failed: client connection to 0.0.0.0:0: connect: Connection refused (error 111)
I20260926 13:38:44.472800   379 rpc-test.cc:394] Status: Network error: Client connection negotiation failed: client connection to 0.0.0.0:0: connect: Connection refused (error 111)
[       OK ] Parameters/TestRpc.TestCallToBadServer/SSL_TCP (26 ms)
[ RUN      ] Parameters/TestRpc.TestWrongService/SSL_TCP
I20260926 13:38:44.486945   475 acceptor_pool.cc:254] collecting diagnostics on the listening RPC socket 0.0.0.0:42741 every 8 connection(s)
I20260926 13:38:44.487214   476 acceptor_pool.cc:254] collecting diagnostics on the listening RPC socket 0.0.0.0:42741 every 8 connection(s)
I20260926 13:38:44.519573   472 messenger.cc:345] service WrongServiceName not registered on TestServer
[       OK ] Parameters/TestRpc.TestWrongService/SSL_TCP (50 ms)
[ RUN      ] Parameters/TestRpc.TestConnectionKeepalive/SSL_TCP
I20260926 13:38:44.549604   498 acceptor_pool.cc:254] collecting diagnostics on the listening RPC socket 0.0.0.0:38915 every 8 connection(s)
I20260926 13:38:44.549988   499 acceptor_pool.cc:254] collecting diagnostics on the listening RPC socket 0.0.0.0:38915 every 8 connection(s)
I20260926 13:38:44.551016   379 rpc-test.cc:488] Connecting to 0.0.0.0:38915
[       OK ] Parameters/TestRpc.TestConnectionKeepalive/SSL_TCP (1068 ms)
[ RUN      ] Parameters/TestRpc.TestClientConnectionMetrics/SSL_TCP
I20260926 13:38:45.621095   523 acceptor_pool.cc:254] collecting diagnostics on the listening RPC socket 0.0.0.0:43595 every 8 connection(s)
I20260926 13:38:45.621356   524 acceptor_pool.cc:254] collecting diagnostics on the listening RPC socket 0.0.0.0:43595 every 8 connection(s)
I20260926 13:38:45.622399   379 rpc-test.cc:569] Connecting to 0.0.0.0:43595
[       OK ] Parameters/TestRpc.TestClientConnectionMetrics/SSL_TCP (20208 ms)
[ RUN      ] Parameters/TestRpc.TestCredentialsPolicy/SSL_TCP
I20260926 13:39:05.841240   546 acceptor_pool.cc:254] collecting diagnostics on the listening RPC socket 0.0.0.0:33027 every 8 connection(s)
I20260926 13:39:05.841477   547 acceptor_pool.cc:254] collecting diagnostics on the listening RPC socket 0.0.0.0:33027 every 8 connection(s)
I20260926 13:39:05.842765   379 rpc-test.cc:700] Connecting to 0.0.0.0:33027
[       OK ] Parameters/TestRpc.TestCredentialsPolicy/SSL_TCP (111 ms)
[ RUN      ] Parameters/TestRpc.TestCallLongerThanKeepalive/SSL_TCP
I20260926 13:39:05.927351   571 acceptor_pool.cc:254] collecting diagnostics on the listening RPC socket 0.0.0.0:40599 every 8 connection(s)
I20260926 13:39:05.927655   572 acceptor_pool.cc:254] collecting diagnostics on the listening RPC socket 0.0.0.0:40599 every 8 connection(s)
I20260926 13:39:05.956483   575 rpc-test-base.h:222] got call: sleep_micros: 3000000 deferred: true
I20260926 13:39:08.958380   575 rpcz_store.cc:275] Call kudu.rpc.GenericCalculatorService.Sleep from 127.0.0.1:35284 (request call id 0) took 3002 ms. Trace:
I20260926 13:39:08.958549   575 rpcz_store.cc:276] 0926 13:39:05.956354 (+     0us) service_pool.cc:170] Inserting onto call queue
0926 13:39:05.956436 (+    82us) service_pool.cc:227] Handling call
0926 13:39:08.958317 (+3001881us) inbound_call.cc:173] Queueing success response
Metrics: {}
[       OK ] Parameters/TestRpc.TestCallLongerThanKeepalive/SSL_TCP (3051 ms)
[ RUN      ] Parameters/TestRpc.TestRpcSidecar/SSL_TCP
I20260926 13:39:08.986774   596 acceptor_pool.cc:254] collecting diagnostics on the listening RPC socket 0.0.0.0:34869 every 8 connection(s)
I20260926 13:39:08.987010   597 acceptor_pool.cc:254] collecting diagnostics on the listening RPC socket 0.0.0.0:34869 every 8 connection(s)
[       OK ] Parameters/TestRpc.TestRpcSidecar/SSL_TCP (134 ms)
[ RUN      ] Parameters/TestRpc.TestRpcSidecarLimits/SSL_TCP
I20260926 13:39:11.346278   621 acceptor_pool.cc:254] collecting diagnostics on the listening RPC socket 0.0.0.0:45471 every 8 connection(s)
I20260926 13:39:11.346601   622 acceptor_pool.cc:254] collecting diagnostics on the listening RPC socket 0.0.0.0:45471 every 8 connection(s)
W20260926 13:39:11.374173   379 serialization.cc:72] Serialized kudu.rpc_test.PushStringsRequestPB (2147483654 bytes) is larger than the maximum configured RPC message size (52428800 bytes). Sending anyway, but peer may reject the data.
W20260926 13:39:11.381017   619 connection.cc:535] server connection from 127.0.0.1:44778 recv error: Network error: RPC frame had a length of 2147483714, but we only support messages up to 52428800 bytes long.
W20260926 13:39:11.381179   619 connection.cc:158] shutting down server connection from 127.0.0.1:44778 with pending inbound data: 4/2147483714 bytes received; last active 0 ns ago: status Network error: RPC frame had a length of 2147483714, but we only support messages up to 52428800 bytes long.
W20260926 13:39:11.381825   634 connection.cc:196] Error closing socket: Network error: TlsSocket::Close: Connection reset by peer
I20260926 13:39:11.408494   646 acceptor_pool.cc:254] collecting diagnostics on the listening RPC socket 0.0.0.0:39895 every 8 connection(s)
I20260926 13:39:11.408787   647 acceptor_pool.cc:254] collecting diagnostics on the listening RPC socket 0.0.0.0:39895 every 8 connection(s)
W20260926 13:39:16.701385   643 connection.cc:577] server connection from 127.0.0.1:41824: received bad data: 'Corruption: Invalid packet: message had a length of 2147483710, but we only support messages up to 2147483647 bytes
'
[       OK ] Parameters/TestRpc.TestRpcSidecarLimits/SSL_TCP (8076 ms)
[ RUN      ] Parameters/TestRpc.TestCallTimeoutDoesntAffectNegotiation/SSL_TCP
I20260926 13:39:17.203806   671 acceptor_pool.cc:254] collecting diagnostics on the listening RPC socket 0.0.0.0:45967 every 8 connection(s)
I20260926 13:39:17.204074   672 acceptor_pool.cc:254] collecting diagnostics on the listening RPC socket 0.0.0.0:45967 every 8 connection(s)
W20260926 13:39:17.215570   667 negotiation.cc:266] Injecting 500ms delay in negotiation
I20260926 13:39:17.266052   379 rpc-test-base.h:595] status: Timed out: connection negotiation to 0.0.0.0:45967 for RPC Sleep timed out after 0.050s (ON_OUTBOUND_QUEUE), seconds elapsed: 0.0511567
[       OK ] Parameters/TestRpc.TestCallTimeoutDoesntAffectNegotiation/SSL_TCP (550 ms)
[ RUN      ] Parameters/TestRpc.TestRpcHandlerLatencyMetric/SSL_TCP
I20260926 13:39:17.757076   696 acceptor_pool.cc:254] collecting diagnostics on the listening RPC socket 0.0.0.0:35589 every 8 connection(s)
I20260926 13:39:17.757336   697 acceptor_pool.cc:254] collecting diagnostics on the listening RPC socket 0.0.0.0:35589 every 8 connection(s)
I20260926 13:39:17.800623   379 rpc-test.cc:1236] Sleep() min lat: 20607
I20260926 13:39:17.800704   379 rpc-test.cc:1237] Sleep() mean lat: 20607
I20260926 13:39:17.800747   379 rpc-test.cc:1238] Sleep() max lat: 20607
I20260926 13:39:17.800766   379 rpc-test.cc:1239] Sleep() #calls: 1
[       OK ] Parameters/TestRpc.TestRpcHandlerLatencyMetric/SSL_TCP (79 ms)
[ RUN      ] Parameters/TestRpc.TimedOutOnResponseMetricServiceQueue/SSL_TCP
I20260926 13:39:17.834203   722 acceptor_pool.cc:254] collecting diagnostics on the listening RPC socket 0.0.0.0:35333 every 8 connection(s)
I20260926 13:39:17.834538   723 acceptor_pool.cc:254] collecting diagnostics on the listening RPC socket 0.0.0.0:35333 every 8 connection(s)
W20260926 13:39:17.895258   724 rpcz_store.cc:267] Call kudu.rpc_test.CalculatorService.Sleep from 127.0.0.1:47442 (request call id 2) took 20 ms (client timeout 20 ms). Trace:
W20260926 13:39:17.895445   724 rpcz_store.cc:269] 0926 13:39:17.874809 (+     0us) service_pool.cc:170] Inserting onto call queue
0926 13:39:17.895179 (+ 20370us) service_pool.cc:214] Skipping call since client already timed out
0926 13:39:17.895234 (+    55us) inbound_call.cc:173] Queueing failure response
Metrics: {}
[       OK ] Parameters/TestRpc.TimedOutOnResponseMetricServiceQueue/SSL_TCP (93 ms)
[ RUN      ] Parameters/TestRpc.RpcPendingConnectionsMetric/SSL_TCP
I20260926 13:39:17.904910   745 acceptor_pool.cc:254] collecting diagnostics on the listening RPC socket 0.0.0.0:33921 every 8 connection(s)
I20260926 13:39:17.905267   746 acceptor_pool.cc:254] collecting diagnostics on the listening RPC socket 0.0.0.0:33921 every 8 connection(s)
W20260926 13:39:17.916640   741 negotiation.cc:337] Failed RPC negotiation. Trace:
0926 13:39:17.915797 (+     0us) reactor.cc:625] Submitting negotiation task for server connection from 127.0.0.1:32878 (local address 127.0.0.1:33921)
0926 13:39:17.916021 (+   224us) server_negotiation.cc:206] Beginning negotiation
0926 13:39:17.916030 (+     9us) server_negotiation.cc:399] Waiting for connection header
0926 13:39:17.916225 (+   195us) negotiation.cc:327] Negotiation complete: Network error: Server connection negotiation failed: server connection from 127.0.0.1:32878: BlockingRecv error: recv got EOF from 127.0.0.1:32878 (error 108)
Metrics: {"server-negotiator.queue_time_us":47}
[       OK ] Parameters/TestRpc.RpcPendingConnectionsMetric/SSL_TCP (29 ms)
[ RUN      ] Parameters/TestRpc.TestRpcContextClientDeadline/SSL_TCP
I20260926 13:39:17.956669   761 acceptor_pool.cc:254] collecting diagnostics on the listening RPC socket 0.0.0.0:36265 every 8 connection(s)
I20260926 13:39:17.956918   762 acceptor_pool.cc:254] collecting diagnostics on the listening RPC socket 0.0.0.0:36265 every 8 connection(s)
[       OK ] Parameters/TestRpc.TestRpcContextClientDeadline/SSL_TCP (76 ms)
[ RUN      ] Parameters/TestRpc.TestApplicationFeatureFlagUnsupportedServer/SSL_TCP
I20260926 13:39:18.029315   786 acceptor_pool.cc:254] collecting diagnostics on the listening RPC socket 0.0.0.0:41593 every 8 connection(s)
I20260926 13:39:18.029533   787 acceptor_pool.cc:254] collecting diagnostics on the listening RPC socket 0.0.0.0:41593 every 8 connection(s)
[       OK ] Parameters/TestRpc.TestApplicationFeatureFlagUnsupportedServer/SSL_TCP (67 ms)
[ RUN      ] Parameters/TestRpc.TestCancellationAsync/SSL_TCP
I20260926 13:39:18.111125   811 acceptor_pool.cc:254] collecting diagnostics on the listening RPC socket 0.0.0.0:35909 every 8 connection(s)
I20260926 13:39:18.111364   812 acceptor_pool.cc:254] collecting diagnostics on the listening RPC socket 0.0.0.0:35909 every 8 connection(s)
I20260926 13:39:18.112252   379 rpc-test.cc:1716] Connecting to 0.0.0.0:35909
I20260926 13:39:18.128366   379 test_util.cc:268] Using random seed: -173653298
I20260926 13:39:18.175454   815 rpc-test-base.h:240] got call: sleep_micros: 500 pattern: 4294967295 num_repetitions: 2097152 sidecar_idx: 0
I20260926 13:39:18.204834   814 rpc-test-base.h:240] got call: sleep_micros: 500 pattern: 4294967295 num_repetitions: 2097152 sidecar_idx: 0
I20260926 13:39:18.232390   813 rpc-test-base.h:240] got call: sleep_micros: 500 pattern: 4294967295 num_repetitions: 2097152 sidecar_idx: 0
I20260926 13:39:18.261961   814 rpc-test-base.h:240] got call: sleep_micros: 500 pattern: 4294967295 num_repetitions: 2097152 sidecar_idx: 0
I20260926 13:39:18.287601   815 rpc-test-base.h:240] got call: sleep_micros: 500 pattern: 4294967295 num_repetitions: 2097152 sidecar_idx: 0
I20260926 13:39:18.323032   813 rpc-test-base.h:240] got call: sleep_micros: 500 pattern: 4294967295 num_repetitions: 2097152 sidecar_idx: 0
W20260926 13:39:18.347566   810 connection.cc:698] server connection from 127.0.0.1:54508 send error: Network error: failed to write to TLS socket: Broken pipe
W20260926 13:39:18.347702   810 connection.cc:441] server connection from 127.0.0.1:54508 torn down before Call kudu.rpc.GenericCalculatorService.SleepWithSidecar from 127.0.0.1:54508 (request call id 9) could send its response
W20260926 13:39:18.347963   810 connection.cc:196] Error closing socket: Network error: TlsSocket::Close: Success
W20260926 13:39:18.367460   810 connection.cc:441] server connection from 127.0.0.1:54508 torn down before Call kudu.rpc.GenericCalculatorService.SleepWithSidecar from 127.0.0.1:54508 (request call id 8) could send its response
[       OK ] Parameters/TestRpc.TestCancellationAsync/SSL_TCP (296 ms)
[ RUN      ] Parameters/TestRpc.TestPerformanceBySocketType/SSL_TCP
I20260926 13:39:18.392149   836 acceptor_pool.cc:254] collecting diagnostics on the listening RPC socket 0.0.0.0:37707 every 8 connection(s)
I20260926 13:39:18.392397   837 acceptor_pool.cc:254] collecting diagnostics on the listening RPC socket 0.0.0.0:37707 every 8 connection(s)
I20260926 13:39:18.393288   379 rpc-test.cc:1846] Connecting to 0.0.0.0:37707
I20260926 13:39:21.516114   379 rpc-test.cc:1859] Sending 1024MB via ssl-enabled tcp socket: real 3.103s	user 2.911s	sys 2.257s
I20260926 13:39:24.529456   379 rpc-test.cc:1859] Sending 1024MB via ssl-enabled tcp socket: real 3.013s	user 2.748s	sys 2.213s
I20260926 13:39:27.501916   379 rpc-test.cc:1859] Sending 1024MB via ssl-enabled tcp socket: real 2.972s	user 2.744s	sys 2.160s
I20260926 13:39:30.614114   379 rpc-test.cc:1859] Sending 1024MB via ssl-enabled tcp socket: real 3.112s	user 2.931s	sys 2.220s
I20260926 13:39:33.708989   379 rpc-test.cc:1859] Sending 1024MB via ssl-enabled tcp socket: real 3.095s	user 2.888s	sys 2.204s
[       OK ] Parameters/TestRpc.TestPerformanceBySocketType/SSL_TCP (15346 ms)
[----------] 20 tests from Parameters/TestRpc (49426 ms total)

[----------] 1 test from Parameters/TestRpcSocketTxRxQueue
[ RUN      ] Parameters/TestRpcSocketTxRxQueue.OverCapacity/0
W20260926 13:39:34.019960   871 negotiation.cc:337] Failed RPC negotiation. Trace:
0926 13:39:33.726636 (+     0us) reactor.cc:625] Submitting negotiation task for client connection to 0.0.0.0:38905 (local address 127.0.0.1:52166)
0926 13:39:33.726859 (+   223us) negotiation.cc:107] Waiting for socket to connect
0926 13:39:33.726880 (+    21us) client_negotiation.cc:174] Beginning negotiation
0926 13:39:33.726982 (+   102us) client_negotiation.cc:252] Sending NEGOTIATE NegotiatePB request
0926 13:39:34.019433 (+292451us) negotiation.cc:327] Negotiation complete: Network error: Client connection negotiation failed: client connection to 0.0.0.0:38905: BlockingRecv error: recv error from unknown peer: Transport endpoint is not connected (error 107)
Metrics: {"client-negotiator.queue_time_us":57}
W20260926 13:39:34.019889   880 negotiation.cc:337] Failed RPC negotiation. Trace:
0926 13:39:33.729391 (+     0us) reactor.cc:625] Submitting negotiation task for client connection to 0.0.0.0:38905 (local address 127.0.0.1:52168)
0926 13:39:33.729596 (+   205us) negotiation.cc:107] Waiting for socket to connect
0926 13:39:33.729613 (+    17us) client_negotiation.cc:174] Beginning negotiation
0926 13:39:33.729735 (+   122us) client_negotiation.cc:252] Sending NEGOTIATE NegotiatePB request
0926 13:39:34.019433 (+289698us) negotiation.cc:327] Negotiation complete: Network error: Client connection negotiation failed: client connection to 0.0.0.0:38905: BlockingRecv error: recv error from unknown peer: Transport endpoint is not connected (error 107)
Metrics: {"client-negotiator.queue_time_us":68}
W20260926 13:39:34.019904   853 negotiation.cc:337] Failed RPC negotiation. Trace:
0926 13:39:33.721605 (+     0us) reactor.cc:625] Submitting negotiation task for client connection to 0.0.0.0:38905 (local address 127.0.0.1:52148)
0926 13:39:33.721818 (+   213us) negotiation.cc:107] Waiting for socket to connect
0926 13:39:33.721839 (+    21us) client_negotiation.cc:174] Beginning negotiation
0926 13:39:33.721958 (+   119us) client_negotiation.cc:252] Sending NEGOTIATE NegotiatePB request
0926 13:39:34.019459 (+297501us) negotiation.cc:327] Negotiation complete: Network error: Client connection negotiation failed: client connection to 0.0.0.0:38905: BlockingRecv error: recv error from unknown peer: Transport endpoint is not connected (error 107)
Metrics: {"client-negotiator.queue_time_us":53}
W20260926 13:39:34.021534   862 negotiation.cc:337] Failed RPC negotiation. Trace:
0926 13:39:33.724061 (+     0us) reactor.cc:625] Submitting negotiation task for client connection to 0.0.0.0:38905 (local address 127.0.0.1:52156)
0926 13:39:33.724329 (+   268us) negotiation.cc:107] Waiting for socket to connect
0926 13:39:33.724348 (+    19us) client_negotiation.cc:174] Beginning negotiation
0926 13:39:33.724459 (+   111us) client_negotiation.cc:252] Sending NEGOTIATE NegotiatePB request
0926 13:39:34.019536 (+295077us) negotiation.cc:327] Negotiation complete: Network error: Client connection negotiation failed: client connection to 0.0.0.0:38905: BlockingRecv error: recv error from unknown peer: Transport endpoint is not connected (error 107)
Metrics: {"client-negotiator.queue_time_us":53}
W20260926 13:39:34.021622   898 negotiation.cc:337] Failed RPC negotiation. Trace:
0926 13:39:33.735340 (+     0us) reactor.cc:625] Submitting negotiation task for client connection to 0.0.0.0:38905 (local address 127.0.0.1:52186)
0926 13:39:33.735541 (+   201us) negotiation.cc:107] Waiting for socket to connect
0926 13:39:33.735559 (+    18us) client_negotiation.cc:174] Beginning negotiation
0926 13:39:33.735663 (+   104us) client_negotiation.cc:252] Sending NEGOTIATE NegotiatePB request
0926 13:39:34.021164 (+285501us) negotiation.cc:327] Negotiation complete: Network error: Client connection negotiation failed: client connection to 0.0.0.0:38905: BlockingRecv error: recv error from unknown peer: Transport endpoint is not connected (error 107)
Metrics: {"client-negotiator.queue_time_us":62}
W20260926 13:39:34.021670   889 negotiation.cc:337] Failed RPC negotiation. Trace:
0926 13:39:33.732104 (+     0us) reactor.cc:625] Submitting negotiation task for client connection to 0.0.0.0:38905 (local address 127.0.0.1:52178)
0926 13:39:33.732335 (+   231us) negotiation.cc:107] Waiting for socket to connect
0926 13:39:33.732352 (+    17us) client_negotiation.cc:174] Beginning negotiation
0926 13:39:33.732450 (+    98us) client_negotiation.cc:252] Sending NEGOTIATE NegotiatePB request
0926 13:39:34.020249 (+287799us) negotiation.cc:327] Negotiation complete: Network error: Client connection negotiation failed: client connection to 0.0.0.0:38905: BlockingRecv error: recv error from unknown peer: Transport endpoint is not connected (error 107)
Metrics: {"client-negotiator.queue_time_us":55}
[       OK ] Parameters/TestRpcSocketTxRxQueue.OverCapacity/0 (1070 ms)
[----------] 1 test from Parameters/TestRpcSocketTxRxQueue (1070 ms total)

[----------] Global test environment tear-down
[==========] 21 tests from 2 test suites ran. (50497 ms total)
[  PASSED  ] 20 tests.
[  FAILED  ] 1 test, listed below:
[  FAILED  ] Parameters/TestRpc.TestCallWithChainCertAndChainCA/SSL_TCP, where GetParam() = (true, false)

 1 FAILED TEST