Diagnosed failure

Parameters/TestRpc.TestCallWithChainCertAndChainCA/SSL_UnixSocket: /data0/somelongdirectorytoavoidrpathissues/src/kudu/src/kudu/rpc/rpc-test.cc:270: Failure
Failed
Bad status: Runtime error: could not verify certificate chain (error with cert: subject=CN = localhost, ST = sadfjas, C = AS, emailAddress = sdflkdsajf, O = lskdfjlsad, OU = sldfkja, issuer=C = AS, ST = ASDfkjdhf, L = lskdjf, O = saldfja, OU = skdjf, CN = localhost, emailAddress = sadjflkadsj): : certificate has expired
Google Test trace:
/data0/somelongdirectorytoavoidrpathissues/src/kudu/src/kudu/rpc/rpc-test.cc:267: Connecting to unix:/tmp/dist-test-task_HUdZa/test-tmp/rpc-test-a9a68dd3a4d346c1948d0c3647c57a27.sock
I20260926 22:09:52.384469  7912 test_util.cc:175] -----------------------------------------------
I20260926 22:09:52.384671  7912 test_util.cc:176] Had fatal failures, leaving test files at /tmp/dist-test-task_HUdZa/test-tmp/rpc-test.6.Parameters_TestRpc.TestCallWithChainCertAndChainCA_SSL_UnixSocket.1790460591053084-7912-0

Full log

Note: This is test shard 7 of 8.
[==========] Running 21 tests from 2 test suites.
[----------] Global test environment set-up.
[----------] 20 tests from Parameters/TestRpc
[ RUN      ] Parameters/TestRpc.TestMessengerCreateDestroy/SSL_UnixSocket
WARNING: Logging before InitGoogleLogging() is written to STDERR
I20260926 22:09:51.168256  7912 rpc-test.cc:169] started messenger TestCreateDestroy
[       OK ] Parameters/TestRpc.TestMessengerCreateDestroy/SSL_UnixSocket (1118 ms)
[ RUN      ] Parameters/TestRpc.TestNegotiationDeadlock/SSL_UnixSocket
I20260926 22:09:52.268124  7934 acceptor_pool.cc:254] collecting diagnostics on the listening RPC socket unix:/tmp/dist-test-task_HUdZa/test-tmp/rpc-test-823ebfa29173482dacc2602ffad66d78.sock every 8 connection(s)
I20260926 22:09:52.269796  7935 acceptor_pool.cc:254] collecting diagnostics on the listening RPC socket unix:/tmp/dist-test-task_HUdZa/test-tmp/rpc-test-823ebfa29173482dacc2602ffad66d78.sock every 8 connection(s)
[       OK ] Parameters/TestRpc.TestNegotiationDeadlock/SSL_UnixSocket (95 ms)
[ RUN      ] Parameters/TestRpc.TestCallWithChainCertAndChainCA/SSL_UnixSocket
I20260926 22:09:52.353763  7950 acceptor_pool.cc:254] collecting diagnostics on the listening RPC socket unix:/tmp/dist-test-task_HUdZa/test-tmp/rpc-test-a9a68dd3a4d346c1948d0c3647c57a27.sock every 8 connection(s)
I20260926 22:09:52.355760  7951 acceptor_pool.cc:254] collecting diagnostics on the listening RPC socket unix:/tmp/dist-test-task_HUdZa/test-tmp/rpc-test-a9a68dd3a4d346c1948d0c3647c57a27.sock every 8 connection(s)
/data0/somelongdirectorytoavoidrpathissues/src/kudu/src/kudu/rpc/rpc-test.cc:270: Failure
Failed
Bad status: Runtime error: could not verify certificate chain (error with cert: subject=CN = localhost, ST = sadfjas, C = AS, emailAddress = sdflkdsajf, O = lskdfjlsad, OU = sldfkja, issuer=C = AS, ST = ASDfkjdhf, L = lskdjf, O = saldfja, OU = skdjf, CN = localhost, emailAddress = sadjflkadsj): : certificate has expired
Google Test trace:
/data0/somelongdirectorytoavoidrpathissues/src/kudu/src/kudu/rpc/rpc-test.cc:267: Connecting to unix:/tmp/dist-test-task_HUdZa/test-tmp/rpc-test-a9a68dd3a4d346c1948d0c3647c57a27.sock
I20260926 22:09:52.384469  7912 test_util.cc:175] -----------------------------------------------
I20260926 22:09:52.384671  7912 test_util.cc:176] Had fatal failures, leaving test files at /tmp/dist-test-task_HUdZa/test-tmp/rpc-test.6.Parameters_TestRpc.TestCallWithChainCertAndChainCA_SSL_UnixSocket.1790460591053084-7912-0
[  FAILED  ] Parameters/TestRpc.TestCallWithChainCertAndChainCA/SSL_UnixSocket, where GetParam() = (true, true) (59 ms)
[ RUN      ] Parameters/TestRpc.TestCallWithPasswordProtectedKey/SSL_UnixSocket
I20260926 22:09:52.413686  7975 acceptor_pool.cc:254] collecting diagnostics on the listening RPC socket unix:/tmp/dist-test-task_HUdZa/test-tmp/rpc-test-7d8137c64e0b462696861faf9a866a29.sock every 8 connection(s)
I20260926 22:09:52.414426  7976 acceptor_pool.cc:254] collecting diagnostics on the listening RPC socket unix:/tmp/dist-test-task_HUdZa/test-tmp/rpc-test-7d8137c64e0b462696861faf9a866a29.sock every 8 connection(s)
W20260926 22:09:52.459738  7972 connection.cc:196] Error closing socket: Network error: TlsSocket::Close: Broken pipe
[       OK ] Parameters/TestRpc.TestCallWithPasswordProtectedKey/SSL_UnixSocket (82 ms)
[ RUN      ] Parameters/TestRpc.TestCallToBadServer/SSL_UnixSocket
I20260926 22:09:52.496088  7912 rpc-test.cc:394] Status: Network error: Client connection negotiation failed: client connection to 0.0.0.0:0: connect: Connection refused (error 111)
I20260926 22:09:52.497949  7912 rpc-test.cc:394] Status: Network error: Client connection negotiation failed: client connection to 0.0.0.0:0: connect: Connection refused (error 111)
I20260926 22:09:52.499652  7912 rpc-test.cc:394] Status: Network error: Client connection negotiation failed: client connection to 0.0.0.0:0: connect: Connection refused (error 111)
I20260926 22:09:52.501366  7912 rpc-test.cc:394] Status: Network error: Client connection negotiation failed: client connection to 0.0.0.0:0: connect: Connection refused (error 111)
I20260926 22:09:52.502928  7912 rpc-test.cc:394] Status: Network error: Client connection negotiation failed: client connection to 0.0.0.0:0: connect: Connection refused (error 111)
[       OK ] Parameters/TestRpc.TestCallToBadServer/SSL_UnixSocket (38 ms)
[ RUN      ] Parameters/TestRpc.TestWrongService/SSL_UnixSocket
I20260926 22:09:52.541985  8010 acceptor_pool.cc:254] collecting diagnostics on the listening RPC socket unix:/tmp/dist-test-task_HUdZa/test-tmp/rpc-test-673679a75fa2494ebeb825e48edca652.sock every 8 connection(s)
I20260926 22:09:52.542721  8011 acceptor_pool.cc:254] collecting diagnostics on the listening RPC socket unix:/tmp/dist-test-task_HUdZa/test-tmp/rpc-test-673679a75fa2494ebeb825e48edca652.sock every 8 connection(s)
I20260926 22:09:52.586364  8007 messenger.cc:345] service WrongServiceName not registered on TestServer
[       OK ] Parameters/TestRpc.TestWrongService/SSL_UnixSocket (89 ms)
[ RUN      ] Parameters/TestRpc.TestConnectionKeepalive/SSL_UnixSocket
I20260926 22:09:52.619704  8033 acceptor_pool.cc:254] collecting diagnostics on the listening RPC socket unix:/tmp/dist-test-task_HUdZa/test-tmp/rpc-test-1b41411765bc439fa0147d3092c8d740.sock every 8 connection(s)
I20260926 22:09:52.620474  8034 acceptor_pool.cc:254] collecting diagnostics on the listening RPC socket unix:/tmp/dist-test-task_HUdZa/test-tmp/rpc-test-1b41411765bc439fa0147d3092c8d740.sock every 8 connection(s)
I20260926 22:09:52.624032  7912 rpc-test.cc:488] Connecting to unix:/tmp/dist-test-task_HUdZa/test-tmp/rpc-test-1b41411765bc439fa0147d3092c8d740.sock
W20260926 22:09:53.099915  8046 connection.cc:196] Error closing socket: Network error: TlsSocket::Close: Broken pipe
[       OK ] Parameters/TestRpc.TestConnectionKeepalive/SSL_UnixSocket (1073 ms)
[ RUN      ] Parameters/TestRpc.TestClientConnectionMetrics/SSL_UnixSocket
I20260926 22:09:53.699373  8058 acceptor_pool.cc:254] collecting diagnostics on the listening RPC socket unix:/tmp/dist-test-task_HUdZa/test-tmp/rpc-test-c3091479a39641879bdc7420448339a2.sock every 8 connection(s)
I20260926 22:09:53.700130  8059 acceptor_pool.cc:254] collecting diagnostics on the listening RPC socket unix:/tmp/dist-test-task_HUdZa/test-tmp/rpc-test-c3091479a39641879bdc7420448339a2.sock every 8 connection(s)
I20260926 22:09:53.703783  7912 rpc-test.cc:569] Connecting to unix:/tmp/dist-test-task_HUdZa/test-tmp/rpc-test-c3091479a39641879bdc7420448339a2.sock
W20260926 22:12:28.541584  8055 connection.cc:196] Error closing socket: Network error: TlsSocket::Close: Broken pipe
[       OK ] Parameters/TestRpc.TestClientConnectionMetrics/SSL_UnixSocket (154881 ms)
[ RUN      ] Parameters/TestRpc.TestCredentialsPolicy/SSL_UnixSocket
I20260926 22:12:28.581717  8096 acceptor_pool.cc:254] collecting diagnostics on the listening RPC socket unix:/tmp/dist-test-task_HUdZa/test-tmp/rpc-test-f90c2e649b2f43e1901aebd345bf3fa7.sock every 8 connection(s)
I20260926 22:12:28.582656  8097 acceptor_pool.cc:254] collecting diagnostics on the listening RPC socket unix:/tmp/dist-test-task_HUdZa/test-tmp/rpc-test-f90c2e649b2f43e1901aebd345bf3fa7.sock every 8 connection(s)
I20260926 22:12:28.586577  7912 rpc-test.cc:700] Connecting to unix:/tmp/dist-test-task_HUdZa/test-tmp/rpc-test-f90c2e649b2f43e1901aebd345bf3fa7.sock
W20260926 22:12:28.653990  8095 connection.cc:196] Error closing socket: Network error: TlsSocket::Close: Broken pipe
W20260926 22:12:28.672916  8095 connection.cc:196] Error closing socket: Network error: TlsSocket::Close: Broken pipe
[       OK ] Parameters/TestRpc.TestCredentialsPolicy/SSL_UnixSocket (129 ms)
[ RUN      ] Parameters/TestRpc.TestCallLongerThanKeepalive/SSL_UnixSocket
I20260926 22:12:28.706213  8121 acceptor_pool.cc:254] collecting diagnostics on the listening RPC socket unix:/tmp/dist-test-task_HUdZa/test-tmp/rpc-test-ad53d84898ba4717a552fec24b3443fd.sock every 8 connection(s)
I20260926 22:12:28.706909  8122 acceptor_pool.cc:254] collecting diagnostics on the listening RPC socket unix:/tmp/dist-test-task_HUdZa/test-tmp/rpc-test-ad53d84898ba4717a552fec24b3443fd.sock every 8 connection(s)
I20260926 22:12:28.736037  8125 rpc-test-base.h:222] got call: sleep_micros: 3000000 deferred: true
I20260926 22:12:31.741458  8125 rpcz_store.cc:275] Call kudu.rpc.GenericCalculatorService.Sleep from unix:<unnamed> (request call id 0) took 3005 ms. Trace:
I20260926 22:12:31.741962  8125 rpcz_store.cc:276] 0926 22:12:28.735842 (+     0us) service_pool.cc:170] Inserting onto call queue
0926 22:12:28.735964 (+   122us) service_pool.cc:227] Handling call
0926 22:12:31.741242 (+3005278us) inbound_call.cc:173] Queueing success response
Metrics: {}
W20260926 22:12:31.748423  8118 connection.cc:196] Error closing socket: Network error: TlsSocket::Close: Broken pipe
[       OK ] Parameters/TestRpc.TestCallLongerThanKeepalive/SSL_UnixSocket (3075 ms)
[ RUN      ] Parameters/TestRpc.TestRpcSidecar/SSL_UnixSocket
I20260926 22:12:31.788251  8147 acceptor_pool.cc:254] collecting diagnostics on the listening RPC socket unix:/tmp/dist-test-task_HUdZa/test-tmp/rpc-test-3d17e0fc900b47ed90af8bd74c23bedd.sock every 8 connection(s)
I20260926 22:12:31.789130  8148 acceptor_pool.cc:254] collecting diagnostics on the listening RPC socket unix:/tmp/dist-test-task_HUdZa/test-tmp/rpc-test-3d17e0fc900b47ed90af8bd74c23bedd.sock every 8 connection(s)
W20260926 22:12:32.366381  8144 connection.cc:196] Error closing socket: Network error: TlsSocket::Close: Broken pipe
[       OK ] Parameters/TestRpc.TestRpcSidecar/SSL_UnixSocket (615 ms)
[ RUN      ] Parameters/TestRpc.TestRpcSidecarLimits/SSL_UnixSocket
I20260926 22:12:52.090633  8174 acceptor_pool.cc:254] collecting diagnostics on the listening RPC socket unix:/tmp/dist-test-task_HUdZa/test-tmp/rpc-test-7b7548ceb5d34791885e92e8c7fddaaa.sock every 8 connection(s)
I20260926 22:12:52.091609  8175 acceptor_pool.cc:254] collecting diagnostics on the listening RPC socket unix:/tmp/dist-test-task_HUdZa/test-tmp/rpc-test-7b7548ceb5d34791885e92e8c7fddaaa.sock every 8 connection(s)
W20260926 22:12:52.112921  7912 serialization.cc:72] Serialized kudu.rpc_test.PushStringsRequestPB (2147483654 bytes) is larger than the maximum configured RPC message size (52428800 bytes). Sending anyway, but peer may reject the data.
W20260926 22:12:52.126552  8171 connection.cc:535] server connection from unix:<unnamed> recv error: Network error: RPC frame had a length of 2147483714, but we only support messages up to 52428800 bytes long.
W20260926 22:12:52.126982  8171 connection.cc:158] shutting down server connection from unix:<unnamed> with pending inbound data: 4/2147483714 bytes received; last active 0 ns ago: status Network error: RPC frame had a length of 2147483714, but we only support messages up to 52428800 bytes long.
W20260926 22:12:52.128470  8187 connection.cc:196] Error closing socket: Network error: TlsSocket::Close: Broken pipe
[       OK ] Parameters/TestRpc.TestRpcSidecarLimits/SSL_UnixSocket (20344 ms)
[ RUN      ] Parameters/TestRpc.TestCallTimeoutDoesntAffectNegotiation/SSL_UnixSocket
I20260926 22:12:52.761663  8199 acceptor_pool.cc:254] collecting diagnostics on the listening RPC socket unix:/tmp/dist-test-task_HUdZa/test-tmp/rpc-test-b82d68584b0a45b382b79c2fcd5c29ff.sock every 8 connection(s)
I20260926 22:12:52.763098  8200 acceptor_pool.cc:254] collecting diagnostics on the listening RPC socket unix:/tmp/dist-test-task_HUdZa/test-tmp/rpc-test-b82d68584b0a45b382b79c2fcd5c29ff.sock every 8 connection(s)
W20260926 22:12:52.803809  8195 negotiation.cc:266] Injecting 500ms delay in negotiation
I20260926 22:12:52.853300  7912 rpc-test-base.h:595] status: Timed out: connection negotiation to unix:/tmp/dist-test-task_HUdZa/test-tmp/rpc-test-b82d68584b0a45b382b79c2fcd5c29ff.sock for RPC Sleep timed out after 0.050s (ON_OUTBOUND_QUEUE), seconds elapsed: 0.0508546
[       OK ] Parameters/TestRpc.TestCallTimeoutDoesntAffectNegotiation/SSL_UnixSocket (605 ms)
[ RUN      ] Parameters/TestRpc.TestRpcHandlerLatencyMetric/SSL_UnixSocket
I20260926 22:12:53.356516  8224 acceptor_pool.cc:254] collecting diagnostics on the listening RPC socket unix:/tmp/dist-test-task_HUdZa/test-tmp/rpc-test-7ccbd41ed2b447a0aaf7700f031bc675.sock every 8 connection(s)
I20260926 22:12:53.357385  8225 acceptor_pool.cc:254] collecting diagnostics on the listening RPC socket unix:/tmp/dist-test-task_HUdZa/test-tmp/rpc-test-7ccbd41ed2b447a0aaf7700f031bc675.sock every 8 connection(s)
I20260926 22:12:53.413959  7912 rpc-test.cc:1236] Sleep() min lat: 22232
I20260926 22:12:53.414213  7912 rpc-test.cc:1237] Sleep() mean lat: 22232
I20260926 22:12:53.414394  7912 rpc-test.cc:1238] Sleep() max lat: 22232
I20260926 22:12:53.414522  7912 rpc-test.cc:1239] Sleep() #calls: 1
W20260926 22:12:53.417560  8221 connection.cc:196] Error closing socket: Network error: TlsSocket::Close: Broken pipe
[       OK ] Parameters/TestRpc.TestRpcHandlerLatencyMetric/SSL_UnixSocket (100 ms)
[ RUN      ] Parameters/TestRpc.TimedOutOnResponseMetricServiceQueue/SSL_UnixSocket
I20260926 22:12:53.452903  8250 acceptor_pool.cc:254] collecting diagnostics on the listening RPC socket unix:/tmp/dist-test-task_HUdZa/test-tmp/rpc-test-900ffecf18ec423c8618df6e299da66a.sock every 8 connection(s)
I20260926 22:12:53.453723  8251 acceptor_pool.cc:254] collecting diagnostics on the listening RPC socket unix:/tmp/dist-test-task_HUdZa/test-tmp/rpc-test-900ffecf18ec423c8618df6e299da66a.sock every 8 connection(s)
W20260926 22:12:53.532992  8252 rpcz_store.cc:267] Call kudu.rpc_test.CalculatorService.Sleep from unix:<unnamed> (request call id 2) took 20 ms (client timeout 20 ms). Trace:
W20260926 22:12:53.533396  8252 rpcz_store.cc:269] 0926 22:12:53.512511 (+     0us) service_pool.cc:170] Inserting onto call queue
0926 22:12:53.532844 (+ 20333us) service_pool.cc:214] Skipping call since client already timed out
0926 22:12:53.532938 (+    94us) inbound_call.cc:173] Queueing failure response
Metrics: {}
[       OK ] Parameters/TestRpc.TimedOutOnResponseMetricServiceQueue/SSL_UnixSocket (117 ms)
[ RUN      ] Parameters/TestRpc.RpcPendingConnectionsMetric/SSL_UnixSocket
I20260926 22:12:53.553520  8273 acceptor_pool.cc:254] collecting diagnostics on the listening RPC socket 0.0.0.0:42831 every 8 connection(s)
I20260926 22:12:53.554288  8274 acceptor_pool.cc:254] collecting diagnostics on the listening RPC socket 0.0.0.0:42831 every 8 connection(s)
W20260926 22:12:53.560174  8269 negotiation.cc:337] Failed RPC negotiation. Trace:
0926 22:12:53.558819 (+     0us) reactor.cc:625] Submitting negotiation task for server connection from 127.0.0.1:38804 (local address 127.0.0.1:42831)
0926 22:12:53.559327 (+   508us) server_negotiation.cc:206] Beginning negotiation
0926 22:12:53.559346 (+    19us) server_negotiation.cc:399] Waiting for connection header
0926 22:12:53.559594 (+   248us) negotiation.cc:327] Negotiation complete: Network error: Server connection negotiation failed: server connection from 127.0.0.1:38804: BlockingRecv error: recv got EOF from 127.0.0.1:38804 (error 108)
Metrics: {"server-negotiator.queue_time_us":133}
[       OK ] Parameters/TestRpc.RpcPendingConnectionsMetric/SSL_UnixSocket (31 ms)
[ RUN      ] Parameters/TestRpc.TestRpcContextClientDeadline/SSL_UnixSocket
I20260926 22:12:53.605502  8289 acceptor_pool.cc:254] collecting diagnostics on the listening RPC socket unix:/tmp/dist-test-task_HUdZa/test-tmp/rpc-test-0e5be1672a9c421d976a6bf0addb3a42.sock every 8 connection(s)
I20260926 22:12:53.606328  8290 acceptor_pool.cc:254] collecting diagnostics on the listening RPC socket unix:/tmp/dist-test-task_HUdZa/test-tmp/rpc-test-0e5be1672a9c421d976a6bf0addb3a42.sock every 8 connection(s)
W20260926 22:12:53.683902  8286 connection.cc:196] Error closing socket: Network error: TlsSocket::Close: Broken pipe
[       OK ] Parameters/TestRpc.TestRpcContextClientDeadline/SSL_UnixSocket (114 ms)
[ RUN      ] Parameters/TestRpc.TestApplicationFeatureFlagUnsupportedServer/SSL_UnixSocket
I20260926 22:12:53.719462  8314 acceptor_pool.cc:254] collecting diagnostics on the listening RPC socket unix:/tmp/dist-test-task_HUdZa/test-tmp/rpc-test-1aef8d07ea994860a6f76b7b67aedd3d.sock every 8 connection(s)
I20260926 22:12:53.720213  8315 acceptor_pool.cc:254] collecting diagnostics on the listening RPC socket unix:/tmp/dist-test-task_HUdZa/test-tmp/rpc-test-1aef8d07ea994860a6f76b7b67aedd3d.sock every 8 connection(s)
W20260926 22:12:53.755995  8311 connection.cc:196] Error closing socket: Network error: TlsSocket::Close: Broken pipe
[       OK ] Parameters/TestRpc.TestApplicationFeatureFlagUnsupportedServer/SSL_UnixSocket (73 ms)
[ RUN      ] Parameters/TestRpc.TestCancellationAsync/SSL_UnixSocket
I20260926 22:12:53.785614  8339 acceptor_pool.cc:254] collecting diagnostics on the listening RPC socket unix:/tmp/dist-test-task_HUdZa/test-tmp/rpc-test-1a76953c049143c8bcb0f880db59a678.sock every 8 connection(s)
I20260926 22:12:53.786372  8340 acceptor_pool.cc:254] collecting diagnostics on the listening RPC socket unix:/tmp/dist-test-task_HUdZa/test-tmp/rpc-test-1a76953c049143c8bcb0f880db59a678.sock every 8 connection(s)
I20260926 22:12:53.790223  7912 rpc-test.cc:1716] Connecting to unix:/tmp/dist-test-task_HUdZa/test-tmp/rpc-test-1a76953c049143c8bcb0f880db59a678.sock
I20260926 22:12:53.808467  7912 test_util.cc:268] Using random seed: 577255732
I20260926 22:12:54.059664  8343 rpc-test-base.h:240] got call: sleep_micros: 500 pattern: 4294967295 num_repetitions: 2097152 sidecar_idx: 0
I20260926 22:12:54.269541  8342 rpc-test-base.h:240] got call: sleep_micros: 500 pattern: 4294967295 num_repetitions: 2097152 sidecar_idx: 0
I20260926 22:12:54.510910  8343 rpc-test-base.h:240] got call: sleep_micros: 500 pattern: 4294967295 num_repetitions: 2097152 sidecar_idx: 0
I20260926 22:12:54.732483  8343 rpc-test-base.h:240] got call: sleep_micros: 500 pattern: 4294967295 num_repetitions: 2097152 sidecar_idx: 0
I20260926 22:12:54.938043  8342 rpc-test-base.h:240] got call: sleep_micros: 500 pattern: 4294967295 num_repetitions: 2097152 sidecar_idx: 0
I20260926 22:12:55.167781  8342 rpc-test-base.h:240] got call: sleep_micros: 500 pattern: 4294967295 num_repetitions: 2097152 sidecar_idx: 0
I20260926 22:12:55.401985  8342 rpc-test-base.h:240] got call: sleep_micros: 500 pattern: 4294967295 num_repetitions: 2097152 sidecar_idx: 0
I20260926 22:12:55.614672  8342 rpc-test-base.h:240] got call: sleep_micros: 500 pattern: 4294967295 num_repetitions: 2097152 sidecar_idx: 0
I20260926 22:12:55.832324  8342 rpc-test-base.h:240] got call: sleep_micros: 500 pattern: 4294967295 num_repetitions: 2097152 sidecar_idx: 0
W20260926 22:12:55.855873  8336 connection.cc:196] Error closing socket: Network error: TlsSocket::Close: Broken pipe
W20260926 22:12:55.976738  8336 connection.cc:441] server connection from unix:<unnamed> torn down before Call kudu.rpc.GenericCalculatorService.SleepWithSidecar from unix:<unnamed> (request call id 9) could send its response
[       OK ] Parameters/TestRpc.TestCancellationAsync/SSL_UnixSocket (2226 ms)
[ RUN      ] Parameters/TestRpc.TestPerformanceBySocketType/SSL_UnixSocket
I20260926 22:12:56.103704  8364 acceptor_pool.cc:254] collecting diagnostics on the listening RPC socket unix:/tmp/dist-test-task_HUdZa/test-tmp/rpc-test-e081f4d8c2cd4f55afb6f25d1254504a.sock every 8 connection(s)
I20260926 22:12:56.104548  8365 acceptor_pool.cc:254] collecting diagnostics on the listening RPC socket unix:/tmp/dist-test-task_HUdZa/test-tmp/rpc-test-e081f4d8c2cd4f55afb6f25d1254504a.sock every 8 connection(s)
I20260926 22:12:56.108470  7912 rpc-test.cc:1846] Connecting to unix:/tmp/dist-test-task_HUdZa/test-tmp/rpc-test-e081f4d8c2cd4f55afb6f25d1254504a.sock
I20260926 22:13:20.798306  7912 rpc-test.cc:1859] Sending 1024MB via ssl-enabled unix socket: real 24.661s	user 22.726s	sys 15.645s
I20260926 22:13:44.914224  7912 rpc-test.cc:1859] Sending 1024MB via ssl-enabled unix socket: real 24.115s	user 21.616s	sys 15.588s
I20260926 22:14:08.828495  7912 rpc-test.cc:1859] Sending 1024MB via ssl-enabled unix socket: real 23.914s	user 21.510s	sys 15.330s
I20260926 22:14:32.916090  7912 rpc-test.cc:1859] Sending 1024MB via ssl-enabled unix socket: real 24.087s	user 21.507s	sys 15.663s
I20260926 22:14:57.357288  7912 rpc-test.cc:1859] Sending 1024MB via ssl-enabled unix socket: real 24.441s	user 21.962s	sys 15.989s
W20260926 22:14:57.364887  8361 connection.cc:196] Error closing socket: Network error: TlsSocket::Close: Broken pipe
[       OK ] Parameters/TestRpc.TestPerformanceBySocketType/SSL_UnixSocket (121391 ms)
[----------] 20 tests from Parameters/TestRpc (306270 ms total)

[----------] 1 test from Parameters/TestRpcSocketTxRxQueue
[ RUN      ] Parameters/TestRpcSocketTxRxQueue.AcceptorRxQueueSizeMetric/0
I20260926 22:14:57.393994  8401 acceptor_pool.cc:254] collecting diagnostics on the listening RPC socket 0.0.0.0:45299 every 1 connection(s)
I20260926 22:14:57.394976  8402 acceptor_pool.cc:254] collecting diagnostics on the listening RPC socket 0.0.0.0:45299 every 1 connection(s)
W20260926 22:14:57.402110  8397 negotiation.cc:337] Failed RPC negotiation. Trace:
0926 22:14:57.400007 (+     0us) reactor.cc:625] Submitting negotiation task for server connection from 127.0.0.1:35040 (local address 127.0.0.1:45299)
0926 22:14:57.400595 (+   588us) server_negotiation.cc:206] Beginning negotiation
0926 22:14:57.400621 (+    26us) server_negotiation.cc:399] Waiting for connection header
0926 22:14:57.401008 (+   387us) negotiation.cc:327] Negotiation complete: Network error: Server connection negotiation failed: server connection from 127.0.0.1:35040: BlockingRecv error: recv got EOF from 127.0.0.1:35040 (error 108)
Metrics: {"server-negotiator.queue_time_us":135}
[       OK ] Parameters/TestRpcSocketTxRxQueue.AcceptorRxQueueSizeMetric/0 (30 ms)
[----------] 1 test from Parameters/TestRpcSocketTxRxQueue (30 ms total)

[----------] Global test environment tear-down
[==========] 21 tests from 2 test suites ran. (306302 ms total)
[  PASSED  ] 20 tests.
[  FAILED  ] 1 test, listed below:
[  FAILED  ] Parameters/TestRpc.TestCallWithChainCertAndChainCA/SSL_UnixSocket, where GetParam() = (true, true)

 1 FAILED TEST