Diagnosed failure

Parameters/TestRpc.TestCallWithChainCertAndChainCA/SSL_UnixSocket: /data0/somelongdirectorytoavoidrpathissues/src/kudu/src/kudu/rpc/rpc-test.cc:270: Failure
Failed
Bad status: Runtime error: could not verify certificate chain (error with cert: subject=CN = localhost, ST = sadfjas, C = AS, emailAddress = sdflkdsajf, O = lskdfjlsad, OU = sldfkja, issuer=C = AS, ST = ASDfkjdhf, L = lskdjf, O = saldfja, OU = skdjf, CN = localhost, emailAddress = sadjflkadsj): : certificate has expired
Google Test trace:
/data0/somelongdirectorytoavoidrpathissues/src/kudu/src/kudu/rpc/rpc-test.cc:267: Connecting to unix:/tmp/dist-test-taskTtZb9m/test-tmp/rpc-test-a4c655e1471f44f1a6efc0600e6a7f7c.sock
I20260928 02:59:18.602290 29738 test_util.cc:175] -----------------------------------------------
I20260928 02:59:18.602372 29738 test_util.cc:176] Had fatal failures, leaving test files at /tmp/dist-test-taskTtZb9m/test-tmp/rpc-test.6.Parameters_TestRpc.TestCallWithChainCertAndChainCA_SSL_UnixSocket.1790564358477735-29738-0

Full log

Note: This is test shard 7 of 8.
[==========] Running 21 tests from 2 test suites.
[----------] Global test environment set-up.
[----------] 20 tests from Parameters/TestRpc
[ RUN      ] Parameters/TestRpc.TestMessengerCreateDestroy/SSL_UnixSocket
WARNING: Logging before InitGoogleLogging() is written to STDERR
I20260928 02:59:18.520447 29738 rpc-test.cc:169] started messenger TestCreateDestroy
[       OK ] Parameters/TestRpc.TestMessengerCreateDestroy/SSL_UnixSocket (25 ms)
[ RUN      ] Parameters/TestRpc.TestNegotiationDeadlock/SSL_UnixSocket
I20260928 02:59:18.551589 29758 acceptor_pool.cc:254] collecting diagnostics on the listening RPC socket unix:/tmp/dist-test-taskTtZb9m/test-tmp/rpc-test-7568c75a3b0e4322ab612c9a1801234f.sock every 8 connection(s)
I20260928 02:59:18.551898 29759 acceptor_pool.cc:254] collecting diagnostics on the listening RPC socket unix:/tmp/dist-test-taskTtZb9m/test-tmp/rpc-test-7568c75a3b0e4322ab612c9a1801234f.sock every 8 connection(s)
[       OK ] Parameters/TestRpc.TestNegotiationDeadlock/SSL_UnixSocket (46 ms)
[ RUN      ] Parameters/TestRpc.TestCallWithChainCertAndChainCA/SSL_UnixSocket
I20260928 02:59:18.591943 29774 acceptor_pool.cc:254] collecting diagnostics on the listening RPC socket unix:/tmp/dist-test-taskTtZb9m/test-tmp/rpc-test-a4c655e1471f44f1a6efc0600e6a7f7c.sock every 8 connection(s)
I20260928 02:59:18.592224 29775 acceptor_pool.cc:254] collecting diagnostics on the listening RPC socket unix:/tmp/dist-test-taskTtZb9m/test-tmp/rpc-test-a4c655e1471f44f1a6efc0600e6a7f7c.sock every 8 connection(s)
/data0/somelongdirectorytoavoidrpathissues/src/kudu/src/kudu/rpc/rpc-test.cc:270: Failure
Failed
Bad status: Runtime error: could not verify certificate chain (error with cert: subject=CN = localhost, ST = sadfjas, C = AS, emailAddress = sdflkdsajf, O = lskdfjlsad, OU = sldfkja, issuer=C = AS, ST = ASDfkjdhf, L = lskdjf, O = saldfja, OU = skdjf, CN = localhost, emailAddress = sadjflkadsj): : certificate has expired
Google Test trace:
/data0/somelongdirectorytoavoidrpathissues/src/kudu/src/kudu/rpc/rpc-test.cc:267: Connecting to unix:/tmp/dist-test-taskTtZb9m/test-tmp/rpc-test-a4c655e1471f44f1a6efc0600e6a7f7c.sock
I20260928 02:59:18.602290 29738 test_util.cc:175] -----------------------------------------------
I20260928 02:59:18.602372 29738 test_util.cc:176] Had fatal failures, leaving test files at /tmp/dist-test-taskTtZb9m/test-tmp/rpc-test.6.Parameters_TestRpc.TestCallWithChainCertAndChainCA_SSL_UnixSocket.1790564358477735-29738-0
[  FAILED  ] Parameters/TestRpc.TestCallWithChainCertAndChainCA/SSL_UnixSocket, where GetParam() = (true, true) (32 ms)
[ RUN      ] Parameters/TestRpc.TestCallWithPasswordProtectedKey/SSL_UnixSocket
I20260928 02:59:18.615949 29799 acceptor_pool.cc:254] collecting diagnostics on the listening RPC socket unix:/tmp/dist-test-taskTtZb9m/test-tmp/rpc-test-b8124b8264c4416b94e5f05fbe938b3d.sock every 8 connection(s)
I20260928 02:59:18.616178 29800 acceptor_pool.cc:254] collecting diagnostics on the listening RPC socket unix:/tmp/dist-test-taskTtZb9m/test-tmp/rpc-test-b8124b8264c4416b94e5f05fbe938b3d.sock every 8 connection(s)
W20260928 02:59:18.643755 29796 connection.cc:196] Error closing socket: Network error: TlsSocket::Close: Broken pipe
[       OK ] Parameters/TestRpc.TestCallWithPasswordProtectedKey/SSL_UnixSocket (45 ms)
[ RUN      ] Parameters/TestRpc.TestCallToBadServer/SSL_UnixSocket
I20260928 02:59:18.674841 29738 rpc-test.cc:394] Status: Network error: Client connection negotiation failed: client connection to 0.0.0.0:0: connect: Connection refused (error 111)
I20260928 02:59:18.675448 29738 rpc-test.cc:394] Status: Network error: Client connection negotiation failed: client connection to 0.0.0.0:0: connect: Connection refused (error 111)
I20260928 02:59:18.675966 29738 rpc-test.cc:394] Status: Network error: Client connection negotiation failed: client connection to 0.0.0.0:0: connect: Connection refused (error 111)
I20260928 02:59:18.676442 29738 rpc-test.cc:394] Status: Network error: Client connection negotiation failed: client connection to 0.0.0.0:0: connect: Connection refused (error 111)
I20260928 02:59:18.676908 29738 rpc-test.cc:394] Status: Network error: Client connection negotiation failed: client connection to 0.0.0.0:0: connect: Connection refused (error 111)
[       OK ] Parameters/TestRpc.TestCallToBadServer/SSL_UnixSocket (30 ms)
[ RUN      ] Parameters/TestRpc.TestWrongService/SSL_UnixSocket
I20260928 02:59:18.694232 29834 acceptor_pool.cc:254] collecting diagnostics on the listening RPC socket unix:/tmp/dist-test-taskTtZb9m/test-tmp/rpc-test-4f4226af9c004e629839a5a088e51da9.sock every 8 connection(s)
I20260928 02:59:18.694471 29835 acceptor_pool.cc:254] collecting diagnostics on the listening RPC socket unix:/tmp/dist-test-taskTtZb9m/test-tmp/rpc-test-4f4226af9c004e629839a5a088e51da9.sock every 8 connection(s)
I20260928 02:59:18.715206 29831 messenger.cc:345] service WrongServiceName not registered on TestServer
[       OK ] Parameters/TestRpc.TestWrongService/SSL_UnixSocket (41 ms)
[ RUN      ] Parameters/TestRpc.TestConnectionKeepalive/SSL_UnixSocket
I20260928 02:59:18.732739 29857 acceptor_pool.cc:254] collecting diagnostics on the listening RPC socket unix:/tmp/dist-test-taskTtZb9m/test-tmp/rpc-test-bb72ef00b1ce4cfe8d9f352632651632.sock every 8 connection(s)
I20260928 02:59:18.732995 29858 acceptor_pool.cc:254] collecting diagnostics on the listening RPC socket unix:/tmp/dist-test-taskTtZb9m/test-tmp/rpc-test-bb72ef00b1ce4cfe8d9f352632651632.sock every 8 connection(s)
I20260928 02:59:18.733780 29738 rpc-test.cc:488] Connecting to unix:/tmp/dist-test-taskTtZb9m/test-tmp/rpc-test-bb72ef00b1ce4cfe8d9f352632651632.sock
W20260928 02:59:19.222219 29870 connection.cc:196] Error closing socket: Network error: TlsSocket::Close: Broken pipe
[       OK ] Parameters/TestRpc.TestConnectionKeepalive/SSL_UnixSocket (1039 ms)
[ RUN      ] Parameters/TestRpc.TestClientConnectionMetrics/SSL_UnixSocket
I20260928 02:59:19.774361 29882 acceptor_pool.cc:254] collecting diagnostics on the listening RPC socket unix:/tmp/dist-test-taskTtZb9m/test-tmp/rpc-test-22d5794a3f274408b2005e3fd501a16b.sock every 8 connection(s)
I20260928 02:59:19.774590 29883 acceptor_pool.cc:254] collecting diagnostics on the listening RPC socket unix:/tmp/dist-test-taskTtZb9m/test-tmp/rpc-test-22d5794a3f274408b2005e3fd501a16b.sock every 8 connection(s)
I20260928 02:59:19.775403 29738 rpc-test.cc:569] Connecting to unix:/tmp/dist-test-taskTtZb9m/test-tmp/rpc-test-22d5794a3f274408b2005e3fd501a16b.sock
W20260928 02:59:39.977638 29879 connection.cc:196] Error closing socket: Network error: TlsSocket::Close: Broken pipe
[       OK ] Parameters/TestRpc.TestClientConnectionMetrics/SSL_UnixSocket (20224 ms)
[ RUN      ] Parameters/TestRpc.TestCredentialsPolicy/SSL_UnixSocket
I20260928 02:59:40.004770 29905 acceptor_pool.cc:254] collecting diagnostics on the listening RPC socket unix:/tmp/dist-test-taskTtZb9m/test-tmp/rpc-test-59ed06b3991747fa952a2f8d34b64da7.sock every 8 connection(s)
I20260928 02:59:40.005069 29906 acceptor_pool.cc:254] collecting diagnostics on the listening RPC socket unix:/tmp/dist-test-taskTtZb9m/test-tmp/rpc-test-59ed06b3991747fa952a2f8d34b64da7.sock every 8 connection(s)
I20260928 02:59:40.005983 29738 rpc-test.cc:700] Connecting to unix:/tmp/dist-test-taskTtZb9m/test-tmp/rpc-test-59ed06b3991747fa952a2f8d34b64da7.sock
W20260928 02:59:40.033908 29904 connection.cc:196] Error closing socket: Network error: TlsSocket::Close: Broken pipe
[       OK ] Parameters/TestRpc.TestCredentialsPolicy/SSL_UnixSocket (60 ms)
[ RUN      ] Parameters/TestRpc.TestCallLongerThanKeepalive/SSL_UnixSocket
I20260928 02:59:40.059922 29930 acceptor_pool.cc:254] collecting diagnostics on the listening RPC socket unix:/tmp/dist-test-taskTtZb9m/test-tmp/rpc-test-8dfb9bc5a243413483afe727ae5f185d.sock every 8 connection(s)
I20260928 02:59:40.060119 29931 acceptor_pool.cc:254] collecting diagnostics on the listening RPC socket unix:/tmp/dist-test-taskTtZb9m/test-tmp/rpc-test-8dfb9bc5a243413483afe727ae5f185d.sock every 8 connection(s)
I20260928 02:59:40.075888 29934 rpc-test-base.h:222] got call: sleep_micros: 3000000 deferred: true
I20260928 02:59:43.077519 29934 rpcz_store.cc:275] Call kudu.rpc.GenericCalculatorService.Sleep from unix:<unnamed> (request call id 0) took 3001 ms. Trace:
I20260928 02:59:43.077663 29934 rpcz_store.cc:276] 0928 02:59:40.075751 (+     0us) service_pool.cc:170] Inserting onto call queue
0928 02:59:40.075848 (+    97us) service_pool.cc:227] Handling call
0928 02:59:43.077463 (+3001615us) inbound_call.cc:173] Queueing success response
Metrics: {}
W20260928 02:59:43.079798 29927 connection.cc:196] Error closing socket: Network error: TlsSocket::Close: Broken pipe
[       OK ] Parameters/TestRpc.TestCallLongerThanKeepalive/SSL_UnixSocket (3039 ms)
[ RUN      ] Parameters/TestRpc.TestRpcSidecar/SSL_UnixSocket
I20260928 02:59:43.113024 29955 acceptor_pool.cc:254] collecting diagnostics on the listening RPC socket unix:/tmp/dist-test-taskTtZb9m/test-tmp/rpc-test-f63a03ea3cac48b9a6ab3eb6019efafd.sock every 8 connection(s)
I20260928 02:59:43.113224 29956 acceptor_pool.cc:254] collecting diagnostics on the listening RPC socket unix:/tmp/dist-test-taskTtZb9m/test-tmp/rpc-test-f63a03ea3cac48b9a6ab3eb6019efafd.sock every 8 connection(s)
W20260928 02:59:43.197700 29952 connection.cc:196] Error closing socket: Network error: TlsSocket::Close: Broken pipe
[       OK ] Parameters/TestRpc.TestRpcSidecar/SSL_UnixSocket (117 ms)
[ RUN      ] Parameters/TestRpc.TestRpcSidecarLimits/SSL_UnixSocket
I20260928 02:59:45.180253 29980 acceptor_pool.cc:254] collecting diagnostics on the listening RPC socket unix:/tmp/dist-test-taskTtZb9m/test-tmp/rpc-test-6344767da8e646369329339169440361.sock every 8 connection(s)
I20260928 02:59:45.180491 29981 acceptor_pool.cc:254] collecting diagnostics on the listening RPC socket unix:/tmp/dist-test-taskTtZb9m/test-tmp/rpc-test-6344767da8e646369329339169440361.sock every 8 connection(s)
W20260928 02:59:45.194646 29738 serialization.cc:72] Serialized kudu.rpc_test.PushStringsRequestPB (2147483654 bytes) is larger than the maximum configured RPC message size (52428800 bytes). Sending anyway, but peer may reject the data.
W20260928 02:59:45.200140 29977 connection.cc:535] server connection from unix:<unnamed> recv error: Network error: RPC frame had a length of 2147483714, but we only support messages up to 52428800 bytes long.
W20260928 02:59:45.200268 29977 connection.cc:158] shutting down server connection from unix:<unnamed> with pending inbound data: 4/2147483714 bytes received; last active 0 ns ago: status Network error: RPC frame had a length of 2147483714, but we only support messages up to 52428800 bytes long.
W20260928 02:59:45.200711 29993 connection.cc:196] Error closing socket: Network error: TlsSocket::Close: Broken pipe
I20260928 02:59:45.214815 30005 acceptor_pool.cc:254] collecting diagnostics on the listening RPC socket unix:/tmp/dist-test-taskTtZb9m/test-tmp/rpc-test-6344767da8e646369329339169440361.sock every 8 connection(s)
I20260928 02:59:45.215000 30006 acceptor_pool.cc:254] collecting diagnostics on the listening RPC socket unix:/tmp/dist-test-taskTtZb9m/test-tmp/rpc-test-6344767da8e646369329339169440361.sock every 8 connection(s)
W20260928 02:59:50.893590 30002 connection.cc:577] server connection from unix:<unnamed>: received bad data: 'Corruption: Invalid packet: message had a length of 2147483710, but we only support messages up to 2147483647 bytes
'
W20260928 02:59:50.894191 30018 connection.cc:196] Error closing socket: Network error: TlsSocket::Close: Broken pipe
[       OK ] Parameters/TestRpc.TestRpcSidecarLimits/SSL_UnixSocket (8105 ms)
[ RUN      ] Parameters/TestRpc.TestCallTimeoutDoesntAffectNegotiation/SSL_UnixSocket
I20260928 02:59:51.322561 30030 acceptor_pool.cc:254] collecting diagnostics on the listening RPC socket unix:/tmp/dist-test-taskTtZb9m/test-tmp/rpc-test-bada9bcd35e34680a9252f680e1632de.sock every 8 connection(s)
I20260928 02:59:51.322824 30031 acceptor_pool.cc:254] collecting diagnostics on the listening RPC socket unix:/tmp/dist-test-taskTtZb9m/test-tmp/rpc-test-bada9bcd35e34680a9252f680e1632de.sock every 8 connection(s)
W20260928 02:59:51.337971 30026 negotiation.cc:266] Injecting 500ms delay in negotiation
I20260928 02:59:51.388487 29738 rpc-test-base.h:595] status: Timed out: connection negotiation to unix:/tmp/dist-test-taskTtZb9m/test-tmp/rpc-test-bada9bcd35e34680a9252f680e1632de.sock for RPC Sleep timed out after 0.050s (ON_OUTBOUND_QUEUE), seconds elapsed: 0.0509908
[       OK ] Parameters/TestRpc.TestCallTimeoutDoesntAffectNegotiation/SSL_UnixSocket (541 ms)
[ RUN      ] Parameters/TestRpc.TestRpcHandlerLatencyMetric/SSL_UnixSocket
I20260928 02:59:51.863337 30055 acceptor_pool.cc:254] collecting diagnostics on the listening RPC socket unix:/tmp/dist-test-taskTtZb9m/test-tmp/rpc-test-b5d27d6ffa044ab3ad4517890de31e71.sock every 8 connection(s)
I20260928 02:59:51.863616 30056 acceptor_pool.cc:254] collecting diagnostics on the listening RPC socket unix:/tmp/dist-test-taskTtZb9m/test-tmp/rpc-test-b5d27d6ffa044ab3ad4517890de31e71.sock every 8 connection(s)
I20260928 02:59:51.924979 29738 rpc-test.cc:1236] Sleep() min lat: 20567
I20260928 02:59:51.925086 29738 rpc-test.cc:1237] Sleep() mean lat: 20567
I20260928 02:59:51.925144 29738 rpc-test.cc:1238] Sleep() max lat: 20567
I20260928 02:59:51.925176 29738 rpc-test.cc:1239] Sleep() #calls: 1
[       OK ] Parameters/TestRpc.TestRpcHandlerLatencyMetric/SSL_UnixSocket (82 ms)
[ RUN      ] Parameters/TestRpc.TimedOutOnResponseMetricServiceQueue/SSL_UnixSocket
I20260928 02:59:51.958987 30081 acceptor_pool.cc:254] collecting diagnostics on the listening RPC socket unix:/tmp/dist-test-taskTtZb9m/test-tmp/rpc-test-410f3fc1b4b3456782e9cb325b1c8823.sock every 8 connection(s)
I20260928 02:59:51.959228 30082 acceptor_pool.cc:254] collecting diagnostics on the listening RPC socket unix:/tmp/dist-test-taskTtZb9m/test-tmp/rpc-test-410f3fc1b4b3456782e9cb325b1c8823.sock every 8 connection(s)
W20260928 02:59:52.014309 30083 rpcz_store.cc:267] Call kudu.rpc_test.CalculatorService.Sleep from unix:<unnamed> (request call id 2) took 20 ms (client timeout 20 ms). Trace:
W20260928 02:59:52.014475 30083 rpcz_store.cc:269] 0928 02:59:51.993940 (+     0us) service_pool.cc:170] Inserting onto call queue
0928 02:59:52.014246 (+ 20306us) service_pool.cc:214] Skipping call since client already timed out
0928 02:59:52.014288 (+    42us) inbound_call.cc:173] Queueing failure response
Metrics: {}
[       OK ] Parameters/TestRpc.TimedOutOnResponseMetricServiceQueue/SSL_UnixSocket (88 ms)
[ RUN      ] Parameters/TestRpc.RpcPendingConnectionsMetric/SSL_UnixSocket
I20260928 02:59:52.022708 30104 acceptor_pool.cc:254] collecting diagnostics on the listening RPC socket 0.0.0.0:34515 every 8 connection(s)
I20260928 02:59:52.022910 30105 acceptor_pool.cc:254] collecting diagnostics on the listening RPC socket 0.0.0.0:34515 every 8 connection(s)
W20260928 02:59:52.024698 30100 negotiation.cc:337] Failed RPC negotiation. Trace:
0928 02:59:52.024147 (+     0us) reactor.cc:625] Submitting negotiation task for server connection from 127.0.0.1:49360 (local address 127.0.0.1:34515)
0928 02:59:52.024293 (+   146us) server_negotiation.cc:206] Beginning negotiation
0928 02:59:52.024296 (+     3us) server_negotiation.cc:399] Waiting for connection header
0928 02:59:52.024408 (+   112us) negotiation.cc:327] Negotiation complete: Network error: Server connection negotiation failed: server connection from 127.0.0.1:49360: BlockingRecv error: recv got EOF from 127.0.0.1:49360 (error 108)
Metrics: {"server-negotiator.queue_time_us":45}
[       OK ] Parameters/TestRpc.RpcPendingConnectionsMetric/SSL_UnixSocket (18 ms)
[ RUN      ] Parameters/TestRpc.TestRpcContextClientDeadline/SSL_UnixSocket
I20260928 02:59:52.055807 30120 acceptor_pool.cc:254] collecting diagnostics on the listening RPC socket unix:/tmp/dist-test-taskTtZb9m/test-tmp/rpc-test-6c8b3cb600364596813dd4c38820094e.sock every 8 connection(s)
I20260928 02:59:52.056012 30121 acceptor_pool.cc:254] collecting diagnostics on the listening RPC socket unix:/tmp/dist-test-taskTtZb9m/test-tmp/rpc-test-6c8b3cb600364596813dd4c38820094e.sock every 8 connection(s)
W20260928 02:59:52.093019 30117 connection.cc:196] Error closing socket: Network error: TlsSocket::Close: Broken pipe
[       OK ] Parameters/TestRpc.TestRpcContextClientDeadline/SSL_UnixSocket (59 ms)
[ RUN      ] Parameters/TestRpc.TestApplicationFeatureFlagUnsupportedServer/SSL_UnixSocket
I20260928 02:59:52.109340 30145 acceptor_pool.cc:254] collecting diagnostics on the listening RPC socket unix:/tmp/dist-test-taskTtZb9m/test-tmp/rpc-test-e0c48bba8f1b4d9fbc5dc6edad5a6218.sock every 8 connection(s)
I20260928 02:59:52.109520 30146 acceptor_pool.cc:254] collecting diagnostics on the listening RPC socket unix:/tmp/dist-test-taskTtZb9m/test-tmp/rpc-test-e0c48bba8f1b4d9fbc5dc6edad5a6218.sock every 8 connection(s)
[       OK ] Parameters/TestRpc.TestApplicationFeatureFlagUnsupportedServer/SSL_UnixSocket (37 ms)
[ RUN      ] Parameters/TestRpc.TestCancellationAsync/SSL_UnixSocket
I20260928 02:59:52.147917 30170 acceptor_pool.cc:254] collecting diagnostics on the listening RPC socket unix:/tmp/dist-test-taskTtZb9m/test-tmp/rpc-test-731c50b703c24b87a7c34937949dbeb1.sock every 8 connection(s)
I20260928 02:59:52.148123 30171 acceptor_pool.cc:254] collecting diagnostics on the listening RPC socket unix:/tmp/dist-test-taskTtZb9m/test-tmp/rpc-test-731c50b703c24b87a7c34937949dbeb1.sock every 8 connection(s)
I20260928 02:59:52.148918 29738 rpc-test.cc:1716] Connecting to unix:/tmp/dist-test-taskTtZb9m/test-tmp/rpc-test-731c50b703c24b87a7c34937949dbeb1.sock
I20260928 02:59:52.182869 29738 test_util.cc:268] Using random seed: 1116415043
I20260928 02:59:52.222422 30174 rpc-test-base.h:240] got call: sleep_micros: 500 pattern: 4294967295 num_repetitions: 2097152 sidecar_idx: 0
I20260928 02:59:52.249457 30173 rpc-test-base.h:240] got call: sleep_micros: 500 pattern: 4294967295 num_repetitions: 2097152 sidecar_idx: 0
I20260928 02:59:52.277175 30174 rpc-test-base.h:240] got call: sleep_micros: 500 pattern: 4294967295 num_repetitions: 2097152 sidecar_idx: 0
I20260928 02:59:52.304216 30173 rpc-test-base.h:240] got call: sleep_micros: 500 pattern: 4294967295 num_repetitions: 2097152 sidecar_idx: 0
I20260928 02:59:52.332428 30174 rpc-test-base.h:240] got call: sleep_micros: 500 pattern: 4294967295 num_repetitions: 2097152 sidecar_idx: 0
I20260928 02:59:52.360409 30173 rpc-test-base.h:240] got call: sleep_micros: 500 pattern: 4294967295 num_repetitions: 2097152 sidecar_idx: 0
I20260928 02:59:52.388346 30172 rpc-test-base.h:240] got call: sleep_micros: 500 pattern: 4294967295 num_repetitions: 2097152 sidecar_idx: 0
W20260928 02:59:52.393927 30167 connection.cc:196] Error closing socket: Network error: TlsSocket::Close: Broken pipe
W20260928 02:59:52.407693 30167 connection.cc:441] server connection from unix:<unnamed> torn down before Call kudu.rpc.GenericCalculatorService.SleepWithSidecar from unix:<unnamed> (request call id 8) could send its response
W20260928 02:59:52.421509 30167 connection.cc:441] server connection from unix:<unnamed> torn down before Call kudu.rpc.GenericCalculatorService.SleepWithSidecar from unix:<unnamed> (request call id 9) could send its response
[       OK ] Parameters/TestRpc.TestCancellationAsync/SSL_UnixSocket (290 ms)
[ RUN      ] Parameters/TestRpc.TestPerformanceBySocketType/SSL_UnixSocket
I20260928 02:59:52.461428 30195 acceptor_pool.cc:254] collecting diagnostics on the listening RPC socket unix:/tmp/dist-test-taskTtZb9m/test-tmp/rpc-test-ade10f476f564836a62d8f7cb92340ab.sock every 8 connection(s)
I20260928 02:59:52.461632 30196 acceptor_pool.cc:254] collecting diagnostics on the listening RPC socket unix:/tmp/dist-test-taskTtZb9m/test-tmp/rpc-test-ade10f476f564836a62d8f7cb92340ab.sock every 8 connection(s)
I20260928 02:59:52.462499 29738 rpc-test.cc:1846] Connecting to unix:/tmp/dist-test-taskTtZb9m/test-tmp/rpc-test-ade10f476f564836a62d8f7cb92340ab.sock
I20260928 02:59:55.348820 29738 rpc-test.cc:1859] Sending 1024MB via ssl-enabled unix socket: real 2.871s	user 2.725s	sys 2.173s
I20260928 02:59:58.316593 29738 rpc-test.cc:1859] Sending 1024MB via ssl-enabled unix socket: real 2.968s	user 3.113s	sys 1.960s
I20260928 03:00:01.268535 29738 rpc-test.cc:1859] Sending 1024MB via ssl-enabled unix socket: real 2.952s	user 3.028s	sys 2.013s
I20260928 03:00:04.198308 29738 rpc-test.cc:1859] Sending 1024MB via ssl-enabled unix socket: real 2.930s	user 3.022s	sys 1.975s
I20260928 03:00:07.190660 29738 rpc-test.cc:1859] Sending 1024MB via ssl-enabled unix socket: real 2.992s	user 2.968s	sys 2.132s
W20260928 03:00:07.191624 30192 connection.cc:196] Error closing socket: Network error: TlsSocket::Close: Broken pipe
[       OK ] Parameters/TestRpc.TestPerformanceBySocketType/SSL_UnixSocket (14773 ms)
[----------] 20 tests from Parameters/TestRpc (48700 ms total)

[----------] 1 test from Parameters/TestRpcSocketTxRxQueue
[ RUN      ] Parameters/TestRpcSocketTxRxQueue.AcceptorRxQueueSizeMetric/0
I20260928 03:00:07.202354 30220 acceptor_pool.cc:254] collecting diagnostics on the listening RPC socket 0.0.0.0:44227 every 1 connection(s)
I20260928 03:00:07.202514 30221 acceptor_pool.cc:254] collecting diagnostics on the listening RPC socket 0.0.0.0:44227 every 1 connection(s)
W20260928 03:00:07.204135 30216 negotiation.cc:337] Failed RPC negotiation. Trace:
0928 03:00:07.203792 (+     0us) reactor.cc:625] Submitting negotiation task for server connection from 127.0.0.1:58994 (local address 127.0.0.1:44227)
0928 03:00:07.203914 (+   122us) server_negotiation.cc:206] Beginning negotiation
0928 03:00:07.203918 (+     4us) server_negotiation.cc:399] Waiting for connection header
0928 03:00:07.204032 (+   114us) negotiation.cc:327] Negotiation complete: Network error: Server connection negotiation failed: server connection from 127.0.0.1:58994: BlockingRecv error: recv got EOF from 127.0.0.1:58994 (error 108)
Metrics: {"server-negotiator.queue_time_us":28}
[       OK ] Parameters/TestRpcSocketTxRxQueue.AcceptorRxQueueSizeMetric/0 (9 ms)
[----------] 1 test from Parameters/TestRpcSocketTxRxQueue (9 ms total)

[----------] Global test environment tear-down
[==========] 21 tests from 2 test suites ran. (48710 ms total)
[  PASSED  ] 20 tests.
[  FAILED  ] 1 test, listed below:
[  FAILED  ] Parameters/TestRpc.TestCallWithChainCertAndChainCA/SSL_UnixSocket, where GetParam() = (true, true)

 1 FAILED TEST