Diagnosed failure

Parameters/TestRpc.TestCallWithChainCertAndRootCA/SSL_UnixSocket: /data0/somelongdirectorytoavoidrpathissues/src/kudu/src/kudu/rpc/rpc-test.cc:303: Failure
Failed
Bad status: Runtime error: could not verify certificate chain (error with cert: subject=CN = localhost, ST = sadfjas, C = AS, emailAddress = sdflkdsajf, O = lskdfjlsad, OU = sldfkja, issuer=C = AS, ST = ASDfkjdhf, L = lskdjf, O = saldfja, OU = skdjf, CN = localhost, emailAddress = sadjflkadsj): : certificate has expired
Google Test trace:
/data0/somelongdirectorytoavoidrpathissues/src/kudu/src/kudu/rpc/rpc-test.cc:300: Connecting to unix:/tmp/dist-test-taskRdh5hO/test-tmp/rpc-test-01fb9a57c25b44dc901f97c0f7d4f850.sock
I20260928 19:27:18.539664   390 test_util.cc:175] -----------------------------------------------
I20260928 19:27:18.539839   390 test_util.cc:176] Had fatal failures, leaving test files at /tmp/dist-test-taskRdh5hO/test-tmp/rpc-test.2.Parameters_TestRpc.TestCallWithChainCertAndRootCA_SSL_UnixSocket.1790623634979427-390-0

Full log

Note: This is test shard 3 of 8.
[==========] Running 21 tests from 2 test suites.
[----------] Global test environment set-up.
[----------] 1 test from TestRpc
[ RUN      ] TestRpc.TestNegotiationTimeout
WARNING: Logging before InitGoogleLogging() is written to STDERR
I20260928 19:27:15.163950   390 rpc-test-base.h:595] status: Timed out: connection negotiation to 0.0.0.0:34409 for RPC Sleep timed out after 0.100s (ON_OUTBOUND_QUEUE), seconds elapsed: 0.101574
W20260928 19:27:18.217258   400 negotiation.cc:337] Failed RPC negotiation. Trace:
0928 19:27:15.063117 (+     0us) reactor.cc:625] Submitting negotiation task for client connection to 0.0.0.0:34409 (local address 127.0.0.1:58238)
0928 19:27:15.063789 (+   672us) negotiation.cc:107] Waiting for socket to connect
0928 19:27:15.063835 (+    46us) client_negotiation.cc:174] Beginning negotiation
0928 19:27:15.075559 (+ 11724us) client_negotiation.cc:252] Sending NEGOTIATE NegotiatePB request
0928 19:27:18.216206 (+3140647us) negotiation.cc:327] Negotiation complete: Timed out: Client connection negotiation failed: client connection to 0.0.0.0:34409: received 0 of 4 requested bytes
Metrics: {"client-negotiator.queue_time_us":185}
[       OK ] TestRpc.TestNegotiationTimeout (3192 ms)
[----------] 1 test from TestRpc (3192 ms total)

[----------] 20 tests from Parameters/TestRpc
[ RUN      ] Parameters/TestRpc.TestAcceptorPoolStartStop/SSL_UnixSocket
I20260928 19:27:18.271092   416 acceptor_pool.cc:254] collecting diagnostics on the listening RPC socket unix:/tmp/dist-test-taskRdh5hO/test-tmp/rpc-test-4c3a35c04f3a4329b8256a6a59713b31.sock every 8 connection(s)
I20260928 19:27:18.273017   417 acceptor_pool.cc:254] collecting diagnostics on the listening RPC socket unix:/tmp/dist-test-taskRdh5hO/test-tmp/rpc-test-4c3a35c04f3a4329b8256a6a59713b31.sock every 8 connection(s)
I20260928 19:27:18.303803   427 acceptor_pool.cc:254] collecting diagnostics on the listening RPC socket unix:/tmp/dist-test-taskRdh5hO/test-tmp/rpc-test-4c3a35c04f3a4329b8256a6a59713b31.sock every 8 connection(s)
I20260928 19:27:18.305614   428 acceptor_pool.cc:254] collecting diagnostics on the listening RPC socket unix:/tmp/dist-test-taskRdh5hO/test-tmp/rpc-test-4c3a35c04f3a4329b8256a6a59713b31.sock every 8 connection(s)
I20260928 19:27:18.349176   438 acceptor_pool.cc:254] collecting diagnostics on the listening RPC socket unix:/tmp/dist-test-taskRdh5hO/test-tmp/rpc-test-4c3a35c04f3a4329b8256a6a59713b31.sock every 8 connection(s)
I20260928 19:27:18.349875   439 acceptor_pool.cc:254] collecting diagnostics on the listening RPC socket unix:/tmp/dist-test-taskRdh5hO/test-tmp/rpc-test-4c3a35c04f3a4329b8256a6a59713b31.sock every 8 connection(s)
I20260928 19:27:18.374244   449 acceptor_pool.cc:254] collecting diagnostics on the listening RPC socket unix:/tmp/dist-test-taskRdh5hO/test-tmp/rpc-test-4c3a35c04f3a4329b8256a6a59713b31.sock every 8 connection(s)
I20260928 19:27:18.374882   450 acceptor_pool.cc:254] collecting diagnostics on the listening RPC socket unix:/tmp/dist-test-taskRdh5hO/test-tmp/rpc-test-4c3a35c04f3a4329b8256a6a59713b31.sock every 8 connection(s)
I20260928 19:27:18.400225   460 acceptor_pool.cc:254] collecting diagnostics on the listening RPC socket unix:/tmp/dist-test-taskRdh5hO/test-tmp/rpc-test-4c3a35c04f3a4329b8256a6a59713b31.sock every 8 connection(s)
I20260928 19:27:18.400882   461 acceptor_pool.cc:254] collecting diagnostics on the listening RPC socket unix:/tmp/dist-test-taskRdh5hO/test-tmp/rpc-test-4c3a35c04f3a4329b8256a6a59713b31.sock every 8 connection(s)
[       OK ] Parameters/TestRpc.TestAcceptorPoolStartStop/SSL_UnixSocket (179 ms)
[ RUN      ] Parameters/TestRpc.TestCall/SSL_UnixSocket
I20260928 19:27:18.430817   473 acceptor_pool.cc:254] collecting diagnostics on the listening RPC socket unix:/tmp/dist-test-taskRdh5hO/test-tmp/rpc-test-b4b417a07778430695ebf084c6b7141a.sock every 8 connection(s)
I20260928 19:27:18.433197   474 acceptor_pool.cc:254] collecting diagnostics on the listening RPC socket unix:/tmp/dist-test-taskRdh5hO/test-tmp/rpc-test-b4b417a07778430695ebf084c6b7141a.sock every 8 connection(s)
I20260928 19:27:18.438071   390 rpc-test.cc:234] Connecting to unix:/tmp/dist-test-taskRdh5hO/test-tmp/rpc-test-b4b417a07778430695ebf084c6b7141a.sock
[       OK ] Parameters/TestRpc.TestCall/SSL_UnixSocket (92 ms)
[ RUN      ] Parameters/TestRpc.TestCallWithChainCertAndRootCA/SSL_UnixSocket
I20260928 19:27:18.519968   498 acceptor_pool.cc:254] collecting diagnostics on the listening RPC socket unix:/tmp/dist-test-taskRdh5hO/test-tmp/rpc-test-01fb9a57c25b44dc901f97c0f7d4f850.sock every 8 connection(s)
I20260928 19:27:18.520646   499 acceptor_pool.cc:254] collecting diagnostics on the listening RPC socket unix:/tmp/dist-test-taskRdh5hO/test-tmp/rpc-test-01fb9a57c25b44dc901f97c0f7d4f850.sock every 8 connection(s)
/data0/somelongdirectorytoavoidrpathissues/src/kudu/src/kudu/rpc/rpc-test.cc:303: Failure
Failed
Bad status: Runtime error: could not verify certificate chain (error with cert: subject=CN = localhost, ST = sadfjas, C = AS, emailAddress = sdflkdsajf, O = lskdfjlsad, OU = sldfkja, issuer=C = AS, ST = ASDfkjdhf, L = lskdjf, O = saldfja, OU = skdjf, CN = localhost, emailAddress = sadjflkadsj): : certificate has expired
Google Test trace:
/data0/somelongdirectorytoavoidrpathissues/src/kudu/src/kudu/rpc/rpc-test.cc:300: Connecting to unix:/tmp/dist-test-taskRdh5hO/test-tmp/rpc-test-01fb9a57c25b44dc901f97c0f7d4f850.sock
I20260928 19:27:18.539664   390 test_util.cc:175] -----------------------------------------------
I20260928 19:27:18.539839   390 test_util.cc:176] Had fatal failures, leaving test files at /tmp/dist-test-taskRdh5hO/test-tmp/rpc-test.2.Parameters_TestRpc.TestCallWithChainCertAndRootCA_SSL_UnixSocket.1790623634979427-390-0
[  FAILED  ] Parameters/TestRpc.TestCallWithChainCertAndRootCA/SSL_UnixSocket, where GetParam() = (true, true) (42 ms)
[ RUN      ] Parameters/TestRpc.TestCallWithBadPasswordProtectedKey/SSL_UnixSocket
[       OK ] Parameters/TestRpc.TestCallWithBadPasswordProtectedKey/SSL_UnixSocket (28 ms)
[ RUN      ] Parameters/TestRpc.TestInvalidMethodCall/SSL_UnixSocket
I20260928 19:27:18.593730   535 acceptor_pool.cc:254] collecting diagnostics on the listening RPC socket unix:/tmp/dist-test-taskRdh5hO/test-tmp/rpc-test-6a0a2f946c024241adc0f6815f7a2657.sock every 8 connection(s)
I20260928 19:27:18.594552   536 acceptor_pool.cc:254] collecting diagnostics on the listening RPC socket unix:/tmp/dist-test-taskRdh5hO/test-tmp/rpc-test-6a0a2f946c024241adc0f6815f7a2657.sock every 8 connection(s)
I20260928 19:27:18.597888   390 rpc-test.cc:406] Connecting to unix:/tmp/dist-test-taskRdh5hO/test-tmp/rpc-test-6a0a2f946c024241adc0f6815f7a2657.sock
W20260928 19:27:18.622978   532 connection.cc:196] Error closing socket: Network error: TlsSocket::Close: Broken pipe
[       OK ] Parameters/TestRpc.TestInvalidMethodCall/SSL_UnixSocket (58 ms)
[ RUN      ] Parameters/TestRpc.TestHighFDs/SSL_UnixSocket
I20260928 19:27:18.846490   560 acceptor_pool.cc:254] collecting diagnostics on the listening RPC socket unix:/tmp/dist-test-taskRdh5hO/test-tmp/rpc-test-f4d83fe42b684299a39a9c5029221544.sock every 8 connection(s)
I20260928 19:27:18.847159   561 acceptor_pool.cc:254] collecting diagnostics on the listening RPC socket unix:/tmp/dist-test-taskRdh5hO/test-tmp/rpc-test-f4d83fe42b684299a39a9c5029221544.sock every 8 connection(s)
W20260928 19:27:18.896235   557 connection.cc:196] Error closing socket: Network error: TlsSocket::Close: Broken pipe
[       OK ] Parameters/TestRpc.TestHighFDs/SSL_UnixSocket (281 ms)
[ RUN      ] Parameters/TestRpc.TestConnectionAlwaysKeepalive/SSL_UnixSocket
I20260928 19:27:18.961656   583 acceptor_pool.cc:254] collecting diagnostics on the listening RPC socket unix:/tmp/dist-test-taskRdh5hO/test-tmp/rpc-test-63d4f1524a904fc08150abfcc85f0273.sock every 8 connection(s)
I20260928 19:27:18.962241   584 acceptor_pool.cc:254] collecting diagnostics on the listening RPC socket unix:/tmp/dist-test-taskRdh5hO/test-tmp/rpc-test-63d4f1524a904fc08150abfcc85f0273.sock every 8 connection(s)
I20260928 19:27:18.965014   390 rpc-test.cc:532] Connecting to unix:/tmp/dist-test-taskRdh5hO/test-tmp/rpc-test-63d4f1524a904fc08150abfcc85f0273.sock
[       OK ] Parameters/TestRpc.TestConnectionAlwaysKeepalive/SSL_UnixSocket (3091 ms)
[ RUN      ] Parameters/TestRpc.TestReopenOutboundConnections/SSL_UnixSocket
I20260928 19:27:22.026115   606 acceptor_pool.cc:254] collecting diagnostics on the listening RPC socket unix:/tmp/dist-test-taskRdh5hO/test-tmp/rpc-test-3175b65e733c474793ce7df32193a5b4.sock every 8 connection(s)
I20260928 19:27:22.026793   607 acceptor_pool.cc:254] collecting diagnostics on the listening RPC socket unix:/tmp/dist-test-taskRdh5hO/test-tmp/rpc-test-3175b65e733c474793ce7df32193a5b4.sock every 8 connection(s)
I20260928 19:27:22.029874   390 rpc-test.cc:658] Connecting to unix:/tmp/dist-test-taskRdh5hO/test-tmp/rpc-test-3175b65e733c474793ce7df32193a5b4.sock
W20260928 19:27:22.057523   605 connection.cc:196] Error closing socket: Network error: TlsSocket::Close: Broken pipe
W20260928 19:27:22.066785   605 connection.cc:196] Error closing socket: Network error: TlsSocket::Close: Broken pipe
W20260928 19:27:22.076821   605 connection.cc:196] Error closing socket: Network error: TlsSocket::Close: Broken pipe
W20260928 19:27:22.086377   605 connection.cc:196] Error closing socket: Network error: TlsSocket::Close: Broken pipe
W20260928 19:27:22.096127   605 connection.cc:196] Error closing socket: Network error: TlsSocket::Close: Broken pipe
W20260928 19:27:22.107378   605 connection.cc:196] Error closing socket: Network error: TlsSocket::Close: Broken pipe
W20260928 19:27:22.117244   605 connection.cc:196] Error closing socket: Network error: TlsSocket::Close: Broken pipe
W20260928 19:27:22.127981   605 connection.cc:196] Error closing socket: Network error: TlsSocket::Close: Broken pipe
W20260928 19:27:22.138557   605 connection.cc:196] Error closing socket: Network error: TlsSocket::Close: Broken pipe
W20260928 19:27:22.148615   605 connection.cc:196] Error closing socket: Network error: TlsSocket::Close: Broken pipe
W20260928 19:27:22.158177   605 connection.cc:196] Error closing socket: Network error: TlsSocket::Close: Broken pipe
W20260928 19:27:22.168622   605 connection.cc:196] Error closing socket: Network error: TlsSocket::Close: Broken pipe
W20260928 19:27:22.178815   605 connection.cc:196] Error closing socket: Network error: TlsSocket::Close: Broken pipe
W20260928 19:27:22.189589   605 connection.cc:196] Error closing socket: Network error: TlsSocket::Close: Broken pipe
W20260928 19:27:22.189646   606 acceptor_pool.cc:285] unable to collect diagnostics on RPC socket unix:/tmp/dist-test-taskRdh5hO/test-tmp/rpc-test-3175b65e733c474793ce7df32193a5b4.sock: Not implemented: netlink diagnostics is currently supported only on IPv4 TCP sockets
W20260928 19:27:22.200106   605 connection.cc:196] Error closing socket: Network error: TlsSocket::Close: Broken pipe
W20260928 19:27:22.210358   605 connection.cc:196] Error closing socket: Network error: TlsSocket::Close: Broken pipe
W20260928 19:27:22.220346   605 connection.cc:196] Error closing socket: Network error: TlsSocket::Close: Broken pipe
W20260928 19:27:22.230110   605 connection.cc:196] Error closing socket: Network error: TlsSocket::Close: Broken pipe
W20260928 19:27:22.239315   605 connection.cc:196] Error closing socket: Network error: TlsSocket::Close: Broken pipe
W20260928 19:27:22.249367   605 connection.cc:196] Error closing socket: Network error: TlsSocket::Close: Broken pipe
W20260928 19:27:22.259444   605 connection.cc:196] Error closing socket: Network error: TlsSocket::Close: Broken pipe
W20260928 19:27:22.269637   605 connection.cc:196] Error closing socket: Network error: TlsSocket::Close: Broken pipe
W20260928 19:27:22.280768   605 connection.cc:196] Error closing socket: Network error: TlsSocket::Close: Broken pipe
W20260928 19:27:22.290885   605 connection.cc:196] Error closing socket: Network error: TlsSocket::Close: Broken pipe
W20260928 19:27:22.301128   605 connection.cc:196] Error closing socket: Network error: TlsSocket::Close: Broken pipe
W20260928 19:27:22.310297   605 connection.cc:196] Error closing socket: Network error: TlsSocket::Close: Broken pipe
W20260928 19:27:22.319490   605 connection.cc:196] Error closing socket: Network error: TlsSocket::Close: Broken pipe
W20260928 19:27:22.328842   605 connection.cc:196] Error closing socket: Network error: TlsSocket::Close: Broken pipe
W20260928 19:27:22.337534   605 connection.cc:196] Error closing socket: Network error: TlsSocket::Close: Broken pipe
W20260928 19:27:22.346447   605 connection.cc:196] Error closing socket: Network error: TlsSocket::Close: Broken pipe
W20260928 19:27:22.355901   605 connection.cc:196] Error closing socket: Network error: TlsSocket::Close: Broken pipe
W20260928 19:27:22.366286   605 connection.cc:196] Error closing socket: Network error: TlsSocket::Close: Broken pipe
[       OK ] Parameters/TestRpc.TestReopenOutboundConnections/SSL_UnixSocket (368 ms)
[ RUN      ] Parameters/TestRpc.TestConnectionNetworkPlane/SSL_UnixSocket
I20260928 19:27:22.405119   629 acceptor_pool.cc:254] collecting diagnostics on the listening RPC socket unix:/tmp/dist-test-taskRdh5hO/test-tmp/rpc-test-3cb305252a714765acc6cfae7be5220f.sock every 8 connection(s)
I20260928 19:27:22.405753   630 acceptor_pool.cc:254] collecting diagnostics on the listening RPC socket unix:/tmp/dist-test-taskRdh5hO/test-tmp/rpc-test-3cb305252a714765acc6cfae7be5220f.sock every 8 connection(s)
I20260928 19:27:22.408790   390 rpc-test.cc:772] Connecting to unix:/tmp/dist-test-taskRdh5hO/test-tmp/rpc-test-3cb305252a714765acc6cfae7be5220f.sock
W20260928 19:27:22.451793   628 connection.cc:196] Error closing socket: Network error: TlsSocket::Close: Broken pipe
[       OK ] Parameters/TestRpc.TestConnectionNetworkPlane/SSL_UnixSocket (85 ms)
[ RUN      ] Parameters/TestRpc.TestTCPKeepalive/SSL_UnixSocket
I20260928 19:27:22.474828   654 acceptor_pool.cc:254] collecting diagnostics on the listening RPC socket unix:/tmp/dist-test-taskRdh5hO/test-tmp/rpc-test-e67c42208a334bd0a7ca24fe9c3749e6.sock every 8 connection(s)
I20260928 19:27:22.475503   655 acceptor_pool.cc:254] collecting diagnostics on the listening RPC socket unix:/tmp/dist-test-taskRdh5hO/test-tmp/rpc-test-e67c42208a334bd0a7ca24fe9c3749e6.sock every 8 connection(s)
I20260928 19:27:22.514931   658 rpc-test-base.h:222] got call: sleep_micros: 8000000 deferred: true
I20260928 19:27:30.518963   658 rpcz_store.cc:275] Call kudu.rpc.GenericCalculatorService.Sleep from unix:<unnamed> (request call id 0) took 8004 ms. Trace:
I20260928 19:27:30.519385   658 rpcz_store.cc:276] 0928 19:27:22.514761 (+     0us) service_pool.cc:170] Inserting onto call queue
0928 19:27:22.514877 (+   116us) service_pool.cc:227] Handling call
0928 19:27:30.518796 (+8003919us) inbound_call.cc:173] Queueing success response
Metrics: {}
W20260928 19:27:30.524878   651 connection.cc:196] Error closing socket: Network error: TlsSocket::Close: Broken pipe
[       OK ] Parameters/TestRpc.TestTCPKeepalive/SSL_UnixSocket (8075 ms)
[ RUN      ] Parameters/TestRpc.TestMaxSmallSidecars/SSL_UnixSocket
I20260928 19:27:30.558758   680 acceptor_pool.cc:254] collecting diagnostics on the listening RPC socket unix:/tmp/dist-test-taskRdh5hO/test-tmp/rpc-test-cd052ab968304e60b12871cb1df789f2.sock every 8 connection(s)
I20260928 19:27:30.559607   681 acceptor_pool.cc:254] collecting diagnostics on the listening RPC socket unix:/tmp/dist-test-taskRdh5hO/test-tmp/rpc-test-cd052ab968304e60b12871cb1df789f2.sock every 8 connection(s)
W20260928 19:27:30.723675   677 connection.cc:196] Error closing socket: Network error: TlsSocket::Close: Broken pipe
[       OK ] Parameters/TestRpc.TestMaxSmallSidecars/SSL_UnixSocket (195 ms)
[ RUN      ] Parameters/TestRpc.TestCallTimeout/SSL_UnixSocket
I20260928 19:27:30.750501   705 acceptor_pool.cc:254] collecting diagnostics on the listening RPC socket unix:/tmp/dist-test-taskRdh5hO/test-tmp/rpc-test-aa6281325c2f43cab00d1793204486e1.sock every 8 connection(s)
I20260928 19:27:30.751163   706 acceptor_pool.cc:254] collecting diagnostics on the listening RPC socket unix:/tmp/dist-test-taskRdh5hO/test-tmp/rpc-test-aa6281325c2f43cab00d1793204486e1.sock every 8 connection(s)
I20260928 19:27:30.770541   390 rpc-test-base.h:595] status: Timed out: connection negotiation to unix:/tmp/dist-test-taskRdh5hO/test-tmp/rpc-test-aa6281325c2f43cab00d1793204486e1.sock for RPC Sleep timed out after 0.000s (ON_OUTBOUND_QUEUE), seconds elapsed: 0.00230443
I20260928 19:27:30.777736   709 rpc-test-base.h:222] got call: sleep_micros: 700000
I20260928 19:27:30.971277   390 rpc-test-base.h:595] status: Timed out: Sleep RPC to unix:/tmp/dist-test-taskRdh5hO/test-tmp/rpc-test-aa6281325c2f43cab00d1793204486e1.sock timed out after 0.200s (SENT), seconds elapsed: 0.200435
I20260928 19:27:30.972628   708 rpc-test-base.h:222] got call: sleep_micros: 2000000
W20260928 19:27:31.478402   709 rpcz_store.cc:267] Call kudu.rpc.GenericCalculatorService.Sleep from unix:<unnamed> (request call id 1) took 700 ms (client timeout 200 ms). Trace:
W20260928 19:27:31.478752   709 rpcz_store.cc:269] 0928 19:27:30.777591 (+     0us) service_pool.cc:170] Inserting onto call queue
0928 19:27:30.777694 (+   103us) service_pool.cc:227] Handling call
0928 19:27:31.478342 (+700648us) inbound_call.cc:173] Queueing success response
Metrics: {}
I20260928 19:27:32.473742   390 rpc-test-base.h:595] status: Timed out: Sleep RPC to unix:/tmp/dist-test-taskRdh5hO/test-tmp/rpc-test-aa6281325c2f43cab00d1793204486e1.sock timed out after 1.500s (SENT), seconds elapsed: 1.5021
W20260928 19:27:32.973160   708 rpcz_store.cc:267] Call kudu.rpc.GenericCalculatorService.Sleep from unix:<unnamed> (request call id 2) took 2000 ms (client timeout 1500 ms). Trace:
W20260928 19:27:32.973467   708 rpcz_store.cc:269] 0928 19:27:30.972403 (+     0us) service_pool.cc:170] Inserting onto call queue
0928 19:27:30.972561 (+   158us) service_pool.cc:227] Handling call
0928 19:27:32.973101 (+2000540us) inbound_call.cc:173] Queueing success response
Metrics: {}
W20260928 19:27:32.974093   702 connection.cc:441] server connection from unix:<unnamed> torn down before Call kudu.rpc.GenericCalculatorService.Sleep from unix:<unnamed> (request call id 2) could send its response
[       OK ] Parameters/TestRpc.TestCallTimeout/SSL_UnixSocket (2251 ms)
[ RUN      ] Parameters/TestRpc.TestServerShutsDown/SSL_UnixSocket
I20260928 19:27:32.980751   390 rpc-test.cc:1125] Connecting to 0.0.0.0:34947
W20260928 19:27:32.992551   722 negotiation.cc:337] Failed RPC negotiation. Trace:
0928 19:27:32.991108 (+     0us) reactor.cc:625] Submitting negotiation task for client connection to 0.0.0.0:34947 (local address 127.0.0.1:43986)
0928 19:27:32.991593 (+   485us) negotiation.cc:107] Waiting for socket to connect
0928 19:27:32.991624 (+    31us) client_negotiation.cc:174] Beginning negotiation
0928 19:27:32.991838 (+   214us) client_negotiation.cc:252] Sending NEGOTIATE NegotiatePB request
0928 19:27:32.992056 (+   218us) negotiation.cc:327] Negotiation complete: Network error: Client connection negotiation failed: client connection to 0.0.0.0:34947: BlockingWrite error: write error: Broken pipe (error 32)
Metrics: {"client-negotiator.queue_time_us":114}
[       OK ] Parameters/TestRpc.TestServerShutsDown/SSL_UnixSocket (15 ms)
[ RUN      ] Parameters/TestRpc.TimedOutOnResponseMetric/SSL_UnixSocket
I20260928 19:27:33.008635   739 acceptor_pool.cc:254] collecting diagnostics on the listening RPC socket unix:/tmp/dist-test-taskRdh5hO/test-tmp/rpc-test-71b7116ff0fe4e8b945644d61d15ab3e.sock every 8 connection(s)
I20260928 19:27:33.009291   740 acceptor_pool.cc:254] collecting diagnostics on the listening RPC socket unix:/tmp/dist-test-taskRdh5hO/test-tmp/rpc-test-71b7116ff0fe4e8b945644d61d15ab3e.sock every 8 connection(s)
W20260928 19:27:33.247318   743 rpcz_store.cc:267] Call kudu.rpc_test.CalculatorService.Sleep from unix:<unnamed> (request call id 3) took 50 ms (client timeout 25 ms). Trace:
W20260928 19:27:33.247634   743 rpcz_store.cc:269] 0928 19:27:33.196728 (+     0us) service_pool.cc:170] Inserting onto call queue
0928 19:27:33.196846 (+   118us) service_pool.cc:227] Handling call
0928 19:27:33.247242 (+ 50396us) inbound_call.cc:173] Queueing success response
Related trace 'test_child':
Metrics: {"test_sleep_us":50000,"child_traces":[["test_child",{"related_trace_metric":1}]]}
W20260928 19:27:33.306941   743 rpcz_store.cc:267] Call kudu.rpc_test.CalculatorService.Sleep from unix:<unnamed> (request call id 4) took 50 ms (client timeout 50 ms). Trace:
W20260928 19:27:33.307228   743 rpcz_store.cc:269] 0928 19:27:33.256429 (+     0us) service_pool.cc:170] Inserting onto call queue
0928 19:27:33.256569 (+   140us) service_pool.cc:227] Handling call
0928 19:27:33.306887 (+ 50318us) inbound_call.cc:173] Queueing success response
Related trace 'test_child':
Metrics: {"test_sleep_us":50000,"child_traces":[["test_child",{"related_trace_metric":1}]]}
[       OK ] Parameters/TestRpc.TimedOutOnResponseMetric/SSL_UnixSocket (319 ms)
[ RUN      ] Parameters/TestRpc.AcceptorDispatchingTimesMetric/SSL_UnixSocket
I20260928 19:27:33.326639   764 acceptor_pool.cc:254] collecting diagnostics on the listening RPC socket 0.0.0.0:41245 every 8 connection(s)
I20260928 19:27:33.327219   765 acceptor_pool.cc:254] collecting diagnostics on the listening RPC socket 0.0.0.0:41245 every 8 connection(s)
W20260928 19:27:33.332173   760 negotiation.cc:337] Failed RPC negotiation. Trace:
0928 19:27:33.331035 (+     0us) reactor.cc:625] Submitting negotiation task for server connection from 127.0.0.1:54982 (local address 127.0.0.1:41245)
0928 19:27:33.331425 (+   390us) server_negotiation.cc:206] Beginning negotiation
0928 19:27:33.331442 (+    17us) server_negotiation.cc:399] Waiting for connection header
0928 19:27:33.331714 (+   272us) negotiation.cc:327] Negotiation complete: Network error: Server connection negotiation failed: server connection from 127.0.0.1:54982: BlockingRecv error: recv got EOF from 127.0.0.1:54982 (error 108)
Metrics: {"server-negotiator.queue_time_us":102}
[       OK ] Parameters/TestRpc.AcceptorDispatchingTimesMetric/SSL_UnixSocket (21 ms)
[ RUN      ] Parameters/TestRpc.TestRpcCallbackDestroysMessenger/SSL_UnixSocket
[       OK ] Parameters/TestRpc.TestRpcCallbackDestroysMessenger/SSL_UnixSocket (32 ms)
[ RUN      ] Parameters/TestRpc.TestApplicationFeatureFlag/SSL_UnixSocket
I20260928 19:27:33.387984   789 acceptor_pool.cc:254] collecting diagnostics on the listening RPC socket unix:/tmp/dist-test-taskRdh5hO/test-tmp/rpc-test-0cb14d12811947c9803d0f11bce689cc.sock every 8 connection(s)
I20260928 19:27:33.388661   790 acceptor_pool.cc:254] collecting diagnostics on the listening RPC socket unix:/tmp/dist-test-taskRdh5hO/test-tmp/rpc-test-0cb14d12811947c9803d0f11bce689cc.sock every 8 connection(s)
W20260928 19:27:33.423888   786 messenger.cc:357] Unable to handle RPC call: Not implemented: call requires unsupported application feature flags: 99
W20260928 19:27:33.426340   786 connection.cc:196] Error closing socket: Network error: TlsSocket::Close: Broken pipe
[       OK ] Parameters/TestRpc.TestApplicationFeatureFlag/SSL_UnixSocket (61 ms)
[ RUN      ] Parameters/TestRpc.TestCancellation/SSL_UnixSocket
I20260928 19:27:33.449405   814 acceptor_pool.cc:254] collecting diagnostics on the listening RPC socket unix:/tmp/dist-test-taskRdh5hO/test-tmp/rpc-test-a5425d5f8a6749f8902460f68de40aaf.sock every 8 connection(s)
I20260928 19:27:33.450067   815 acceptor_pool.cc:254] collecting diagnostics on the listening RPC socket unix:/tmp/dist-test-taskRdh5hO/test-tmp/rpc-test-a5425d5f8a6749f8902460f68de40aaf.sock every 8 connection(s)
I20260928 19:27:33.453058   390 rpc-test.cc:1648] Connecting to unix:/tmp/dist-test-taskRdh5hO/test-tmp/rpc-test-a5425d5f8a6749f8902460f68de40aaf.sock
I20260928 19:27:33.558261   390 rpc-test-base.h:595] status: Aborted: Sleep RPC to unix:/tmp/dist-test-taskRdh5hO/test-tmp/rpc-test-a5425d5f8a6749f8902460f68de40aaf.sock is cancelled in state READY, seconds elapsed: 0.000427924
I20260928 19:27:33.729839   390 rpc-test-base.h:595] status: Aborted: Sleep RPC to unix:/tmp/dist-test-taskRdh5hO/test-tmp/rpc-test-a5425d5f8a6749f8902460f68de40aaf.sock is cancelled in state SENT, seconds elapsed: 0.000869355
I20260928 19:27:33.730036   817 rpc-test-base.h:222] got call: sleep_micros: 510000
I20260928 19:27:33.901952   390 rpc-test-base.h:595] status: Aborted: Sleep RPC to unix:/tmp/dist-test-taskRdh5hO/test-tmp/rpc-test-a5425d5f8a6749f8902460f68de40aaf.sock is cancelled in state SENT, seconds elapsed: 0.000669417
I20260928 19:27:33.902451   816 rpc-test-base.h:222] got call: sleep_micros: 510000
I20260928 19:27:34.073756   390 rpc-test-base.h:595] status: Aborted: Sleep RPC to unix:/tmp/dist-test-taskRdh5hO/test-tmp/rpc-test-a5425d5f8a6749f8902460f68de40aaf.sock is cancelled in state SENT, seconds elapsed: 0.000929393
W20260928 19:27:34.084283   818 rpcz_store.cc:267] Call kudu.rpc.GenericCalculatorService.Sleep from unix:<unnamed> (request call id 11) took 10 ms (client timeout 10 ms). Trace:
W20260928 19:27:34.084647   818 rpcz_store.cc:269] 0928 19:27:34.073744 (+     0us) service_pool.cc:170] Inserting onto call queue
0928 19:27:34.084046 (+ 10302us) service_pool.cc:214] Skipping call since client already timed out
0928 19:27:34.084135 (+    89us) inbound_call.cc:173] Queueing failure response
Metrics: {}
I20260928 19:27:34.085215   818 rpc-test-base.h:222] got call: sleep_micros: 1500000
W20260928 19:27:34.240630   817 rpcz_store.cc:267] Call kudu.rpc.GenericCalculatorService.Sleep from unix:<unnamed> (request call id 3) took 510 ms (client timeout 10 ms). Trace:
W20260928 19:27:34.240934   817 rpcz_store.cc:269] 0928 19:27:33.729854 (+     0us) service_pool.cc:170] Inserting onto call queue
0928 19:27:33.729979 (+   125us) service_pool.cc:227] Handling call
0928 19:27:34.240575 (+510596us) inbound_call.cc:173] Queueing success response
Metrics: {}
W20260928 19:27:34.413103   816 rpcz_store.cc:267] Call kudu.rpc.GenericCalculatorService.Sleep from unix:<unnamed> (request call id 7) took 510 ms (client timeout 10 ms). Trace:
W20260928 19:27:34.413481   816 rpcz_store.cc:269] 0928 19:27:33.902272 (+     0us) service_pool.cc:170] Inserting onto call queue
0928 19:27:33.902405 (+   133us) service_pool.cc:227] Handling call
0928 19:27:34.413049 (+510644us) inbound_call.cc:173] Queueing success response
Metrics: {}
I20260928 19:27:35.075479   390 rpc-test-base.h:595] status: Timed out: Sleep RPC to unix:/tmp/dist-test-taskRdh5hO/test-tmp/rpc-test-a5425d5f8a6749f8902460f68de40aaf.sock timed out after 1.000s (SENT), seconds elapsed: 1.00131
I20260928 19:27:35.077368   816 rpc-test-base.h:222] got call: sleep_micros: 1500000
W20260928 19:27:35.585928   818 rpcz_store.cc:267] Call kudu.rpc.GenericCalculatorService.Sleep from unix:<unnamed> (request call id 12) took 1511 ms (client timeout 1000 ms). Trace:
W20260928 19:27:35.586305   818 rpcz_store.cc:269] 0928 19:27:34.074755 (+     0us) service_pool.cc:170] Inserting onto call queue
0928 19:27:34.085113 (+ 10358us) service_pool.cc:227] Handling call
0928 19:27:35.585793 (+1500680us) inbound_call.cc:173] Queueing success response
Metrics: {}
I20260928 19:27:36.077775   390 rpc-test-base.h:595] status: Timed out: Sleep RPC to unix:/tmp/dist-test-taskRdh5hO/test-tmp/rpc-test-a5425d5f8a6749f8902460f68de40aaf.sock timed out after 1.000s (SENT), seconds elapsed: 1.00181
W20260928 19:27:36.079100   811 messenger.cc:357] Unable to handle RPC call: Not implemented: call requires unsupported application feature flags: 99, 1
W20260928 19:27:36.080533   811 messenger.cc:357] Unable to handle RPC call: Not implemented: call requires unsupported application feature flags: 99, 1
W20260928 19:27:36.285396   811 connection.cc:196] Error closing socket: Network error: TlsSocket::Close: Broken pipe
W20260928 19:27:36.578009   816 rpcz_store.cc:267] Call kudu.rpc.GenericCalculatorService.Sleep from unix:<unnamed> (request call id 13) took 1501 ms (client timeout 1000 ms). Trace:
W20260928 19:27:36.578331   816 rpcz_store.cc:269] 0928 19:27:35.077058 (+     0us) service_pool.cc:170] Inserting onto call queue
0928 19:27:35.077248 (+   190us) service_pool.cc:227] Handling call
0928 19:27:36.577955 (+1500707us) inbound_call.cc:173] Queueing success response
Metrics: {}
W20260928 19:27:36.578904   811 connection.cc:441] server connection from unix:<unnamed> torn down before Call kudu.rpc.GenericCalculatorService.Sleep from unix:<unnamed> (request call id 13) could send its response
[       OK ] Parameters/TestRpc.TestCancellation/SSL_UnixSocket (3155 ms)
[ RUN      ] Parameters/TestRpc.TestCancellationMultiThreads/SSL_UnixSocket
I20260928 19:27:36.607388   840 acceptor_pool.cc:254] collecting diagnostics on the listening RPC socket unix:/tmp/dist-test-taskRdh5hO/test-tmp/rpc-test-c9ac1cfa0c084757b24e980cb90eccc4.sock every 8 connection(s)
I20260928 19:27:36.608155   841 acceptor_pool.cc:254] collecting diagnostics on the listening RPC socket unix:/tmp/dist-test-taskRdh5hO/test-tmp/rpc-test-c9ac1cfa0c084757b24e980cb90eccc4.sock every 8 connection(s)
I20260928 19:27:36.611068   390 rpc-test.cc:1808] Connecting to unix:/tmp/dist-test-taskRdh5hO/test-tmp/rpc-test-c9ac1cfa0c084757b24e980cb90eccc4.sock
I20260928 19:27:36.757968   854 test_util.cc:268] Using random seed: 251447917
I20260928 19:27:36.758955   855 test_util.cc:268] Using random seed: 251448979
I20260928 19:27:36.760330   856 test_util.cc:268] Using random seed: 251450355
I20260928 19:27:36.761790   857 test_util.cc:268] Using random seed: 251451728
I20260928 19:27:36.763144   858 test_util.cc:268] Using random seed: 251453051
I20260928 19:27:36.765275   859 test_util.cc:268] Using random seed: 251455144
I20260928 19:27:36.767289   860 test_util.cc:268] Using random seed: 251457200
I20260928 19:27:36.769164   861 test_util.cc:268] Using random seed: 251458556
I20260928 19:27:36.770787   862 test_util.cc:268] Using random seed: 251460686
I20260928 19:27:36.772465   863 test_util.cc:268] Using random seed: 251462375
I20260928 19:27:36.774302   864 test_util.cc:268] Using random seed: 251464204
I20260928 19:27:36.775962   865 test_util.cc:268] Using random seed: 251465873
I20260928 19:27:36.777794   866 test_util.cc:268] Using random seed: 251467246
I20260928 19:27:36.779202   867 test_util.cc:268] Using random seed: 251469117
I20260928 19:27:36.781035   868 test_util.cc:268] Using random seed: 251470902
I20260928 19:27:36.782971   869 test_util.cc:268] Using random seed: 251472865
I20260928 19:27:36.784891   870 test_util.cc:268] Using random seed: 251474815
I20260928 19:27:36.786556   871 test_util.cc:268] Using random seed: 251476500
I20260928 19:27:36.787781   872 test_util.cc:268] Using random seed: 251477694
I20260928 19:27:36.789705   873 test_util.cc:268] Using random seed: 251479589
I20260928 19:27:36.791927   874 test_util.cc:268] Using random seed: 251481826
I20260928 19:27:36.793813   875 test_util.cc:268] Using random seed: 251483684
I20260928 19:27:36.795936   876 test_util.cc:268] Using random seed: 251485741
I20260928 19:27:36.798326   877 test_util.cc:268] Using random seed: 251488213
I20260928 19:27:36.800402   878 test_util.cc:268] Using random seed: 251490255
I20260928 19:27:36.802299   879 test_util.cc:268] Using random seed: 251492152
I20260928 19:27:36.804152   880 test_util.cc:268] Using random seed: 251493653
I20260928 19:27:36.805600   881 test_util.cc:268] Using random seed: 251495505
I20260928 19:27:36.807411   882 test_util.cc:268] Using random seed: 251497295
I20260928 19:27:36.809276   883 test_util.cc:268] Using random seed: 251499178
W20260928 19:27:56.118290   837 connection.cc:196] Error closing socket: Network error: TlsSocket::Close: Broken pipe
[       OK ] Parameters/TestRpc.TestCancellationMultiThreads/SSL_UnixSocket (19548 ms)
[ RUN      ] Parameters/TestRpc.TestCallId/SSL_UnixSocket
I20260928 19:27:56.165673   897 acceptor_pool.cc:254] collecting diagnostics on the listening RPC socket unix:/tmp/dist-test-taskRdh5hO/test-tmp/rpc-test-5a08166317d84956a859c41dff4be61a.sock every 8 connection(s)
I20260928 19:27:56.166499   898 acceptor_pool.cc:254] collecting diagnostics on the listening RPC socket unix:/tmp/dist-test-taskRdh5hO/test-tmp/rpc-test-5a08166317d84956a859c41dff4be61a.sock every 8 connection(s)
[       OK ] Parameters/TestRpc.TestCallId/SSL_UnixSocket (84 ms)
[----------] 20 tests from Parameters/TestRpc (37995 ms total)

[----------] Global test environment tear-down
[==========] 21 tests from 2 test suites ran. (41189 ms total)
[  PASSED  ] 20 tests.
[  FAILED  ] 1 test, listed below:
[  FAILED  ] Parameters/TestRpc.TestCallWithChainCertAndRootCA/SSL_UnixSocket, where GetParam() = (true, true)

 1 FAILED TEST
I20260928 19:27:56.237378   390 logging.cc:424] LogThrottler /data0/somelongdirectorytoavoidrpathissues/src/kudu/src/kudu/rpc/acceptor_pool.cc:285: suppressed but not reported on 3 messages since previous log ~34 seconds ago