Diagnosed failure

Parameters/TestRpc.TestCallWithChainCertAndChainCA/SSL_UnixSocket: /data0/somelongdirectorytoavoidrpathissues/src/kudu/src/kudu/rpc/rpc-test.cc:270: Failure
Failed
Bad status: Runtime error: could not verify certificate chain (error with cert: subject=CN = localhost, ST = sadfjas, C = AS, emailAddress = sdflkdsajf, O = lskdfjlsad, OU = sldfkja, issuer=C = AS, ST = ASDfkjdhf, L = lskdjf, O = saldfja, OU = skdjf, CN = localhost, emailAddress = sadjflkadsj): : certificate has expired
Google Test trace:
/data0/somelongdirectorytoavoidrpathissues/src/kudu/src/kudu/rpc/rpc-test.cc:267: Connecting to unix:/tmp/dist-test-taskdT70nJ/test-tmp/rpc-test-9ef8832710844c9db4ef33f1405f6482.sock
I20260926 14:50:42.840843   383 test_util.cc:175] -----------------------------------------------
I20260926 14:50:42.840912   383 test_util.cc:176] Had fatal failures, leaving test files at /tmp/dist-test-taskdT70nJ/test-tmp/rpc-test.6.Parameters_TestRpc.TestCallWithChainCertAndChainCA_SSL_UnixSocket.1790434242773841-383-0

Full log

Note: This is test shard 7 of 8.
[==========] Running 21 tests from 2 test suites.
[----------] Global test environment set-up.
[----------] 20 tests from Parameters/TestRpc
[ RUN      ] Parameters/TestRpc.TestMessengerCreateDestroy/SSL_UnixSocket
WARNING: Logging before InitGoogleLogging() is written to STDERR
I20260926 14:50:42.793395   383 rpc-test.cc:169] started messenger TestCreateDestroy
[       OK ] Parameters/TestRpc.TestMessengerCreateDestroy/SSL_UnixSocket (17 ms)
[ RUN      ] Parameters/TestRpc.TestNegotiationDeadlock/SSL_UnixSocket
I20260926 14:50:42.807544   403 acceptor_pool.cc:254] collecting diagnostics on the listening RPC socket unix:/tmp/dist-test-taskdT70nJ/test-tmp/rpc-test-a23bbd52b7354dd893e2fdd66a197d93.sock every 8 connection(s)
I20260926 14:50:42.807574   404 acceptor_pool.cc:254] collecting diagnostics on the listening RPC socket unix:/tmp/dist-test-taskdT70nJ/test-tmp/rpc-test-a23bbd52b7354dd893e2fdd66a197d93.sock every 8 connection(s)
[       OK ] Parameters/TestRpc.TestNegotiationDeadlock/SSL_UnixSocket (19 ms)
[ RUN      ] Parameters/TestRpc.TestCallWithChainCertAndChainCA/SSL_UnixSocket
I20260926 14:50:42.836922   419 acceptor_pool.cc:254] collecting diagnostics on the listening RPC socket unix:/tmp/dist-test-taskdT70nJ/test-tmp/rpc-test-9ef8832710844c9db4ef33f1405f6482.sock every 8 connection(s)
I20260926 14:50:42.836964   420 acceptor_pool.cc:254] collecting diagnostics on the listening RPC socket unix:/tmp/dist-test-taskdT70nJ/test-tmp/rpc-test-9ef8832710844c9db4ef33f1405f6482.sock every 8 connection(s)
/data0/somelongdirectorytoavoidrpathissues/src/kudu/src/kudu/rpc/rpc-test.cc:270: Failure
Failed
Bad status: Runtime error: could not verify certificate chain (error with cert: subject=CN = localhost, ST = sadfjas, C = AS, emailAddress = sdflkdsajf, O = lskdfjlsad, OU = sldfkja, issuer=C = AS, ST = ASDfkjdhf, L = lskdjf, O = saldfja, OU = skdjf, CN = localhost, emailAddress = sadjflkadsj): : certificate has expired
Google Test trace:
/data0/somelongdirectorytoavoidrpathissues/src/kudu/src/kudu/rpc/rpc-test.cc:267: Connecting to unix:/tmp/dist-test-taskdT70nJ/test-tmp/rpc-test-9ef8832710844c9db4ef33f1405f6482.sock
I20260926 14:50:42.840843   383 test_util.cc:175] -----------------------------------------------
I20260926 14:50:42.840912   383 test_util.cc:176] Had fatal failures, leaving test files at /tmp/dist-test-taskdT70nJ/test-tmp/rpc-test.6.Parameters_TestRpc.TestCallWithChainCertAndChainCA_SSL_UnixSocket.1790434242773841-383-0
[  FAILED  ] Parameters/TestRpc.TestCallWithChainCertAndChainCA/SSL_UnixSocket, where GetParam() = (true, true) (26 ms)
[ RUN      ] Parameters/TestRpc.TestCallWithPasswordProtectedKey/SSL_UnixSocket
I20260926 14:50:42.875723   444 acceptor_pool.cc:254] collecting diagnostics on the listening RPC socket unix:/tmp/dist-test-taskdT70nJ/test-tmp/rpc-test-8ac8ead7ae824260baeac786f9c397d0.sock every 8 connection(s)
I20260926 14:50:42.875763   445 acceptor_pool.cc:254] collecting diagnostics on the listening RPC socket unix:/tmp/dist-test-taskdT70nJ/test-tmp/rpc-test-8ac8ead7ae824260baeac786f9c397d0.sock every 8 connection(s)
W20260926 14:50:42.886940   441 connection.cc:196] Error closing socket: Network error: TlsSocket::Close: Broken pipe
[       OK ] Parameters/TestRpc.TestCallWithPasswordProtectedKey/SSL_UnixSocket (47 ms)
[ RUN      ] Parameters/TestRpc.TestCallToBadServer/SSL_UnixSocket
I20260926 14:50:42.904134   383 rpc-test.cc:394] Status: Network error: Client connection negotiation failed: client connection to 0.0.0.0:0: connect: Connection refused (error 111)
I20260926 14:50:42.904457   383 rpc-test.cc:394] Status: Network error: Client connection negotiation failed: client connection to 0.0.0.0:0: connect: Connection refused (error 111)
I20260926 14:50:42.904703   383 rpc-test.cc:394] Status: Network error: Client connection negotiation failed: client connection to 0.0.0.0:0: connect: Connection refused (error 111)
I20260926 14:50:42.904938   383 rpc-test.cc:394] Status: Network error: Client connection negotiation failed: client connection to 0.0.0.0:0: connect: Connection refused (error 111)
I20260926 14:50:42.905129   383 rpc-test.cc:394] Status: Network error: Client connection negotiation failed: client connection to 0.0.0.0:0: connect: Connection refused (error 111)
[       OK ] Parameters/TestRpc.TestCallToBadServer/SSL_UnixSocket (17 ms)
[ RUN      ] Parameters/TestRpc.TestWrongService/SSL_UnixSocket
I20260926 14:50:42.933641   479 acceptor_pool.cc:254] collecting diagnostics on the listening RPC socket unix:/tmp/dist-test-taskdT70nJ/test-tmp/rpc-test-9fac44cba8a94d36af8d3dc834bc62cc.sock every 8 connection(s)
I20260926 14:50:42.933681   480 acceptor_pool.cc:254] collecting diagnostics on the listening RPC socket unix:/tmp/dist-test-taskdT70nJ/test-tmp/rpc-test-9fac44cba8a94d36af8d3dc834bc62cc.sock every 8 connection(s)
I20260926 14:50:42.962857   476 messenger.cc:345] service WrongServiceName not registered on TestServer
[       OK ] Parameters/TestRpc.TestWrongService/SSL_UnixSocket (58 ms)
[ RUN      ] Parameters/TestRpc.TestConnectionKeepalive/SSL_UnixSocket
I20260926 14:50:42.982791   502 acceptor_pool.cc:254] collecting diagnostics on the listening RPC socket unix:/tmp/dist-test-taskdT70nJ/test-tmp/rpc-test-71aa867da6804b98b0f9c44750f07c44.sock every 8 connection(s)
I20260926 14:50:42.982826   503 acceptor_pool.cc:254] collecting diagnostics on the listening RPC socket unix:/tmp/dist-test-taskdT70nJ/test-tmp/rpc-test-71aa867da6804b98b0f9c44750f07c44.sock every 8 connection(s)
I20260926 14:50:42.982983   383 rpc-test.cc:488] Connecting to unix:/tmp/dist-test-taskdT70nJ/test-tmp/rpc-test-71aa867da6804b98b0f9c44750f07c44.sock
W20260926 14:50:43.466166   515 connection.cc:196] Error closing socket: Network error: TlsSocket::Close: Broken pipe
[       OK ] Parameters/TestRpc.TestConnectionKeepalive/SSL_UnixSocket (1040 ms)
[ RUN      ] Parameters/TestRpc.TestClientConnectionMetrics/SSL_UnixSocket
I20260926 14:50:44.020773   527 acceptor_pool.cc:254] collecting diagnostics on the listening RPC socket unix:/tmp/dist-test-taskdT70nJ/test-tmp/rpc-test-3d33d2e0f7154e7099d45bd5d8e1689f.sock every 8 connection(s)
I20260926 14:50:44.020826   528 acceptor_pool.cc:254] collecting diagnostics on the listening RPC socket unix:/tmp/dist-test-taskdT70nJ/test-tmp/rpc-test-3d33d2e0f7154e7099d45bd5d8e1689f.sock every 8 connection(s)
I20260926 14:50:44.020993   383 rpc-test.cc:569] Connecting to unix:/tmp/dist-test-taskdT70nJ/test-tmp/rpc-test-3d33d2e0f7154e7099d45bd5d8e1689f.sock
W20260926 14:50:52.692435   524 connection.cc:196] Error closing socket: Network error: TlsSocket::Close: Broken pipe
[       OK ] Parameters/TestRpc.TestClientConnectionMetrics/SSL_UnixSocket (8688 ms)
[ RUN      ] Parameters/TestRpc.TestCredentialsPolicy/SSL_UnixSocket
I20260926 14:50:52.728911   551 acceptor_pool.cc:254] collecting diagnostics on the listening RPC socket unix:/tmp/dist-test-taskdT70nJ/test-tmp/rpc-test-de3782645758494ab82aa3129d7499d3.sock every 8 connection(s)
I20260926 14:50:52.728911   550 acceptor_pool.cc:254] collecting diagnostics on the listening RPC socket unix:/tmp/dist-test-taskdT70nJ/test-tmp/rpc-test-de3782645758494ab82aa3129d7499d3.sock every 8 connection(s)
I20260926 14:50:52.729067   383 rpc-test.cc:700] Connecting to unix:/tmp/dist-test-taskdT70nJ/test-tmp/rpc-test-de3782645758494ab82aa3129d7499d3.sock
W20260926 14:50:52.767802   549 connection.cc:196] Error closing socket: Network error: TlsSocket::Close: Broken pipe
[       OK ] Parameters/TestRpc.TestCredentialsPolicy/SSL_UnixSocket (78 ms)
[ RUN      ] Parameters/TestRpc.TestCallLongerThanKeepalive/SSL_UnixSocket
I20260926 14:50:52.783039   575 acceptor_pool.cc:254] collecting diagnostics on the listening RPC socket unix:/tmp/dist-test-taskdT70nJ/test-tmp/rpc-test-52c11b336c414187ad7e55a96d19d0de.sock every 8 connection(s)
I20260926 14:50:52.783073   576 acceptor_pool.cc:254] collecting diagnostics on the listening RPC socket unix:/tmp/dist-test-taskdT70nJ/test-tmp/rpc-test-52c11b336c414187ad7e55a96d19d0de.sock every 8 connection(s)
I20260926 14:50:52.818616   579 rpc-test-base.h:222] got call: sleep_micros: 3000000 deferred: true
I20260926 14:50:55.819275   579 rpcz_store.cc:275] Call kudu.rpc.GenericCalculatorService.Sleep from unix:<unnamed> (request call id 0) took 3000 ms. Trace:
I20260926 14:50:55.819370   579 rpcz_store.cc:276] 0926 14:50:52.818564 (+     0us) service_pool.cc:170] Inserting onto call queue
0926 14:50:52.818602 (+    38us) service_pool.cc:227] Handling call
0926 14:50:55.819261 (+3000659us) inbound_call.cc:173] Queueing success response
Metrics: {}
W20260926 14:50:55.820429   572 connection.cc:196] Error closing socket: Network error: TlsSocket::Close: Broken pipe
[       OK ] Parameters/TestRpc.TestCallLongerThanKeepalive/SSL_UnixSocket (3049 ms)
[ RUN      ] Parameters/TestRpc.TestRpcSidecar/SSL_UnixSocket
I20260926 14:50:55.844800   600 acceptor_pool.cc:254] collecting diagnostics on the listening RPC socket unix:/tmp/dist-test-taskdT70nJ/test-tmp/rpc-test-bbc070f892564eb5ad37bd0527a24b47.sock every 8 connection(s)
I20260926 14:50:55.844857   601 acceptor_pool.cc:254] collecting diagnostics on the listening RPC socket unix:/tmp/dist-test-taskdT70nJ/test-tmp/rpc-test-bbc070f892564eb5ad37bd0527a24b47.sock every 8 connection(s)
W20260926 14:50:55.877893   597 connection.cc:196] Error closing socket: Network error: TlsSocket::Close: Broken pipe
[       OK ] Parameters/TestRpc.TestRpcSidecar/SSL_UnixSocket (57 ms)
[ RUN      ] Parameters/TestRpc.TestRpcSidecarLimits/SSL_UnixSocket
I20260926 14:50:57.607697   625 acceptor_pool.cc:254] collecting diagnostics on the listening RPC socket unix:/tmp/dist-test-taskdT70nJ/test-tmp/rpc-test-1b54f6d7a5aa4938be1dcadc91a9aaa5.sock every 8 connection(s)
I20260926 14:50:57.607743   626 acceptor_pool.cc:254] collecting diagnostics on the listening RPC socket unix:/tmp/dist-test-taskdT70nJ/test-tmp/rpc-test-1b54f6d7a5aa4938be1dcadc91a9aaa5.sock every 8 connection(s)
W20260926 14:50:57.623973   383 serialization.cc:72] Serialized kudu.rpc_test.PushStringsRequestPB (2147483654 bytes) is larger than the maximum configured RPC message size (52428800 bytes). Sending anyway, but peer may reject the data.
W20260926 14:50:57.626915   622 connection.cc:535] server connection from unix:<unnamed> recv error: Network error: RPC frame had a length of 2147483714, but we only support messages up to 52428800 bytes long.
W20260926 14:50:57.626981   622 connection.cc:158] shutting down server connection from unix:<unnamed> with pending inbound data: 4/2147483714 bytes received; last active 0 ns ago: status Network error: RPC frame had a length of 2147483714, but we only support messages up to 52428800 bytes long.
W20260926 14:50:57.627175   638 connection.cc:196] Error closing socket: Network error: TlsSocket::Close: Broken pipe
I20260926 14:50:57.642445   650 acceptor_pool.cc:254] collecting diagnostics on the listening RPC socket unix:/tmp/dist-test-taskdT70nJ/test-tmp/rpc-test-1b54f6d7a5aa4938be1dcadc91a9aaa5.sock every 8 connection(s)
I20260926 14:50:57.642570   651 acceptor_pool.cc:254] collecting diagnostics on the listening RPC socket unix:/tmp/dist-test-taskdT70nJ/test-tmp/rpc-test-1b54f6d7a5aa4938be1dcadc91a9aaa5.sock every 8 connection(s)
W20260926 14:51:01.807366   647 connection.cc:577] server connection from unix:<unnamed>: received bad data: 'Corruption: Invalid packet: message had a length of 2147483710, but we only support messages up to 2147483647 bytes
'
W20260926 14:51:01.807614   663 connection.cc:196] Error closing socket: Network error: TlsSocket::Close: Broken pipe
[       OK ] Parameters/TestRpc.TestRpcSidecarLimits/SSL_UnixSocket (5930 ms)
[ RUN      ] Parameters/TestRpc.TestCallTimeoutDoesntAffectNegotiation/SSL_UnixSocket
I20260926 14:51:01.814785   675 acceptor_pool.cc:254] collecting diagnostics on the listening RPC socket unix:/tmp/dist-test-taskdT70nJ/test-tmp/rpc-test-2ba5fbb3f79b47f593a9f81adb342b9c.sock every 8 connection(s)
I20260926 14:51:01.814822   676 acceptor_pool.cc:254] collecting diagnostics on the listening RPC socket unix:/tmp/dist-test-taskdT70nJ/test-tmp/rpc-test-2ba5fbb3f79b47f593a9f81adb342b9c.sock every 8 connection(s)
W20260926 14:51:01.834234   668 negotiation.cc:266] Injecting 500ms delay in negotiation
I20260926 14:51:01.884474   383 rpc-test-base.h:595] status: Timed out: connection negotiation to unix:/tmp/dist-test-taskdT70nJ/test-tmp/rpc-test-2ba5fbb3f79b47f593a9f81adb342b9c.sock for RPC Sleep timed out after 0.050s (ON_OUTBOUND_QUEUE), seconds elapsed: 0.0505467
[       OK ] Parameters/TestRpc.TestCallTimeoutDoesntAffectNegotiation/SSL_UnixSocket (530 ms)
[ RUN      ] Parameters/TestRpc.TestRpcHandlerLatencyMetric/SSL_UnixSocket
I20260926 14:51:02.354049   700 acceptor_pool.cc:254] collecting diagnostics on the listening RPC socket unix:/tmp/dist-test-taskdT70nJ/test-tmp/rpc-test-d385b5e2109e4419b34f8adbbadafca0.sock every 8 connection(s)
I20260926 14:51:02.354084   701 acceptor_pool.cc:254] collecting diagnostics on the listening RPC socket unix:/tmp/dist-test-taskdT70nJ/test-tmp/rpc-test-d385b5e2109e4419b34f8adbbadafca0.sock every 8 connection(s)
I20260926 14:51:02.394568   383 rpc-test.cc:1236] Sleep() min lat: 20260
I20260926 14:51:02.394636   383 rpc-test.cc:1237] Sleep() mean lat: 20260
I20260926 14:51:02.394663   383 rpc-test.cc:1238] Sleep() max lat: 20260
I20260926 14:51:02.394676   383 rpc-test.cc:1239] Sleep() #calls: 1
[       OK ] Parameters/TestRpc.TestRpcHandlerLatencyMetric/SSL_UnixSocket (56 ms)
[ RUN      ] Parameters/TestRpc.TimedOutOnResponseMetricServiceQueue/SSL_UnixSocket
I20260926 14:51:02.411422   726 acceptor_pool.cc:254] collecting diagnostics on the listening RPC socket unix:/tmp/dist-test-taskdT70nJ/test-tmp/rpc-test-f64181e339ef424698e5660a2ec74bca.sock every 8 connection(s)
I20260926 14:51:02.411490   727 acceptor_pool.cc:254] collecting diagnostics on the listening RPC socket unix:/tmp/dist-test-taskdT70nJ/test-tmp/rpc-test-f64181e339ef424698e5660a2ec74bca.sock every 8 connection(s)
W20260926 14:51:02.474118   728 rpcz_store.cc:267] Call kudu.rpc_test.CalculatorService.Sleep from unix:<unnamed> (request call id 2) took 20 ms (client timeout 20 ms). Trace:
W20260926 14:51:02.474220   728 rpcz_store.cc:269] 0926 14:51:02.453890 (+     0us) service_pool.cc:170] Inserting onto call queue
0926 14:51:02.474095 (+ 20205us) service_pool.cc:214] Skipping call since client already timed out
0926 14:51:02.474103 (+     8us) inbound_call.cc:173] Queueing failure response
Metrics: {}
[       OK ] Parameters/TestRpc.TimedOutOnResponseMetricServiceQueue/SSL_UnixSocket (79 ms)
[ RUN      ] Parameters/TestRpc.RpcPendingConnectionsMetric/SSL_UnixSocket
I20260926 14:51:02.477645   749 acceptor_pool.cc:254] collecting diagnostics on the listening RPC socket 0.0.0.0:38579 every 8 connection(s)
I20260926 14:51:02.477703   750 acceptor_pool.cc:254] collecting diagnostics on the listening RPC socket 0.0.0.0:38579 every 8 connection(s)
W20260926 14:51:02.486758   745 negotiation.cc:337] Failed RPC negotiation. Trace:
0926 14:51:02.486451 (+     0us) reactor.cc:625] Submitting negotiation task for server connection from 127.0.0.1:56746 (local address 127.0.0.1:38579)
0926 14:51:02.486532 (+    81us) server_negotiation.cc:206] Beginning negotiation
0926 14:51:02.486534 (+     2us) server_negotiation.cc:399] Waiting for connection header
0926 14:51:02.486641 (+   107us) negotiation.cc:327] Negotiation complete: Network error: Server connection negotiation failed: server connection from 127.0.0.1:56746: BlockingRecv error: recv got EOF from 127.0.0.1:56746 (error 108)
Metrics: {"server-negotiator.queue_time_us":20}
[       OK ] Parameters/TestRpc.RpcPendingConnectionsMetric/SSL_UnixSocket (21 ms)
[ RUN      ] Parameters/TestRpc.TestRpcContextClientDeadline/SSL_UnixSocket
I20260926 14:51:02.509532   766 acceptor_pool.cc:254] collecting diagnostics on the listening RPC socket unix:/tmp/dist-test-taskdT70nJ/test-tmp/rpc-test-8505b7666d02438dbc025cd06adc0bf7.sock every 8 connection(s)
I20260926 14:51:02.509542   765 acceptor_pool.cc:254] collecting diagnostics on the listening RPC socket unix:/tmp/dist-test-taskdT70nJ/test-tmp/rpc-test-8505b7666d02438dbc025cd06adc0bf7.sock every 8 connection(s)
W20260926 14:51:02.547176   762 connection.cc:196] Error closing socket: Network error: TlsSocket::Close: Broken pipe
[       OK ] Parameters/TestRpc.TestRpcContextClientDeadline/SSL_UnixSocket (50 ms)
[ RUN      ] Parameters/TestRpc.TestApplicationFeatureFlagUnsupportedServer/SSL_UnixSocket
I20260926 14:51:02.562140   790 acceptor_pool.cc:254] collecting diagnostics on the listening RPC socket unix:/tmp/dist-test-taskdT70nJ/test-tmp/rpc-test-9c8e27ee9bb146c48ae6027cb5860024.sock every 8 connection(s)
I20260926 14:51:02.562173   791 acceptor_pool.cc:254] collecting diagnostics on the listening RPC socket unix:/tmp/dist-test-taskdT70nJ/test-tmp/rpc-test-9c8e27ee9bb146c48ae6027cb5860024.sock every 8 connection(s)
W20260926 14:51:02.573770   787 connection.cc:196] Error closing socket: Network error: TlsSocket::Close: Broken pipe
[       OK ] Parameters/TestRpc.TestApplicationFeatureFlagUnsupportedServer/SSL_UnixSocket (26 ms)
[ RUN      ] Parameters/TestRpc.TestCancellationAsync/SSL_UnixSocket
I20260926 14:51:02.605347   815 acceptor_pool.cc:254] collecting diagnostics on the listening RPC socket unix:/tmp/dist-test-taskdT70nJ/test-tmp/rpc-test-989b976d2c734d3da485940aaa3e55f9.sock every 8 connection(s)
I20260926 14:51:02.605389   816 acceptor_pool.cc:254] collecting diagnostics on the listening RPC socket unix:/tmp/dist-test-taskdT70nJ/test-tmp/rpc-test-989b976d2c734d3da485940aaa3e55f9.sock every 8 connection(s)
I20260926 14:51:02.605533   383 rpc-test.cc:1716] Connecting to unix:/tmp/dist-test-taskdT70nJ/test-tmp/rpc-test-989b976d2c734d3da485940aaa3e55f9.sock
I20260926 14:51:02.619853   383 test_util.cc:268] Using random seed: -164129078
I20260926 14:51:02.636695   817 rpc-test-base.h:240] got call: sleep_micros: 500 pattern: 4294967295 num_repetitions: 2097152 sidecar_idx: 0
I20260926 14:51:02.649673   817 rpc-test-base.h:240] got call: sleep_micros: 500 pattern: 4294967295 num_repetitions: 2097152 sidecar_idx: 0
I20260926 14:51:02.661787   817 rpc-test-base.h:240] got call: sleep_micros: 500 pattern: 4294967295 num_repetitions: 2097152 sidecar_idx: 0
I20260926 14:51:02.672225   817 rpc-test-base.h:240] got call: sleep_micros: 500 pattern: 4294967295 num_repetitions: 2097152 sidecar_idx: 0
I20260926 14:51:02.682572   817 rpc-test-base.h:240] got call: sleep_micros: 500 pattern: 4294967295 num_repetitions: 2097152 sidecar_idx: 0
I20260926 14:51:02.692870   817 rpc-test-base.h:240] got call: sleep_micros: 500 pattern: 4294967295 num_repetitions: 2097152 sidecar_idx: 0
I20260926 14:51:02.703562   817 rpc-test-base.h:240] got call: sleep_micros: 500 pattern: 4294967295 num_repetitions: 2097152 sidecar_idx: 0
I20260926 14:51:02.713539   817 rpc-test-base.h:240] got call: sleep_micros: 500 pattern: 4294967295 num_repetitions: 2097152 sidecar_idx: 0
W20260926 14:51:02.714846   812 connection.cc:196] Error closing socket: Network error: TlsSocket::Close: Broken pipe
W20260926 14:51:02.716609   812 connection.cc:441] server connection from unix:<unnamed> torn down before Call kudu.rpc.GenericCalculatorService.SleepWithSidecar from unix:<unnamed> (request call id 9) could send its response
[       OK ] Parameters/TestRpc.TestCancellationAsync/SSL_UnixSocket (142 ms)
[ RUN      ] Parameters/TestRpc.TestPerformanceBySocketType/SSL_UnixSocket
I20260926 14:51:02.739660   840 acceptor_pool.cc:254] collecting diagnostics on the listening RPC socket unix:/tmp/dist-test-taskdT70nJ/test-tmp/rpc-test-197283664fa54400ba9f7089c3d7ee5e.sock every 8 connection(s)
I20260926 14:51:02.739713   841 acceptor_pool.cc:254] collecting diagnostics on the listening RPC socket unix:/tmp/dist-test-taskdT70nJ/test-tmp/rpc-test-197283664fa54400ba9f7089c3d7ee5e.sock every 8 connection(s)
I20260926 14:51:02.739892   383 rpc-test.cc:1846] Connecting to unix:/tmp/dist-test-taskdT70nJ/test-tmp/rpc-test-197283664fa54400ba9f7089c3d7ee5e.sock
I20260926 14:51:03.968648   383 rpc-test.cc:1859] Sending 1024MB via ssl-enabled unix socket: real 1.218s	user 1.330s	sys 0.887s
I20260926 14:51:05.154299   383 rpc-test.cc:1859] Sending 1024MB via ssl-enabled unix socket: real 1.186s	user 1.245s	sys 0.908s
I20260926 14:51:06.356994   383 rpc-test.cc:1859] Sending 1024MB via ssl-enabled unix socket: real 1.203s	user 1.408s	sys 0.774s
I20260926 14:51:07.495667   383 rpc-test.cc:1859] Sending 1024MB via ssl-enabled unix socket: real 1.139s	user 1.262s	sys 0.814s
I20260926 14:51:08.668395   383 rpc-test.cc:1859] Sending 1024MB via ssl-enabled unix socket: real 1.173s	user 1.243s	sys 0.886s
[       OK ] Parameters/TestRpc.TestPerformanceBySocketType/SSL_UnixSocket (5952 ms)
[----------] 20 tests from Parameters/TestRpc (25893 ms total)

[----------] 1 test from Parameters/TestRpcSocketTxRxQueue
[ RUN      ] Parameters/TestRpcSocketTxRxQueue.AcceptorRxQueueSizeMetric/0
I20260926 14:51:08.675352   865 acceptor_pool.cc:254] collecting diagnostics on the listening RPC socket 0.0.0.0:43257 every 1 connection(s)
I20260926 14:51:08.675426   866 acceptor_pool.cc:254] collecting diagnostics on the listening RPC socket 0.0.0.0:43257 every 1 connection(s)
W20260926 14:51:08.675935   859 negotiation.cc:337] Failed RPC negotiation. Trace:
0926 14:51:08.675793 (+     0us) reactor.cc:625] Submitting negotiation task for server connection from 127.0.0.1:52470 (local address 127.0.0.1:43257)
0926 14:51:08.675833 (+    40us) server_negotiation.cc:206] Beginning negotiation
0926 14:51:08.675834 (+     1us) server_negotiation.cc:399] Waiting for connection header
0926 14:51:08.675899 (+    65us) negotiation.cc:327] Negotiation complete: Network error: Server connection negotiation failed: server connection from 127.0.0.1:52470: BlockingRecv error: recv got EOF from 127.0.0.1:52470 (error 108)
Metrics: {"server-negotiator.queue_time_us":13}
[       OK ] Parameters/TestRpcSocketTxRxQueue.AcceptorRxQueueSizeMetric/0 (7 ms)
[----------] 1 test from Parameters/TestRpcSocketTxRxQueue (7 ms total)

[----------] Global test environment tear-down
[==========] 21 tests from 2 test suites ran. (25901 ms total)
[  PASSED  ] 20 tests.
[  FAILED  ] 1 test, listed below:
[  FAILED  ] Parameters/TestRpc.TestCallWithChainCertAndChainCA/SSL_UnixSocket, where GetParam() = (true, true)

 1 FAILED TEST