Diagnosed failure

Parameters/TestRpc.TestCallWithChainCertAndChainCA/SSL_UnixSocket: /data0/somelongdirectorytoavoidrpathissues/src/kudu/src/kudu/rpc/rpc-test.cc:270: Failure
Failed
Bad status: Runtime error: could not verify certificate chain (error with cert: subject=CN = localhost, ST = sadfjas, C = AS, emailAddress = sdflkdsajf, O = lskdfjlsad, OU = sldfkja, issuer=C = AS, ST = ASDfkjdhf, L = lskdjf, O = saldfja, OU = skdjf, CN = localhost, emailAddress = sadjflkadsj): : certificate has expired
Google Test trace:
/data0/somelongdirectorytoavoidrpathissues/src/kudu/src/kudu/rpc/rpc-test.cc:267: Connecting to unix:/tmp/dist-test-task9iti7h/test-tmp/rpc-test-1337bef4e7fd431eb8adf37e0d57053a.sock
I20260928 14:55:26.467939  7823 test_util.cc:175] -----------------------------------------------
I20260928 14:55:26.468000  7823 test_util.cc:176] Had fatal failures, leaving test files at /tmp/dist-test-task9iti7h/test-tmp/rpc-test.6.Parameters_TestRpc.TestCallWithChainCertAndChainCA_SSL_UnixSocket.1790607326394664-7823-0

Full log

Note: This is test shard 7 of 8.
[==========] Running 21 tests from 2 test suites.
[----------] Global test environment set-up.
[----------] 20 tests from Parameters/TestRpc
[ RUN      ] Parameters/TestRpc.TestMessengerCreateDestroy/SSL_UnixSocket
WARNING: Logging before InitGoogleLogging() is written to STDERR
I20260928 14:55:26.425624  7823 rpc-test.cc:169] started messenger TestCreateDestroy
[       OK ] Parameters/TestRpc.TestMessengerCreateDestroy/SSL_UnixSocket (29 ms)
[ RUN      ] Parameters/TestRpc.TestNegotiationDeadlock/SSL_UnixSocket
I20260928 14:55:26.439054  7843 acceptor_pool.cc:254] collecting diagnostics on the listening RPC socket unix:/tmp/dist-test-task9iti7h/test-tmp/rpc-test-35569580c02f4ef987ab35c0925af5a1.sock every 8 connection(s)
I20260928 14:55:26.439062  7844 acceptor_pool.cc:254] collecting diagnostics on the listening RPC socket unix:/tmp/dist-test-task9iti7h/test-tmp/rpc-test-35569580c02f4ef987ab35c0925af5a1.sock every 8 connection(s)
[       OK ] Parameters/TestRpc.TestNegotiationDeadlock/SSL_UnixSocket (19 ms)
[ RUN      ] Parameters/TestRpc.TestCallWithChainCertAndChainCA/SSL_UnixSocket
I20260928 14:55:26.463353  7859 acceptor_pool.cc:254] collecting diagnostics on the listening RPC socket unix:/tmp/dist-test-task9iti7h/test-tmp/rpc-test-1337bef4e7fd431eb8adf37e0d57053a.sock every 8 connection(s)
I20260928 14:55:26.463446  7860 acceptor_pool.cc:254] collecting diagnostics on the listening RPC socket unix:/tmp/dist-test-task9iti7h/test-tmp/rpc-test-1337bef4e7fd431eb8adf37e0d57053a.sock every 8 connection(s)
/data0/somelongdirectorytoavoidrpathissues/src/kudu/src/kudu/rpc/rpc-test.cc:270: Failure
Failed
Bad status: Runtime error: could not verify certificate chain (error with cert: subject=CN = localhost, ST = sadfjas, C = AS, emailAddress = sdflkdsajf, O = lskdfjlsad, OU = sldfkja, issuer=C = AS, ST = ASDfkjdhf, L = lskdjf, O = saldfja, OU = skdjf, CN = localhost, emailAddress = sadjflkadsj): : certificate has expired
Google Test trace:
/data0/somelongdirectorytoavoidrpathissues/src/kudu/src/kudu/rpc/rpc-test.cc:267: Connecting to unix:/tmp/dist-test-task9iti7h/test-tmp/rpc-test-1337bef4e7fd431eb8adf37e0d57053a.sock
I20260928 14:55:26.467939  7823 test_util.cc:175] -----------------------------------------------
I20260928 14:55:26.468000  7823 test_util.cc:176] Had fatal failures, leaving test files at /tmp/dist-test-task9iti7h/test-tmp/rpc-test.6.Parameters_TestRpc.TestCallWithChainCertAndChainCA_SSL_UnixSocket.1790607326394664-7823-0
[  FAILED  ] Parameters/TestRpc.TestCallWithChainCertAndChainCA/SSL_UnixSocket, where GetParam() = (true, true) (21 ms)
[ RUN      ] Parameters/TestRpc.TestCallWithPasswordProtectedKey/SSL_UnixSocket
I20260928 14:55:26.484521  7884 acceptor_pool.cc:254] collecting diagnostics on the listening RPC socket unix:/tmp/dist-test-task9iti7h/test-tmp/rpc-test-92519bb95b03442a9635f4a9fe23b917.sock every 8 connection(s)
I20260928 14:55:26.484535  7885 acceptor_pool.cc:254] collecting diagnostics on the listening RPC socket unix:/tmp/dist-test-task9iti7h/test-tmp/rpc-test-92519bb95b03442a9635f4a9fe23b917.sock every 8 connection(s)
W20260928 14:55:26.496483  7881 connection.cc:196] Error closing socket: Network error: TlsSocket::Close: Broken pipe
[       OK ] Parameters/TestRpc.TestCallWithPasswordProtectedKey/SSL_UnixSocket (29 ms)
[ RUN      ] Parameters/TestRpc.TestCallToBadServer/SSL_UnixSocket
I20260928 14:55:26.506496  7823 rpc-test.cc:394] Status: Network error: Client connection negotiation failed: client connection to 0.0.0.0:0: connect: Connection refused (error 111)
I20260928 14:55:26.506973  7823 rpc-test.cc:394] Status: Network error: Client connection negotiation failed: client connection to 0.0.0.0:0: connect: Connection refused (error 111)
I20260928 14:55:26.507345  7823 rpc-test.cc:394] Status: Network error: Client connection negotiation failed: client connection to 0.0.0.0:0: connect: Connection refused (error 111)
I20260928 14:55:26.507665  7823 rpc-test.cc:394] Status: Network error: Client connection negotiation failed: client connection to 0.0.0.0:0: connect: Connection refused (error 111)
I20260928 14:55:26.507931  7823 rpc-test.cc:394] Status: Network error: Client connection negotiation failed: client connection to 0.0.0.0:0: connect: Connection refused (error 111)
[       OK ] Parameters/TestRpc.TestCallToBadServer/SSL_UnixSocket (10 ms)
[ RUN      ] Parameters/TestRpc.TestWrongService/SSL_UnixSocket
I20260928 14:55:26.513953  7920 acceptor_pool.cc:254] collecting diagnostics on the listening RPC socket unix:/tmp/dist-test-task9iti7h/test-tmp/rpc-test-4f67b7afe27e479f9cb7bd60e78dfad0.sock every 8 connection(s)
I20260928 14:55:26.513953  7919 acceptor_pool.cc:254] collecting diagnostics on the listening RPC socket unix:/tmp/dist-test-task9iti7h/test-tmp/rpc-test-4f67b7afe27e479f9cb7bd60e78dfad0.sock every 8 connection(s)
I20260928 14:55:26.533212  7916 messenger.cc:345] service WrongServiceName not registered on TestServer
[       OK ] Parameters/TestRpc.TestWrongService/SSL_UnixSocket (26 ms)
[ RUN      ] Parameters/TestRpc.TestConnectionKeepalive/SSL_UnixSocket
I20260928 14:55:26.553244  7942 acceptor_pool.cc:254] collecting diagnostics on the listening RPC socket unix:/tmp/dist-test-task9iti7h/test-tmp/rpc-test-62ea773e333d4da3b257f7896be11913.sock every 8 connection(s)
I20260928 14:55:26.553292  7943 acceptor_pool.cc:254] collecting diagnostics on the listening RPC socket unix:/tmp/dist-test-task9iti7h/test-tmp/rpc-test-62ea773e333d4da3b257f7896be11913.sock every 8 connection(s)
I20260928 14:55:26.553452  7823 rpc-test.cc:488] Connecting to unix:/tmp/dist-test-task9iti7h/test-tmp/rpc-test-62ea773e333d4da3b257f7896be11913.sock
W20260928 14:55:27.036164  7955 connection.cc:196] Error closing socket: Network error: TlsSocket::Close: Broken pipe
[       OK ] Parameters/TestRpc.TestConnectionKeepalive/SSL_UnixSocket (1051 ms)
[ RUN      ] Parameters/TestRpc.TestClientConnectionMetrics/SSL_UnixSocket
I20260928 14:55:27.602166  7967 acceptor_pool.cc:254] collecting diagnostics on the listening RPC socket unix:/tmp/dist-test-task9iti7h/test-tmp/rpc-test-fa76dfe9fc5c43c5a2aa06ba24307239.sock every 8 connection(s)
I20260928 14:55:27.602209  7968 acceptor_pool.cc:254] collecting diagnostics on the listening RPC socket unix:/tmp/dist-test-task9iti7h/test-tmp/rpc-test-fa76dfe9fc5c43c5a2aa06ba24307239.sock every 8 connection(s)
I20260928 14:55:27.602408  7823 rpc-test.cc:569] Connecting to unix:/tmp/dist-test-task9iti7h/test-tmp/rpc-test-fa76dfe9fc5c43c5a2aa06ba24307239.sock
W20260928 14:55:36.390378  7964 connection.cc:196] Error closing socket: Network error: TlsSocket::Close: Broken pipe
[       OK ] Parameters/TestRpc.TestClientConnectionMetrics/SSL_UnixSocket (8804 ms)
[ RUN      ] Parameters/TestRpc.TestCredentialsPolicy/SSL_UnixSocket
I20260928 14:55:36.408789  7991 acceptor_pool.cc:254] collecting diagnostics on the listening RPC socket unix:/tmp/dist-test-task9iti7h/test-tmp/rpc-test-75546ab63c0b44d79dc8cf96d072fce9.sock every 8 connection(s)
I20260928 14:55:36.408746  7990 acceptor_pool.cc:254] collecting diagnostics on the listening RPC socket unix:/tmp/dist-test-task9iti7h/test-tmp/rpc-test-75546ab63c0b44d79dc8cf96d072fce9.sock every 8 connection(s)
I20260928 14:55:36.408993  7823 rpc-test.cc:700] Connecting to unix:/tmp/dist-test-task9iti7h/test-tmp/rpc-test-75546ab63c0b44d79dc8cf96d072fce9.sock
W20260928 14:55:36.423527  7989 connection.cc:196] Error closing socket: Network error: TlsSocket::Close: Broken pipe
W20260928 14:55:36.427425  7989 connection.cc:196] Error closing socket: Network error: TlsSocket::Close: Broken pipe
[       OK ] Parameters/TestRpc.TestCredentialsPolicy/SSL_UnixSocket (36 ms)
[ RUN      ] Parameters/TestRpc.TestCallLongerThanKeepalive/SSL_UnixSocket
I20260928 14:55:36.443858  8015 acceptor_pool.cc:254] collecting diagnostics on the listening RPC socket unix:/tmp/dist-test-task9iti7h/test-tmp/rpc-test-f90b11feecaf4af58e749d3fbc387436.sock every 8 connection(s)
I20260928 14:55:36.443903  8016 acceptor_pool.cc:254] collecting diagnostics on the listening RPC socket unix:/tmp/dist-test-task9iti7h/test-tmp/rpc-test-f90b11feecaf4af58e749d3fbc387436.sock every 8 connection(s)
I20260928 14:55:36.457576  8019 rpc-test-base.h:222] got call: sleep_micros: 3000000 deferred: true
I20260928 14:55:39.458273  8019 rpcz_store.cc:275] Call kudu.rpc.GenericCalculatorService.Sleep from unix:<unnamed> (request call id 0) took 3000 ms. Trace:
I20260928 14:55:39.458377  8019 rpcz_store.cc:276] 0928 14:55:36.457505 (+     0us) service_pool.cc:170] Inserting onto call queue
0928 14:55:36.457542 (+    37us) service_pool.cc:227] Handling call
0928 14:55:39.458256 (+3000714us) inbound_call.cc:173] Queueing success response
Metrics: {}
W20260928 14:55:39.459452  8012 connection.cc:196] Error closing socket: Network error: TlsSocket::Close: Broken pipe
[       OK ] Parameters/TestRpc.TestCallLongerThanKeepalive/SSL_UnixSocket (3032 ms)
[ RUN      ] Parameters/TestRpc.TestRpcSidecar/SSL_UnixSocket
I20260928 14:55:39.476117  8040 acceptor_pool.cc:254] collecting diagnostics on the listening RPC socket unix:/tmp/dist-test-task9iti7h/test-tmp/rpc-test-52e363e28c874e0d8e6e860930c94ca0.sock every 8 connection(s)
I20260928 14:55:39.476162  8041 acceptor_pool.cc:254] collecting diagnostics on the listening RPC socket unix:/tmp/dist-test-task9iti7h/test-tmp/rpc-test-52e363e28c874e0d8e6e860930c94ca0.sock every 8 connection(s)
W20260928 14:55:39.519783  8037 connection.cc:196] Error closing socket: Network error: TlsSocket::Close: Broken pipe
[       OK ] Parameters/TestRpc.TestRpcSidecar/SSL_UnixSocket (59 ms)
[ RUN      ] Parameters/TestRpc.TestRpcSidecarLimits/SSL_UnixSocket
I20260928 14:55:41.917363  8065 acceptor_pool.cc:254] collecting diagnostics on the listening RPC socket unix:/tmp/dist-test-task9iti7h/test-tmp/rpc-test-06eb5f70e0b34260a494cfe3a7effc9b.sock every 8 connection(s)
I20260928 14:55:41.917395  8066 acceptor_pool.cc:254] collecting diagnostics on the listening RPC socket unix:/tmp/dist-test-task9iti7h/test-tmp/rpc-test-06eb5f70e0b34260a494cfe3a7effc9b.sock every 8 connection(s)
W20260928 14:55:41.936120  7823 serialization.cc:72] Serialized kudu.rpc_test.PushStringsRequestPB (2147483654 bytes) is larger than the maximum configured RPC message size (52428800 bytes). Sending anyway, but peer may reject the data.
W20260928 14:55:41.940059  8062 connection.cc:535] server connection from unix:<unnamed> recv error: Network error: RPC frame had a length of 2147483714, but we only support messages up to 52428800 bytes long.
W20260928 14:55:41.940121  8062 connection.cc:158] shutting down server connection from unix:<unnamed> with pending inbound data: 4/2147483714 bytes received; last active 0 ns ago: status Network error: RPC frame had a length of 2147483714, but we only support messages up to 52428800 bytes long.
W20260928 14:55:41.940251  8078 connection.cc:698] client connection to unix:/tmp/dist-test-task9iti7h/test-tmp/rpc-test-06eb5f70e0b34260a494cfe3a7effc9b.sock send error: Network error: failed to write to TLS socket: Broken pipe
W20260928 14:55:41.940399  8078 connection.cc:196] Error closing socket: Network error: TlsSocket::Close: Success
I20260928 14:55:41.949319  8090 acceptor_pool.cc:254] collecting diagnostics on the listening RPC socket unix:/tmp/dist-test-task9iti7h/test-tmp/rpc-test-06eb5f70e0b34260a494cfe3a7effc9b.sock every 8 connection(s)
I20260928 14:55:41.949340  8091 acceptor_pool.cc:254] collecting diagnostics on the listening RPC socket unix:/tmp/dist-test-task9iti7h/test-tmp/rpc-test-06eb5f70e0b34260a494cfe3a7effc9b.sock every 8 connection(s)
W20260928 14:55:47.880013  8087 connection.cc:577] server connection from unix:<unnamed>: received bad data: 'Corruption: Invalid packet: message had a length of 2147483710, but we only support messages up to 2147483647 bytes
'
W20260928 14:55:47.880371  8103 connection.cc:196] Error closing socket: Network error: TlsSocket::Close: Broken pipe
[       OK ] Parameters/TestRpc.TestRpcSidecarLimits/SSL_UnixSocket (8361 ms)
[ RUN      ] Parameters/TestRpc.TestCallTimeoutDoesntAffectNegotiation/SSL_UnixSocket
I20260928 14:55:47.906442  8115 acceptor_pool.cc:254] collecting diagnostics on the listening RPC socket unix:/tmp/dist-test-task9iti7h/test-tmp/rpc-test-dd0d134614cf43c29b4788d4b87da303.sock every 8 connection(s)
I20260928 14:55:47.906473  8116 acceptor_pool.cc:254] collecting diagnostics on the listening RPC socket unix:/tmp/dist-test-task9iti7h/test-tmp/rpc-test-dd0d134614cf43c29b4788d4b87da303.sock every 8 connection(s)
W20260928 14:55:47.912132  8111 negotiation.cc:266] Injecting 500ms delay in negotiation
I20260928 14:55:47.962409  7823 rpc-test-base.h:595] status: Timed out: connection negotiation to unix:/tmp/dist-test-task9iti7h/test-tmp/rpc-test-dd0d134614cf43c29b4788d4b87da303.sock for RPC Sleep timed out after 0.050s (ON_OUTBOUND_QUEUE), seconds elapsed: 0.0506368
[       OK ] Parameters/TestRpc.TestCallTimeoutDoesntAffectNegotiation/SSL_UnixSocket (535 ms)
[ RUN      ] Parameters/TestRpc.TestRpcHandlerLatencyMetric/SSL_UnixSocket
I20260928 14:55:48.424906  8140 acceptor_pool.cc:254] collecting diagnostics on the listening RPC socket unix:/tmp/dist-test-task9iti7h/test-tmp/rpc-test-f01403b4fa0242e1bafeaf14044cd5d0.sock every 8 connection(s)
I20260928 14:55:48.425010  8141 acceptor_pool.cc:254] collecting diagnostics on the listening RPC socket unix:/tmp/dist-test-task9iti7h/test-tmp/rpc-test-f01403b4fa0242e1bafeaf14044cd5d0.sock every 8 connection(s)
I20260928 14:55:48.468065  7823 rpc-test.cc:1236] Sleep() min lat: 20366
I20260928 14:55:48.468145  7823 rpc-test.cc:1237] Sleep() mean lat: 20366
I20260928 14:55:48.468176  7823 rpc-test.cc:1238] Sleep() max lat: 20366
I20260928 14:55:48.468191  7823 rpc-test.cc:1239] Sleep() #calls: 1
[       OK ] Parameters/TestRpc.TestRpcHandlerLatencyMetric/SSL_UnixSocket (51 ms)
[ RUN      ] Parameters/TestRpc.TimedOutOnResponseMetricServiceQueue/SSL_UnixSocket
I20260928 14:55:48.480160  8167 acceptor_pool.cc:254] collecting diagnostics on the listening RPC socket unix:/tmp/dist-test-task9iti7h/test-tmp/rpc-test-79a10f381b0a49dbb5af6ae3a3cbfd61.sock every 8 connection(s)
I20260928 14:55:48.480201  8166 acceptor_pool.cc:254] collecting diagnostics on the listening RPC socket unix:/tmp/dist-test-task9iti7h/test-tmp/rpc-test-79a10f381b0a49dbb5af6ae3a3cbfd61.sock every 8 connection(s)
W20260928 14:55:48.542495  8168 rpcz_store.cc:267] Call kudu.rpc_test.CalculatorService.Sleep from unix:<unnamed> (request call id 2) took 20 ms (client timeout 20 ms). Trace:
W20260928 14:55:48.542646  8168 rpcz_store.cc:269] 0928 14:55:48.522196 (+     0us) service_pool.cc:170] Inserting onto call queue
0928 14:55:48.542467 (+ 20271us) service_pool.cc:214] Skipping call since client already timed out
0928 14:55:48.542478 (+    11us) inbound_call.cc:173] Queueing failure response
Metrics: {}
[       OK ] Parameters/TestRpc.TimedOutOnResponseMetricServiceQueue/SSL_UnixSocket (74 ms)
[ RUN      ] Parameters/TestRpc.RpcPendingConnectionsMetric/SSL_UnixSocket
I20260928 14:55:48.546051  8189 acceptor_pool.cc:254] collecting diagnostics on the listening RPC socket 0.0.0.0:35107 every 8 connection(s)
I20260928 14:55:48.546101  8190 acceptor_pool.cc:254] collecting diagnostics on the listening RPC socket 0.0.0.0:35107 every 8 connection(s)
W20260928 14:55:48.546694  8185 negotiation.cc:337] Failed RPC negotiation. Trace:
0928 14:55:48.546545 (+     0us) reactor.cc:625] Submitting negotiation task for server connection from 127.0.0.1:59220 (local address 127.0.0.1:35107)
0928 14:55:48.546593 (+    48us) server_negotiation.cc:206] Beginning negotiation
0928 14:55:48.546595 (+     2us) server_negotiation.cc:399] Waiting for connection header
0928 14:55:48.546647 (+    52us) negotiation.cc:327] Negotiation complete: Network error: Server connection negotiation failed: server connection from 127.0.0.1:59220: BlockingRecv error: recv got EOF from 127.0.0.1:59220 (error 108)
Metrics: {"server-negotiator.queue_time_us":21}
[       OK ] Parameters/TestRpc.RpcPendingConnectionsMetric/SSL_UnixSocket (13 ms)
[ RUN      ] Parameters/TestRpc.TestRpcContextClientDeadline/SSL_UnixSocket
I20260928 14:55:48.568107  8205 acceptor_pool.cc:254] collecting diagnostics on the listening RPC socket unix:/tmp/dist-test-task9iti7h/test-tmp/rpc-test-be6de558cf0743bdbcd423d0f5d1a30a.sock every 8 connection(s)
I20260928 14:55:48.568162  8206 acceptor_pool.cc:254] collecting diagnostics on the listening RPC socket unix:/tmp/dist-test-task9iti7h/test-tmp/rpc-test-be6de558cf0743bdbcd423d0f5d1a30a.sock every 8 connection(s)
W20260928 14:55:48.608295  8202 connection.cc:196] Error closing socket: Network error: TlsSocket::Close: Broken pipe
[       OK ] Parameters/TestRpc.TestRpcContextClientDeadline/SSL_UnixSocket (51 ms)
[ RUN      ] Parameters/TestRpc.TestApplicationFeatureFlagUnsupportedServer/SSL_UnixSocket
I20260928 14:55:48.616976  8230 acceptor_pool.cc:254] collecting diagnostics on the listening RPC socket unix:/tmp/dist-test-task9iti7h/test-tmp/rpc-test-6331ad1e79f547dc9a2a2d5e7de9c422.sock every 8 connection(s)
I20260928 14:55:48.616997  8231 acceptor_pool.cc:254] collecting diagnostics on the listening RPC socket unix:/tmp/dist-test-task9iti7h/test-tmp/rpc-test-6331ad1e79f547dc9a2a2d5e7de9c422.sock every 8 connection(s)
[       OK ] Parameters/TestRpc.TestApplicationFeatureFlagUnsupportedServer/SSL_UnixSocket (21 ms)
[ RUN      ] Parameters/TestRpc.TestCancellationAsync/SSL_UnixSocket
I20260928 14:55:48.641698  8255 acceptor_pool.cc:254] collecting diagnostics on the listening RPC socket unix:/tmp/dist-test-task9iti7h/test-tmp/rpc-test-b041557a1cfb4f63bf2c95dc52f5d48b.sock every 8 connection(s)
I20260928 14:55:48.641719  8256 acceptor_pool.cc:254] collecting diagnostics on the listening RPC socket unix:/tmp/dist-test-task9iti7h/test-tmp/rpc-test-b041557a1cfb4f63bf2c95dc52f5d48b.sock every 8 connection(s)
I20260928 14:55:48.641952  7823 rpc-test.cc:1716] Connecting to unix:/tmp/dist-test-task9iti7h/test-tmp/rpc-test-b041557a1cfb4f63bf2c95dc52f5d48b.sock
I20260928 14:55:48.648324  7823 test_util.cc:268] Using random seed: 1123207553
I20260928 14:55:48.664983  8259 rpc-test-base.h:240] got call: sleep_micros: 500 pattern: 4294967295 num_repetitions: 2097152 sidecar_idx: 0
I20260928 14:55:48.676642  8259 rpc-test-base.h:240] got call: sleep_micros: 500 pattern: 4294967295 num_repetitions: 2097152 sidecar_idx: 0
I20260928 14:55:48.687740  8259 rpc-test-base.h:240] got call: sleep_micros: 500 pattern: 4294967295 num_repetitions: 2097152 sidecar_idx: 0
I20260928 14:55:48.699661  8259 rpc-test-base.h:240] got call: sleep_micros: 500 pattern: 4294967295 num_repetitions: 2097152 sidecar_idx: 0
I20260928 14:55:48.710862  8259 rpc-test-base.h:240] got call: sleep_micros: 500 pattern: 4294967295 num_repetitions: 2097152 sidecar_idx: 0
I20260928 14:55:48.721789  8259 rpc-test-base.h:240] got call: sleep_micros: 500 pattern: 4294967295 num_repetitions: 2097152 sidecar_idx: 0
I20260928 14:55:48.737447  8259 rpc-test-base.h:240] got call: sleep_micros: 500 pattern: 4294967295 num_repetitions: 2097152 sidecar_idx: 0
I20260928 14:55:48.751307  8259 rpc-test-base.h:240] got call: sleep_micros: 500 pattern: 4294967295 num_repetitions: 2097152 sidecar_idx: 0
W20260928 14:55:48.753821  8252 connection.cc:196] Error closing socket: Network error: TlsSocket::Close: Broken pipe
W20260928 14:55:48.754873  8252 connection.cc:441] server connection from unix:<unnamed> torn down before Call kudu.rpc.GenericCalculatorService.SleepWithSidecar from unix:<unnamed> (request call id 9) could send its response
[       OK ] Parameters/TestRpc.TestCancellationAsync/SSL_UnixSocket (124 ms)
[ RUN      ] Parameters/TestRpc.TestPerformanceBySocketType/SSL_UnixSocket
I20260928 14:55:48.768637  8280 acceptor_pool.cc:254] collecting diagnostics on the listening RPC socket unix:/tmp/dist-test-task9iti7h/test-tmp/rpc-test-852cbf5d175f4120b60bdee2703c5b25.sock every 8 connection(s)
I20260928 14:55:48.768661  8281 acceptor_pool.cc:254] collecting diagnostics on the listening RPC socket unix:/tmp/dist-test-task9iti7h/test-tmp/rpc-test-852cbf5d175f4120b60bdee2703c5b25.sock every 8 connection(s)
I20260928 14:55:48.768880  7823 rpc-test.cc:1846] Connecting to unix:/tmp/dist-test-task9iti7h/test-tmp/rpc-test-852cbf5d175f4120b60bdee2703c5b25.sock
I20260928 14:55:50.177915  7823 rpc-test.cc:1859] Sending 1024MB via ssl-enabled unix socket: real 1.398s	user 1.528s	sys 0.933s
I20260928 14:55:51.672178  7823 rpc-test.cc:1859] Sending 1024MB via ssl-enabled unix socket: real 1.494s	user 1.703s	sys 0.944s
I20260928 14:55:53.059830  7823 rpc-test.cc:1859] Sending 1024MB via ssl-enabled unix socket: real 1.388s	user 1.537s	sys 0.918s
I20260928 14:55:54.432303  7823 rpc-test.cc:1859] Sending 1024MB via ssl-enabled unix socket: real 1.372s	user 1.461s	sys 0.977s
I20260928 14:55:55.803210  7823 rpc-test.cc:1859] Sending 1024MB via ssl-enabled unix socket: real 1.371s	user 1.517s	sys 0.915s
W20260928 14:55:55.803893  8277 connection.cc:196] Error closing socket: Network error: TlsSocket::Close: Broken pipe
[       OK ] Parameters/TestRpc.TestPerformanceBySocketType/SSL_UnixSocket (7048 ms)
[----------] 20 tests from Parameters/TestRpc (29407 ms total)

[----------] 1 test from Parameters/TestRpcSocketTxRxQueue
[ RUN      ] Parameters/TestRpcSocketTxRxQueue.AcceptorRxQueueSizeMetric/0
I20260928 14:55:55.811482  8305 acceptor_pool.cc:254] collecting diagnostics on the listening RPC socket 0.0.0.0:41671 every 1 connection(s)
I20260928 14:55:55.811544  8306 acceptor_pool.cc:254] collecting diagnostics on the listening RPC socket 0.0.0.0:41671 every 1 connection(s)
W20260928 14:55:55.812088  8301 negotiation.cc:337] Failed RPC negotiation. Trace:
0928 14:55:55.811949 (+     0us) reactor.cc:625] Submitting negotiation task for server connection from 127.0.0.1:53808 (local address 127.0.0.1:41671)
0928 14:55:55.811992 (+    43us) server_negotiation.cc:206] Beginning negotiation
0928 14:55:55.811994 (+     2us) server_negotiation.cc:399] Waiting for connection header
0928 14:55:55.812059 (+    65us) negotiation.cc:327] Negotiation complete: Network error: Server connection negotiation failed: server connection from 127.0.0.1:53808: BlockingRecv error: recv got EOF from 127.0.0.1:53808 (error 108)
Metrics: {"server-negotiator.queue_time_us":17}
[       OK ] Parameters/TestRpcSocketTxRxQueue.AcceptorRxQueueSizeMetric/0 (9 ms)
[----------] 1 test from Parameters/TestRpcSocketTxRxQueue (9 ms total)

[----------] Global test environment tear-down
[==========] 21 tests from 2 test suites ran. (29417 ms total)
[  PASSED  ] 20 tests.
[  FAILED  ] 1 test, listed below:
[  FAILED  ] Parameters/TestRpc.TestCallWithChainCertAndChainCA/SSL_UnixSocket, where GetParam() = (true, true)

 1 FAILED TEST