Diagnosed failure

Parameters/TestRpc.TestCallWithChainCertAndChainCA/SSL_TCP: /data0/somelongdirectorytoavoidrpathissues/src/kudu/src/kudu/rpc/rpc-test.cc:270: Failure
Failed
Bad status: Runtime error: could not verify certificate chain (error with cert: subject=CN = localhost, ST = sadfjas, C = AS, emailAddress = sdflkdsajf, O = lskdfjlsad, OU = sldfkja, issuer=C = AS, ST = ASDfkjdhf, L = lskdjf, O = saldfja, OU = skdjf, CN = localhost, emailAddress = sadjflkadsj): : certificate has expired
Google Test trace:
/data0/somelongdirectorytoavoidrpathissues/src/kudu/src/kudu/rpc/rpc-test.cc:267: Connecting to 0.0.0.0:45773
I20260926 14:50:41.423997   383 test_util.cc:175] -----------------------------------------------
I20260926 14:50:41.424049   383 test_util.cc:176] Had fatal failures, leaving test files at /tmp/dist-test-taskBs9f7Q/test-tmp/rpc-test.5.Parameters_TestRpc.TestCallWithChainCertAndChainCA_SSL_TCP.1790434241359449-383-0

Full log

Note: This is test shard 6 of 8.
[==========] Running 21 tests from 2 test suites.
[----------] Global test environment set-up.
[----------] 20 tests from Parameters/TestRpc
[ RUN      ] Parameters/TestRpc.TestMessengerCreateDestroy/SSL_TCP
WARNING: Logging before InitGoogleLogging() is written to STDERR
I20260926 14:50:41.384316   383 rpc-test.cc:169] started messenger TestCreateDestroy
[       OK ] Parameters/TestRpc.TestMessengerCreateDestroy/SSL_TCP (23 ms)
[ RUN      ] Parameters/TestRpc.TestNegotiationDeadlock/SSL_TCP
I20260926 14:50:41.399451   403 acceptor_pool.cc:254] collecting diagnostics on the listening RPC socket 0.0.0.0:39485 every 8 connection(s)
I20260926 14:50:41.399453   404 acceptor_pool.cc:254] collecting diagnostics on the listening RPC socket 0.0.0.0:39485 every 8 connection(s)
[       OK ] Parameters/TestRpc.TestNegotiationDeadlock/SSL_TCP (21 ms)
[ RUN      ] Parameters/TestRpc.TestCallWithChainCertAndChainCA/SSL_TCP
I20260926 14:50:41.420274   419 acceptor_pool.cc:254] collecting diagnostics on the listening RPC socket 0.0.0.0:45773 every 8 connection(s)
I20260926 14:50:41.420302   420 acceptor_pool.cc:254] collecting diagnostics on the listening RPC socket 0.0.0.0:45773 every 8 connection(s)
/data0/somelongdirectorytoavoidrpathissues/src/kudu/src/kudu/rpc/rpc-test.cc:270: Failure
Failed
Bad status: Runtime error: could not verify certificate chain (error with cert: subject=CN = localhost, ST = sadfjas, C = AS, emailAddress = sdflkdsajf, O = lskdfjlsad, OU = sldfkja, issuer=C = AS, ST = ASDfkjdhf, L = lskdjf, O = saldfja, OU = skdjf, CN = localhost, emailAddress = sadjflkadsj): : certificate has expired
Google Test trace:
/data0/somelongdirectorytoavoidrpathissues/src/kudu/src/kudu/rpc/rpc-test.cc:267: Connecting to 0.0.0.0:45773
I20260926 14:50:41.423997   383 test_util.cc:175] -----------------------------------------------
I20260926 14:50:41.424049   383 test_util.cc:176] Had fatal failures, leaving test files at /tmp/dist-test-taskBs9f7Q/test-tmp/rpc-test.5.Parameters_TestRpc.TestCallWithChainCertAndChainCA_SSL_TCP.1790434241359449-383-0
[  FAILED  ] Parameters/TestRpc.TestCallWithChainCertAndChainCA/SSL_TCP, where GetParam() = (true, false) (17 ms)
[ RUN      ] Parameters/TestRpc.TestCallWithPasswordProtectedKey/SSL_TCP
I20260926 14:50:41.432315   444 acceptor_pool.cc:254] collecting diagnostics on the listening RPC socket 0.0.0.0:40509 every 8 connection(s)
I20260926 14:50:41.432335   445 acceptor_pool.cc:254] collecting diagnostics on the listening RPC socket 0.0.0.0:40509 every 8 connection(s)
[       OK ] Parameters/TestRpc.TestCallWithPasswordProtectedKey/SSL_TCP (20 ms)
[ RUN      ] Parameters/TestRpc.TestCallToBadServer/SSL_TCP
I20260926 14:50:41.459138   383 rpc-test.cc:394] Status: Network error: Client connection negotiation failed: client connection to 0.0.0.0:0: connect: Connection refused (error 111)
I20260926 14:50:41.459409   383 rpc-test.cc:394] Status: Network error: Client connection negotiation failed: client connection to 0.0.0.0:0: connect: Connection refused (error 111)
I20260926 14:50:41.459613   383 rpc-test.cc:394] Status: Network error: Client connection negotiation failed: client connection to 0.0.0.0:0: connect: Connection refused (error 111)
I20260926 14:50:41.459796   383 rpc-test.cc:394] Status: Network error: Client connection negotiation failed: client connection to 0.0.0.0:0: connect: Connection refused (error 111)
I20260926 14:50:41.459954   383 rpc-test.cc:394] Status: Network error: Client connection negotiation failed: client connection to 0.0.0.0:0: connect: Connection refused (error 111)
[       OK ] Parameters/TestRpc.TestCallToBadServer/SSL_TCP (15 ms)
[ RUN      ] Parameters/TestRpc.TestWrongService/SSL_TCP
I20260926 14:50:41.468425   479 acceptor_pool.cc:254] collecting diagnostics on the listening RPC socket 0.0.0.0:42347 every 8 connection(s)
I20260926 14:50:41.468459   480 acceptor_pool.cc:254] collecting diagnostics on the listening RPC socket 0.0.0.0:42347 every 8 connection(s)
I20260926 14:50:41.484791   476 messenger.cc:345] service WrongServiceName not registered on TestServer
[       OK ] Parameters/TestRpc.TestWrongService/SSL_TCP (25 ms)
[ RUN      ] Parameters/TestRpc.TestConnectionKeepalive/SSL_TCP
I20260926 14:50:41.491657   502 acceptor_pool.cc:254] collecting diagnostics on the listening RPC socket 0.0.0.0:33987 every 8 connection(s)
I20260926 14:50:41.491701   503 acceptor_pool.cc:254] collecting diagnostics on the listening RPC socket 0.0.0.0:33987 every 8 connection(s)
I20260926 14:50:41.491815   383 rpc-test.cc:488] Connecting to 0.0.0.0:33987
[       OK ] Parameters/TestRpc.TestConnectionKeepalive/SSL_TCP (1030 ms)
[ RUN      ] Parameters/TestRpc.TestClientConnectionMetrics/SSL_TCP
I20260926 14:50:42.524459   527 acceptor_pool.cc:254] collecting diagnostics on the listening RPC socket 0.0.0.0:45675 every 8 connection(s)
I20260926 14:50:42.524498   528 acceptor_pool.cc:254] collecting diagnostics on the listening RPC socket 0.0.0.0:45675 every 8 connection(s)
I20260926 14:50:42.524617   383 rpc-test.cc:569] Connecting to 0.0.0.0:45675
[       OK ] Parameters/TestRpc.TestClientConnectionMetrics/SSL_TCP (7894 ms)
[ RUN      ] Parameters/TestRpc.TestCredentialsPolicy/SSL_TCP
I20260926 14:50:50.436476   550 acceptor_pool.cc:254] collecting diagnostics on the listening RPC socket 0.0.0.0:36533 every 8 connection(s)
I20260926 14:50:50.436517   551 acceptor_pool.cc:254] collecting diagnostics on the listening RPC socket 0.0.0.0:36533 every 8 connection(s)
I20260926 14:50:50.436627   383 rpc-test.cc:700] Connecting to 0.0.0.0:36533
[       OK ] Parameters/TestRpc.TestCredentialsPolicy/SSL_TCP (57 ms)
[ RUN      ] Parameters/TestRpc.TestCallLongerThanKeepalive/SSL_TCP
I20260926 14:50:50.488435   575 acceptor_pool.cc:254] collecting diagnostics on the listening RPC socket 0.0.0.0:43983 every 8 connection(s)
I20260926 14:50:50.488468   576 acceptor_pool.cc:254] collecting diagnostics on the listening RPC socket 0.0.0.0:43983 every 8 connection(s)
I20260926 14:50:50.499467   579 rpc-test-base.h:222] got call: sleep_micros: 3000000 deferred: true
I20260926 14:50:53.500111   579 rpcz_store.cc:275] Call kudu.rpc.GenericCalculatorService.Sleep from 127.0.0.1:54182 (request call id 0) took 3000 ms. Trace:
I20260926 14:50:53.500221   579 rpcz_store.cc:276] 0926 14:50:50.499380 (+     0us) service_pool.cc:170] Inserting onto call queue
0926 14:50:50.499439 (+    59us) service_pool.cc:227] Handling call
0926 14:50:53.500095 (+3000656us) inbound_call.cc:173] Queueing success response
Metrics: {}
[       OK ] Parameters/TestRpc.TestCallLongerThanKeepalive/SSL_TCP (3032 ms)
[ RUN      ] Parameters/TestRpc.TestRpcSidecar/SSL_TCP
I20260926 14:50:53.521206   600 acceptor_pool.cc:254] collecting diagnostics on the listening RPC socket 0.0.0.0:39765 every 8 connection(s)
I20260926 14:50:53.521243   601 acceptor_pool.cc:254] collecting diagnostics on the listening RPC socket 0.0.0.0:39765 every 8 connection(s)
[       OK ] Parameters/TestRpc.TestRpcSidecar/SSL_TCP (65 ms)
[ RUN      ] Parameters/TestRpc.TestRpcSidecarLimits/SSL_TCP
I20260926 14:50:55.238961   625 acceptor_pool.cc:254] collecting diagnostics on the listening RPC socket 0.0.0.0:36263 every 8 connection(s)
I20260926 14:50:55.239001   626 acceptor_pool.cc:254] collecting diagnostics on the listening RPC socket 0.0.0.0:36263 every 8 connection(s)
W20260926 14:50:55.249691   383 serialization.cc:72] Serialized kudu.rpc_test.PushStringsRequestPB (2147483654 bytes) is larger than the maximum configured RPC message size (52428800 bytes). Sending anyway, but peer may reject the data.
W20260926 14:50:55.252539   622 connection.cc:535] server connection from 127.0.0.1:54966 recv error: Network error: RPC frame had a length of 2147483714, but we only support messages up to 52428800 bytes long.
W20260926 14:50:55.252590   622 connection.cc:158] shutting down server connection from 127.0.0.1:54966 with pending inbound data: 4/2147483714 bytes received; last active 0 ns ago: status Network error: RPC frame had a length of 2147483714, but we only support messages up to 52428800 bytes long.
W20260926 14:50:55.252772   638 connection.cc:196] Error closing socket: Network error: TlsSocket::Close: Connection reset by peer
I20260926 14:50:55.274189   651 acceptor_pool.cc:254] collecting diagnostics on the listening RPC socket 0.0.0.0:34047 every 8 connection(s)
I20260926 14:50:55.274179   650 acceptor_pool.cc:254] collecting diagnostics on the listening RPC socket 0.0.0.0:34047 every 8 connection(s)
W20260926 14:50:58.806003   649 connection.cc:577] server connection from 127.0.0.1:44614: received bad data: 'Corruption: Invalid packet: message had a length of 2147483710, but we only support messages up to 2147483647 bytes
'
[       OK ] Parameters/TestRpc.TestRpcSidecarLimits/SSL_TCP (5240 ms)
[ RUN      ] Parameters/TestRpc.TestCallTimeoutDoesntAffectNegotiation/SSL_TCP
I20260926 14:50:58.822099   675 acceptor_pool.cc:254] collecting diagnostics on the listening RPC socket 0.0.0.0:35477 every 8 connection(s)
I20260926 14:50:58.822178   676 acceptor_pool.cc:254] collecting diagnostics on the listening RPC socket 0.0.0.0:35477 every 8 connection(s)
W20260926 14:50:58.830474   671 negotiation.cc:266] Injecting 500ms delay in negotiation
I20260926 14:50:58.880707   383 rpc-test-base.h:595] status: Timed out: connection negotiation to 0.0.0.0:35477 for RPC Sleep timed out after 0.050s (ON_OUTBOUND_QUEUE), seconds elapsed: 0.0505636
[       OK ] Parameters/TestRpc.TestCallTimeoutDoesntAffectNegotiation/SSL_TCP (526 ms)
[ RUN      ] Parameters/TestRpc.TestRpcHandlerLatencyMetric/SSL_TCP
I20260926 14:50:59.346859   700 acceptor_pool.cc:254] collecting diagnostics on the listening RPC socket 0.0.0.0:41283 every 8 connection(s)
I20260926 14:50:59.346925   701 acceptor_pool.cc:254] collecting diagnostics on the listening RPC socket 0.0.0.0:41283 every 8 connection(s)
I20260926 14:50:59.378353   383 rpc-test.cc:1236] Sleep() min lat: 20237
I20260926 14:50:59.378429   383 rpc-test.cc:1237] Sleep() mean lat: 20237
I20260926 14:50:59.378465   383 rpc-test.cc:1238] Sleep() max lat: 20237
I20260926 14:50:59.378484   383 rpc-test.cc:1239] Sleep() #calls: 1
[       OK ] Parameters/TestRpc.TestRpcHandlerLatencyMetric/SSL_TCP (44 ms)
[ RUN      ] Parameters/TestRpc.TimedOutOnResponseMetricServiceQueue/SSL_TCP
I20260926 14:50:59.391479   726 acceptor_pool.cc:254] collecting diagnostics on the listening RPC socket 0.0.0.0:42869 every 8 connection(s)
I20260926 14:50:59.391512   727 acceptor_pool.cc:254] collecting diagnostics on the listening RPC socket 0.0.0.0:42869 every 8 connection(s)
W20260926 14:50:59.454484   728 rpcz_store.cc:267] Call kudu.rpc_test.CalculatorService.Sleep from 127.0.0.1:47772 (request call id 2) took 20 ms (client timeout 20 ms). Trace:
W20260926 14:50:59.454579   728 rpcz_store.cc:269] 0926 14:50:59.434253 (+     0us) service_pool.cc:170] Inserting onto call queue
0926 14:50:59.454462 (+ 20209us) service_pool.cc:214] Skipping call since client already timed out
0926 14:50:59.454470 (+     8us) inbound_call.cc:173] Queueing failure response
Metrics: {}
[       OK ] Parameters/TestRpc.TimedOutOnResponseMetricServiceQueue/SSL_TCP (76 ms)
[ RUN      ] Parameters/TestRpc.RpcPendingConnectionsMetric/SSL_TCP
I20260926 14:50:59.457468   749 acceptor_pool.cc:254] collecting diagnostics on the listening RPC socket 0.0.0.0:35975 every 8 connection(s)
I20260926 14:50:59.457530   750 acceptor_pool.cc:254] collecting diagnostics on the listening RPC socket 0.0.0.0:35975 every 8 connection(s)
W20260926 14:50:59.465615   745 negotiation.cc:337] Failed RPC negotiation. Trace:
0926 14:50:59.465376 (+     0us) reactor.cc:625] Submitting negotiation task for server connection from 127.0.0.1:49152 (local address 127.0.0.1:35975)
0926 14:50:59.465432 (+    56us) server_negotiation.cc:206] Beginning negotiation
0926 14:50:59.465435 (+     3us) server_negotiation.cc:399] Waiting for connection header
0926 14:50:59.465532 (+    97us) negotiation.cc:327] Negotiation complete: Network error: Server connection negotiation failed: server connection from 127.0.0.1:49152: BlockingRecv error: recv got EOF from 127.0.0.1:49152 (error 108)
Metrics: {"server-negotiator.queue_time_us":19}
[       OK ] Parameters/TestRpc.RpcPendingConnectionsMetric/SSL_TCP (20 ms)
[ RUN      ] Parameters/TestRpc.TestRpcContextClientDeadline/SSL_TCP
I20260926 14:50:59.485425   765 acceptor_pool.cc:254] collecting diagnostics on the listening RPC socket 0.0.0.0:39387 every 8 connection(s)
I20260926 14:50:59.485440   766 acceptor_pool.cc:254] collecting diagnostics on the listening RPC socket 0.0.0.0:39387 every 8 connection(s)
[       OK ] Parameters/TestRpc.TestRpcContextClientDeadline/SSL_TCP (45 ms)
[ RUN      ] Parameters/TestRpc.TestApplicationFeatureFlagUnsupportedServer/SSL_TCP
I20260926 14:50:59.542169   790 acceptor_pool.cc:254] collecting diagnostics on the listening RPC socket 0.0.0.0:44323 every 8 connection(s)
I20260926 14:50:59.542186   791 acceptor_pool.cc:254] collecting diagnostics on the listening RPC socket 0.0.0.0:44323 every 8 connection(s)
[       OK ] Parameters/TestRpc.TestApplicationFeatureFlagUnsupportedServer/SSL_TCP (29 ms)
[ RUN      ] Parameters/TestRpc.TestCancellationAsync/SSL_TCP
I20260926 14:50:59.563303   815 acceptor_pool.cc:254] collecting diagnostics on the listening RPC socket 0.0.0.0:34681 every 8 connection(s)
I20260926 14:50:59.563323   816 acceptor_pool.cc:254] collecting diagnostics on the listening RPC socket 0.0.0.0:34681 every 8 connection(s)
I20260926 14:50:59.563465   383 rpc-test.cc:1716] Connecting to 0.0.0.0:34681
I20260926 14:50:59.576517   383 test_util.cc:268] Using random seed: -167172414
I20260926 14:50:59.594906   819 rpc-test-base.h:240] got call: sleep_micros: 500 pattern: 4294967295 num_repetitions: 2097152 sidecar_idx: 0
I20260926 14:50:59.609282   819 rpc-test-base.h:240] got call: sleep_micros: 500 pattern: 4294967295 num_repetitions: 2097152 sidecar_idx: 0
I20260926 14:50:59.623612   819 rpc-test-base.h:240] got call: sleep_micros: 500 pattern: 4294967295 num_repetitions: 2097152 sidecar_idx: 0
I20260926 14:50:59.640169   819 rpc-test-base.h:240] got call: sleep_micros: 500 pattern: 4294967295 num_repetitions: 2097152 sidecar_idx: 0
I20260926 14:50:59.656980   819 rpc-test-base.h:240] got call: sleep_micros: 500 pattern: 4294967295 num_repetitions: 2097152 sidecar_idx: 0
I20260926 14:50:59.673761   819 rpc-test-base.h:240] got call: sleep_micros: 500 pattern: 4294967295 num_repetitions: 2097152 sidecar_idx: 0
I20260926 14:50:59.689028   819 rpc-test-base.h:240] got call: sleep_micros: 500 pattern: 4294967295 num_repetitions: 2097152 sidecar_idx: 0
I20260926 14:50:59.700928   819 rpc-test-base.h:240] got call: sleep_micros: 500 pattern: 4294967295 num_repetitions: 2097152 sidecar_idx: 0
W20260926 14:50:59.703860   813 connection.cc:441] server connection from 127.0.0.1:53548 torn down before Call kudu.rpc.GenericCalculatorService.SleepWithSidecar from 127.0.0.1:53548 (request call id 9) could send its response
[       OK ] Parameters/TestRpc.TestCancellationAsync/SSL_TCP (152 ms)
[ RUN      ] Parameters/TestRpc.TestPerformanceBySocketType/SSL_TCP
I20260926 14:50:59.719686   841 acceptor_pool.cc:254] collecting diagnostics on the listening RPC socket 0.0.0.0:36163 every 8 connection(s)
I20260926 14:50:59.719656   840 acceptor_pool.cc:254] collecting diagnostics on the listening RPC socket 0.0.0.0:36163 every 8 connection(s)
I20260926 14:50:59.719794   383 rpc-test.cc:1846] Connecting to 0.0.0.0:36163
I20260926 14:51:01.235004   383 rpc-test.cc:1859] Sending 1024MB via ssl-enabled tcp socket: real 1.499s	user 1.430s	sys 1.227s
I20260926 14:51:02.852254   383 rpc-test.cc:1859] Sending 1024MB via ssl-enabled tcp socket: real 1.617s	user 1.573s	sys 1.308s
I20260926 14:51:04.377175   383 rpc-test.cc:1859] Sending 1024MB via ssl-enabled tcp socket: real 1.525s	user 1.494s	sys 1.204s
I20260926 14:51:05.925154   383 rpc-test.cc:1859] Sending 1024MB via ssl-enabled tcp socket: real 1.548s	user 1.481s	sys 1.257s
I20260926 14:51:07.451529   383 rpc-test.cc:1859] Sending 1024MB via ssl-enabled tcp socket: real 1.526s	user 1.390s	sys 1.299s
[       OK ] Parameters/TestRpc.TestPerformanceBySocketType/SSL_TCP (7748 ms)
[----------] 20 tests from Parameters/TestRpc (26091 ms total)

[----------] 1 test from Parameters/TestRpcSocketTxRxQueue
[ RUN      ] Parameters/TestRpcSocketTxRxQueue.OverCapacity/0
W20260926 14:51:07.716753   857 negotiation.cc:337] Failed RPC negotiation. Trace:
0926 14:51:07.454551 (+     0us) reactor.cc:625] Submitting negotiation task for client connection to 0.0.0.0:33223 (local address 127.0.0.1:36914)
0926 14:51:07.454592 (+    41us) negotiation.cc:107] Waiting for socket to connect
0926 14:51:07.454602 (+    10us) client_negotiation.cc:174] Beginning negotiation
0926 14:51:07.454647 (+    45us) client_negotiation.cc:252] Sending NEGOTIATE NegotiatePB request
0926 14:51:07.716613 (+261966us) negotiation.cc:327] Negotiation complete: Network error: Client connection negotiation failed: client connection to 0.0.0.0:33223: BlockingRecv error: recv error from unknown peer: Transport endpoint is not connected (error 107)
Metrics: {"client-negotiator.queue_time_us":16}
W20260926 14:51:07.716753   884 negotiation.cc:337] Failed RPC negotiation. Trace:
0926 14:51:07.456919 (+     0us) reactor.cc:625] Submitting negotiation task for client connection to 0.0.0.0:33223 (local address 127.0.0.1:36958)
0926 14:51:07.456969 (+    50us) negotiation.cc:107] Waiting for socket to connect
0926 14:51:07.456977 (+     8us) client_negotiation.cc:174] Beginning negotiation
0926 14:51:07.457011 (+    34us) client_negotiation.cc:252] Sending NEGOTIATE NegotiatePB request
0926 14:51:07.716614 (+259603us) negotiation.cc:327] Negotiation complete: Network error: Client connection negotiation failed: client connection to 0.0.0.0:33223: BlockingRecv error: recv error from unknown peer: Transport endpoint is not connected (error 107)
Metrics: {"client-negotiator.queue_time_us":33}
W20260926 14:51:07.716770   866 negotiation.cc:337] Failed RPC negotiation. Trace:
0926 14:51:07.455302 (+     0us) reactor.cc:625] Submitting negotiation task for client connection to 0.0.0.0:33223 (local address 127.0.0.1:36928)
0926 14:51:07.455335 (+    33us) negotiation.cc:107] Waiting for socket to connect
0926 14:51:07.455343 (+     8us) client_negotiation.cc:174] Beginning negotiation
0926 14:51:07.455380 (+    37us) client_negotiation.cc:252] Sending NEGOTIATE NegotiatePB request
0926 14:51:07.716673 (+261293us) negotiation.cc:327] Negotiation complete: Network error: Client connection negotiation failed: client connection to 0.0.0.0:33223: BlockingRecv error: recv error from unknown peer: Transport endpoint is not connected (error 107)
Metrics: {"client-negotiator.queue_time_us":16}
W20260926 14:51:07.716770   875 negotiation.cc:337] Failed RPC negotiation. Trace:
0926 14:51:07.456131 (+     0us) reactor.cc:625] Submitting negotiation task for client connection to 0.0.0.0:33223 (local address 127.0.0.1:36944)
0926 14:51:07.456167 (+    36us) negotiation.cc:107] Waiting for socket to connect
0926 14:51:07.456174 (+     7us) client_negotiation.cc:174] Beginning negotiation
0926 14:51:07.456208 (+    34us) client_negotiation.cc:252] Sending NEGOTIATE NegotiatePB request
0926 14:51:07.716673 (+260465us) negotiation.cc:327] Negotiation complete: Network error: Client connection negotiation failed: client connection to 0.0.0.0:33223: BlockingRecv error: recv error from unknown peer: Transport endpoint is not connected (error 107)
Metrics: {"client-negotiator.queue_time_us":19}
W20260926 14:51:07.717092   902 negotiation.cc:337] Failed RPC negotiation. Trace:
0926 14:51:07.458502 (+     0us) reactor.cc:625] Submitting negotiation task for client connection to 0.0.0.0:33223 (local address 127.0.0.1:36984)
0926 14:51:07.458534 (+    32us) negotiation.cc:107] Waiting for socket to connect
0926 14:51:07.458541 (+     7us) client_negotiation.cc:174] Beginning negotiation
0926 14:51:07.458575 (+    34us) client_negotiation.cc:252] Sending NEGOTIATE NegotiatePB request
0926 14:51:07.716963 (+258388us) negotiation.cc:327] Negotiation complete: Network error: Client connection negotiation failed: client connection to 0.0.0.0:33223: BlockingRecv error: recv error from unknown peer: Transport endpoint is not connected (error 107)
Metrics: {"client-negotiator.queue_time_us":15}
W20260926 14:51:07.717182   893 negotiation.cc:337] Failed RPC negotiation. Trace:
0926 14:51:07.457739 (+     0us) reactor.cc:625] Submitting negotiation task for client connection to 0.0.0.0:33223 (local address 127.0.0.1:36974)
0926 14:51:07.457773 (+    34us) negotiation.cc:107] Waiting for socket to connect
0926 14:51:07.457781 (+     8us) client_negotiation.cc:174] Beginning negotiation
0926 14:51:07.457814 (+    33us) client_negotiation.cc:252] Sending NEGOTIATE NegotiatePB request
0926 14:51:07.716820 (+259006us) negotiation.cc:327] Negotiation complete: Network error: Client connection negotiation failed: client connection to 0.0.0.0:33223: BlockingRecv error: recv error from unknown peer: Transport endpoint is not connected (error 107)
Metrics: {"client-negotiator.queue_time_us":16}
[       OK ] Parameters/TestRpcSocketTxRxQueue.OverCapacity/0 (1024 ms)
[----------] 1 test from Parameters/TestRpcSocketTxRxQueue (1024 ms total)

[----------] Global test environment tear-down
[==========] 21 tests from 2 test suites ran. (27115 ms total)
[  PASSED  ] 20 tests.
[  FAILED  ] 1 test, listed below:
[  FAILED  ] Parameters/TestRpc.TestCallWithChainCertAndChainCA/SSL_TCP, where GetParam() = (true, false)

 1 FAILED TEST