Parameters/TestRpc.TestCallWithChainCertAndRootCA/SSL_UnixSocket: /data0/somelongdirectorytoavoidrpathissues/src/kudu/src/kudu/rpc/rpc-test.cc:303: Failure
Failed
Bad status: Runtime error: could not verify certificate chain (error with cert: subject=CN = localhost, ST = sadfjas, C = AS, emailAddress = sdflkdsajf, O = lskdfjlsad, OU = sldfkja, issuer=C = AS, ST = ASDfkjdhf, L = lskdjf, O = saldfja, OU = skdjf, CN = localhost, emailAddress = sadjflkadsj): : certificate has expired
Google Test trace:
/data0/somelongdirectorytoavoidrpathissues/src/kudu/src/kudu/rpc/rpc-test.cc:300: Connecting to unix:/tmp/dist-test-taskU5uprw/test-tmp/rpc-test-a5f93321e8f04d13bc675ddd3855d227.sock
I20260925 03:02:56.605700 10183 test_util.cc:175] -----------------------------------------------
I20260925 03:02:56.605895 10183 test_util.cc:176] Had fatal failures, leaving test files at /tmp/dist-test-taskU5uprw/test-tmp/rpc-test.2.Parameters_TestRpc.TestCallWithChainCertAndRootCA_SSL_UnixSocket.1790305372936416-10183-0
Note: This is test shard 3 of 8.
[==========] Running 21 tests from 2 test suites.
[----------] Global test environment set-up.
[----------] 1 test from TestRpc
[ RUN ] TestRpc.TestNegotiationTimeout
WARNING: Logging before InitGoogleLogging() is written to STDERR
I20260925 03:02:53.128506 10183 rpc-test-base.h:595] status: Timed out: connection negotiation to 0.0.0.0:35463 for RPC Sleep timed out after 0.100s (ON_OUTBOUND_QUEUE), seconds elapsed: 0.101902
W20260925 03:02:56.208308 10193 negotiation.cc:337] Failed RPC negotiation. Trace:
0925 03:02:53.027622 (+ 0us) reactor.cc:625] Submitting negotiation task for client connection to 0.0.0.0:35463 (local address 127.0.0.1:43748)
0925 03:02:53.028323 (+ 701us) negotiation.cc:107] Waiting for socket to connect
0925 03:02:53.028369 (+ 46us) client_negotiation.cc:174] Beginning negotiation
0925 03:02:53.040463 (+ 12094us) client_negotiation.cc:252] Sending NEGOTIATE NegotiatePB request
0925 03:02:56.206938 (+3166475us) negotiation.cc:327] Negotiation complete: Timed out: Client connection negotiation failed: client connection to 0.0.0.0:35463: received 0 of 4 requested bytes
Metrics: {"client-negotiator.queue_time_us":210}
[ OK ] TestRpc.TestNegotiationTimeout (3224 ms)
[----------] 1 test from TestRpc (3225 ms total)
[----------] 20 tests from Parameters/TestRpc
[ RUN ] Parameters/TestRpc.TestAcceptorPoolStartStop/SSL_UnixSocket
I20260925 03:02:56.277837 10209 acceptor_pool.cc:254] collecting diagnostics on the listening RPC socket unix:/tmp/dist-test-taskU5uprw/test-tmp/rpc-test-395a657a12d64215978a67db5378e0d3.sock every 8 connection(s)
I20260925 03:02:56.280606 10210 acceptor_pool.cc:254] collecting diagnostics on the listening RPC socket unix:/tmp/dist-test-taskU5uprw/test-tmp/rpc-test-395a657a12d64215978a67db5378e0d3.sock every 8 connection(s)
I20260925 03:02:56.330015 10220 acceptor_pool.cc:254] collecting diagnostics on the listening RPC socket unix:/tmp/dist-test-taskU5uprw/test-tmp/rpc-test-395a657a12d64215978a67db5378e0d3.sock every 8 connection(s)
I20260925 03:02:56.332433 10221 acceptor_pool.cc:254] collecting diagnostics on the listening RPC socket unix:/tmp/dist-test-taskU5uprw/test-tmp/rpc-test-395a657a12d64215978a67db5378e0d3.sock every 8 connection(s)
I20260925 03:02:56.358381 10231 acceptor_pool.cc:254] collecting diagnostics on the listening RPC socket unix:/tmp/dist-test-taskU5uprw/test-tmp/rpc-test-395a657a12d64215978a67db5378e0d3.sock every 8 connection(s)
I20260925 03:02:56.359135 10232 acceptor_pool.cc:254] collecting diagnostics on the listening RPC socket unix:/tmp/dist-test-taskU5uprw/test-tmp/rpc-test-395a657a12d64215978a67db5378e0d3.sock every 8 connection(s)
I20260925 03:02:56.385695 10242 acceptor_pool.cc:254] collecting diagnostics on the listening RPC socket unix:/tmp/dist-test-taskU5uprw/test-tmp/rpc-test-395a657a12d64215978a67db5378e0d3.sock every 8 connection(s)
I20260925 03:02:56.386456 10243 acceptor_pool.cc:254] collecting diagnostics on the listening RPC socket unix:/tmp/dist-test-taskU5uprw/test-tmp/rpc-test-395a657a12d64215978a67db5378e0d3.sock every 8 connection(s)
I20260925 03:02:56.403172 10253 acceptor_pool.cc:254] collecting diagnostics on the listening RPC socket unix:/tmp/dist-test-taskU5uprw/test-tmp/rpc-test-395a657a12d64215978a67db5378e0d3.sock every 8 connection(s)
I20260925 03:02:56.404053 10254 acceptor_pool.cc:254] collecting diagnostics on the listening RPC socket unix:/tmp/dist-test-taskU5uprw/test-tmp/rpc-test-395a657a12d64215978a67db5378e0d3.sock every 8 connection(s)
[ OK ] Parameters/TestRpc.TestAcceptorPoolStartStop/SSL_UnixSocket (193 ms)
[ RUN ] Parameters/TestRpc.TestCall/SSL_UnixSocket
I20260925 03:02:56.451030 10267 acceptor_pool.cc:254] collecting diagnostics on the listening RPC socket unix:/tmp/dist-test-taskU5uprw/test-tmp/rpc-test-4a51d8af3a434f3593cfa957c44e8916.sock every 8 connection(s)
I20260925 03:02:56.453086 10268 acceptor_pool.cc:254] collecting diagnostics on the listening RPC socket unix:/tmp/dist-test-taskU5uprw/test-tmp/rpc-test-4a51d8af3a434f3593cfa957c44e8916.sock every 8 connection(s)
I20260925 03:02:56.460266 10183 rpc-test.cc:234] Connecting to unix:/tmp/dist-test-taskU5uprw/test-tmp/rpc-test-4a51d8af3a434f3593cfa957c44e8916.sock
W20260925 03:02:56.551236 10263 connection.cc:196] Error closing socket: Network error: TlsSocket::Close: Broken pipe
[ OK ] Parameters/TestRpc.TestCall/SSL_UnixSocket (148 ms)
[ RUN ] Parameters/TestRpc.TestCallWithChainCertAndRootCA/SSL_UnixSocket
I20260925 03:02:56.581429 10292 acceptor_pool.cc:254] collecting diagnostics on the listening RPC socket unix:/tmp/dist-test-taskU5uprw/test-tmp/rpc-test-a5f93321e8f04d13bc675ddd3855d227.sock every 8 connection(s)
I20260925 03:02:56.582094 10293 acceptor_pool.cc:254] collecting diagnostics on the listening RPC socket unix:/tmp/dist-test-taskU5uprw/test-tmp/rpc-test-a5f93321e8f04d13bc675ddd3855d227.sock every 8 connection(s)
/data0/somelongdirectorytoavoidrpathissues/src/kudu/src/kudu/rpc/rpc-test.cc:303: Failure
Failed
Bad status: Runtime error: could not verify certificate chain (error with cert: subject=CN = localhost, ST = sadfjas, C = AS, emailAddress = sdflkdsajf, O = lskdfjlsad, OU = sldfkja, issuer=C = AS, ST = ASDfkjdhf, L = lskdjf, O = saldfja, OU = skdjf, CN = localhost, emailAddress = sadjflkadsj): : certificate has expired
Google Test trace:
/data0/somelongdirectorytoavoidrpathissues/src/kudu/src/kudu/rpc/rpc-test.cc:300: Connecting to unix:/tmp/dist-test-taskU5uprw/test-tmp/rpc-test-a5f93321e8f04d13bc675ddd3855d227.sock
I20260925 03:02:56.605700 10183 test_util.cc:175] -----------------------------------------------
I20260925 03:02:56.605895 10183 test_util.cc:176] Had fatal failures, leaving test files at /tmp/dist-test-taskU5uprw/test-tmp/rpc-test.2.Parameters_TestRpc.TestCallWithChainCertAndRootCA_SSL_UnixSocket.1790305372936416-10183-0
[ FAILED ] Parameters/TestRpc.TestCallWithChainCertAndRootCA/SSL_UnixSocket, where GetParam() = (true, true) (48 ms)
[ RUN ] Parameters/TestRpc.TestCallWithBadPasswordProtectedKey/SSL_UnixSocket
[ OK ] Parameters/TestRpc.TestCallWithBadPasswordProtectedKey/SSL_UnixSocket (35 ms)
[ RUN ] Parameters/TestRpc.TestInvalidMethodCall/SSL_UnixSocket
I20260925 03:02:56.665338 10329 acceptor_pool.cc:254] collecting diagnostics on the listening RPC socket unix:/tmp/dist-test-taskU5uprw/test-tmp/rpc-test-12444d55c4fa47fd86bcbf174898a44a.sock every 8 connection(s)
I20260925 03:02:56.666252 10330 acceptor_pool.cc:254] collecting diagnostics on the listening RPC socket unix:/tmp/dist-test-taskU5uprw/test-tmp/rpc-test-12444d55c4fa47fd86bcbf174898a44a.sock every 8 connection(s)
I20260925 03:02:56.670033 10183 rpc-test.cc:406] Connecting to unix:/tmp/dist-test-taskU5uprw/test-tmp/rpc-test-12444d55c4fa47fd86bcbf174898a44a.sock
W20260925 03:02:56.703316 10326 connection.cc:196] Error closing socket: Network error: TlsSocket::Close: Broken pipe
[ OK ] Parameters/TestRpc.TestInvalidMethodCall/SSL_UnixSocket (68 ms)
[ RUN ] Parameters/TestRpc.TestHighFDs/SSL_UnixSocket
I20260925 03:02:56.914707 10355 acceptor_pool.cc:254] collecting diagnostics on the listening RPC socket unix:/tmp/dist-test-taskU5uprw/test-tmp/rpc-test-48fcccfbec5a489fb611e2efea5b19b4.sock every 8 connection(s)
I20260925 03:02:56.915522 10356 acceptor_pool.cc:254] collecting diagnostics on the listening RPC socket unix:/tmp/dist-test-taskU5uprw/test-tmp/rpc-test-48fcccfbec5a489fb611e2efea5b19b4.sock every 8 connection(s)
[ OK ] Parameters/TestRpc.TestHighFDs/SSL_UnixSocket (257 ms)
[ RUN ] Parameters/TestRpc.TestConnectionAlwaysKeepalive/SSL_UnixSocket
I20260925 03:02:56.995884 10378 acceptor_pool.cc:254] collecting diagnostics on the listening RPC socket unix:/tmp/dist-test-taskU5uprw/test-tmp/rpc-test-37d72076c82e47da96aa54aa76fea767.sock every 8 connection(s)
I20260925 03:02:56.996551 10379 acceptor_pool.cc:254] collecting diagnostics on the listening RPC socket unix:/tmp/dist-test-taskU5uprw/test-tmp/rpc-test-37d72076c82e47da96aa54aa76fea767.sock every 8 connection(s)
I20260925 03:02:56.999739 10183 rpc-test.cc:532] Connecting to unix:/tmp/dist-test-taskU5uprw/test-tmp/rpc-test-37d72076c82e47da96aa54aa76fea767.sock
W20260925 03:03:00.039000 10377 connection.cc:196] Error closing socket: Network error: TlsSocket::Close: Broken pipe
[ OK ] Parameters/TestRpc.TestConnectionAlwaysKeepalive/SSL_UnixSocket (3076 ms)
[ RUN ] Parameters/TestRpc.TestReopenOutboundConnections/SSL_UnixSocket
I20260925 03:03:00.074262 10401 acceptor_pool.cc:254] collecting diagnostics on the listening RPC socket unix:/tmp/dist-test-taskU5uprw/test-tmp/rpc-test-c9ce864ac16846b394966af669979881.sock every 8 connection(s)
I20260925 03:03:00.074906 10402 acceptor_pool.cc:254] collecting diagnostics on the listening RPC socket unix:/tmp/dist-test-taskU5uprw/test-tmp/rpc-test-c9ce864ac16846b394966af669979881.sock every 8 connection(s)
I20260925 03:03:00.078008 10183 rpc-test.cc:658] Connecting to unix:/tmp/dist-test-taskU5uprw/test-tmp/rpc-test-c9ce864ac16846b394966af669979881.sock
W20260925 03:03:00.117681 10400 connection.cc:196] Error closing socket: Network error: TlsSocket::Close: Broken pipe
W20260925 03:03:00.127311 10400 connection.cc:196] Error closing socket: Network error: TlsSocket::Close: Broken pipe
W20260925 03:03:00.137163 10400 connection.cc:196] Error closing socket: Network error: TlsSocket::Close: Broken pipe
W20260925 03:03:00.146674 10400 connection.cc:196] Error closing socket: Network error: TlsSocket::Close: Broken pipe
W20260925 03:03:00.157001 10400 connection.cc:196] Error closing socket: Network error: TlsSocket::Close: Broken pipe
W20260925 03:03:00.167207 10400 connection.cc:196] Error closing socket: Network error: TlsSocket::Close: Broken pipe
W20260925 03:03:00.177068 10400 connection.cc:196] Error closing socket: Network error: TlsSocket::Close: Broken pipe
W20260925 03:03:00.187332 10400 connection.cc:196] Error closing socket: Network error: TlsSocket::Close: Broken pipe
W20260925 03:03:00.197484 10400 connection.cc:196] Error closing socket: Network error: TlsSocket::Close: Broken pipe
W20260925 03:03:00.208978 10400 connection.cc:196] Error closing socket: Network error: TlsSocket::Close: Broken pipe
W20260925 03:03:00.220399 10400 connection.cc:196] Error closing socket: Network error: TlsSocket::Close: Broken pipe
W20260925 03:03:00.230773 10400 connection.cc:196] Error closing socket: Network error: TlsSocket::Close: Broken pipe
W20260925 03:03:00.240433 10400 connection.cc:196] Error closing socket: Network error: TlsSocket::Close: Broken pipe
W20260925 03:03:00.250468 10400 connection.cc:196] Error closing socket: Network error: TlsSocket::Close: Broken pipe
W20260925 03:03:00.250559 10401 acceptor_pool.cc:285] unable to collect diagnostics on RPC socket unix:/tmp/dist-test-taskU5uprw/test-tmp/rpc-test-c9ce864ac16846b394966af669979881.sock: Not implemented: netlink diagnostics is currently supported only on IPv4 TCP sockets
W20260925 03:03:00.260810 10400 connection.cc:196] Error closing socket: Network error: TlsSocket::Close: Broken pipe
W20260925 03:03:00.271441 10400 connection.cc:196] Error closing socket: Network error: TlsSocket::Close: Broken pipe
W20260925 03:03:00.292059 10400 connection.cc:196] Error closing socket: Network error: TlsSocket::Close: Broken pipe
W20260925 03:03:00.301999 10400 connection.cc:196] Error closing socket: Network error: TlsSocket::Close: Broken pipe
W20260925 03:03:00.312062 10400 connection.cc:196] Error closing socket: Network error: TlsSocket::Close: Broken pipe
W20260925 03:03:00.322742 10400 connection.cc:196] Error closing socket: Network error: TlsSocket::Close: Broken pipe
W20260925 03:03:00.332952 10400 connection.cc:196] Error closing socket: Network error: TlsSocket::Close: Broken pipe
W20260925 03:03:00.344074 10400 connection.cc:196] Error closing socket: Network error: TlsSocket::Close: Broken pipe
W20260925 03:03:00.355530 10400 connection.cc:196] Error closing socket: Network error: TlsSocket::Close: Broken pipe
W20260925 03:03:00.365644 10400 connection.cc:196] Error closing socket: Network error: TlsSocket::Close: Broken pipe
W20260925 03:03:00.385663 10400 connection.cc:196] Error closing socket: Network error: TlsSocket::Close: Broken pipe
W20260925 03:03:00.394582 10400 connection.cc:196] Error closing socket: Network error: TlsSocket::Close: Broken pipe
W20260925 03:03:00.403496 10400 connection.cc:196] Error closing socket: Network error: TlsSocket::Close: Broken pipe
W20260925 03:03:00.413141 10400 connection.cc:196] Error closing socket: Network error: TlsSocket::Close: Broken pipe
W20260925 03:03:00.422792 10400 connection.cc:196] Error closing socket: Network error: TlsSocket::Close: Broken pipe
W20260925 03:03:00.433611 10400 connection.cc:196] Error closing socket: Network error: TlsSocket::Close: Broken pipe
[ OK ] Parameters/TestRpc.TestReopenOutboundConnections/SSL_UnixSocket (393 ms)
[ RUN ] Parameters/TestRpc.TestConnectionNetworkPlane/SSL_UnixSocket
I20260925 03:03:00.458791 10424 acceptor_pool.cc:254] collecting diagnostics on the listening RPC socket unix:/tmp/dist-test-taskU5uprw/test-tmp/rpc-test-c411cdbc6f07490ca844b8418b696da7.sock every 8 connection(s)
I20260925 03:03:00.459465 10425 acceptor_pool.cc:254] collecting diagnostics on the listening RPC socket unix:/tmp/dist-test-taskU5uprw/test-tmp/rpc-test-c411cdbc6f07490ca844b8418b696da7.sock every 8 connection(s)
I20260925 03:03:00.462630 10183 rpc-test.cc:772] Connecting to unix:/tmp/dist-test-taskU5uprw/test-tmp/rpc-test-c411cdbc6f07490ca844b8418b696da7.sock
W20260925 03:03:00.515777 10423 connection.cc:196] Error closing socket: Network error: TlsSocket::Close: Broken pipe
W20260925 03:03:00.516445 10423 connection.cc:196] Error closing socket: Network error: TlsSocket::Close: Broken pipe
[ OK ] Parameters/TestRpc.TestConnectionNetworkPlane/SSL_UnixSocket (83 ms)
[ RUN ] Parameters/TestRpc.TestTCPKeepalive/SSL_UnixSocket
I20260925 03:03:00.540851 10450 acceptor_pool.cc:254] collecting diagnostics on the listening RPC socket unix:/tmp/dist-test-taskU5uprw/test-tmp/rpc-test-6925e767bdc14508bab63b602b3c9636.sock every 8 connection(s)
I20260925 03:03:00.541496 10451 acceptor_pool.cc:254] collecting diagnostics on the listening RPC socket unix:/tmp/dist-test-taskU5uprw/test-tmp/rpc-test-6925e767bdc14508bab63b602b3c9636.sock every 8 connection(s)
I20260925 03:03:00.572873 10454 rpc-test-base.h:222] got call: sleep_micros: 8000000 deferred: true
I20260925 03:03:08.577062 10454 rpcz_store.cc:275] Call kudu.rpc.GenericCalculatorService.Sleep from unix:<unnamed> (request call id 0) took 8004 ms. Trace:
I20260925 03:03:08.577473 10454 rpcz_store.cc:276] 0925 03:03:00.572702 (+ 0us) service_pool.cc:170] Inserting onto call queue
0925 03:03:00.572810 (+ 108us) service_pool.cc:227] Handling call
0925 03:03:08.576874 (+8004064us) inbound_call.cc:173] Queueing success response
Metrics: {}
W20260925 03:03:08.585381 10447 connection.cc:196] Error closing socket: Network error: TlsSocket::Close: Broken pipe
[ OK ] Parameters/TestRpc.TestTCPKeepalive/SSL_UnixSocket (8071 ms)
[ RUN ] Parameters/TestRpc.TestMaxSmallSidecars/SSL_UnixSocket
I20260925 03:03:08.648013 10476 acceptor_pool.cc:254] collecting diagnostics on the listening RPC socket unix:/tmp/dist-test-taskU5uprw/test-tmp/rpc-test-ad476e4cd0c44307a0936f4626d142b0.sock every 8 connection(s)
I20260925 03:03:08.649055 10477 acceptor_pool.cc:254] collecting diagnostics on the listening RPC socket unix:/tmp/dist-test-taskU5uprw/test-tmp/rpc-test-ad476e4cd0c44307a0936f4626d142b0.sock every 8 connection(s)
W20260925 03:03:08.840184 10473 connection.cc:196] Error closing socket: Network error: TlsSocket::Close: Broken pipe
[ OK ] Parameters/TestRpc.TestMaxSmallSidecars/SSL_UnixSocket (252 ms)
[ RUN ] Parameters/TestRpc.TestCallTimeout/SSL_UnixSocket
I20260925 03:03:08.876420 10501 acceptor_pool.cc:254] collecting diagnostics on the listening RPC socket unix:/tmp/dist-test-taskU5uprw/test-tmp/rpc-test-6c8ca0c746ab49f2b69da0b56fa1fdbb.sock every 8 connection(s)
I20260925 03:03:08.877113 10502 acceptor_pool.cc:254] collecting diagnostics on the listening RPC socket unix:/tmp/dist-test-taskU5uprw/test-tmp/rpc-test-6c8ca0c746ab49f2b69da0b56fa1fdbb.sock every 8 connection(s)
I20260925 03:03:08.916234 10183 rpc-test-base.h:595] status: Timed out: connection negotiation to unix:/tmp/dist-test-taskU5uprw/test-tmp/rpc-test-6c8ca0c746ab49f2b69da0b56fa1fdbb.sock for RPC Sleep timed out after 0.000s (ON_OUTBOUND_QUEUE), seconds elapsed: 0.00279173
I20260925 03:03:08.924674 10505 rpc-test-base.h:222] got call: sleep_micros: 700000
I20260925 03:03:09.117363 10183 rpc-test-base.h:595] status: Timed out: Sleep RPC to unix:/tmp/dist-test-taskU5uprw/test-tmp/rpc-test-6c8ca0c746ab49f2b69da0b56fa1fdbb.sock timed out after 0.200s (SENT), seconds elapsed: 0.2008
I20260925 03:03:09.118813 10504 rpc-test-base.h:222] got call: sleep_micros: 2000000
W20260925 03:03:09.625535 10505 rpcz_store.cc:267] Call kudu.rpc.GenericCalculatorService.Sleep from unix:<unnamed> (request call id 1) took 701 ms (client timeout 200 ms). Trace:
W20260925 03:03:09.625969 10505 rpcz_store.cc:269] 0925 03:03:08.924453 (+ 0us) service_pool.cc:170] Inserting onto call queue
0925 03:03:08.924611 (+ 158us) service_pool.cc:227] Handling call
0925 03:03:09.625441 (+700830us) inbound_call.cc:173] Queueing success response
Metrics: {}
I20260925 03:03:10.619236 10183 rpc-test-base.h:595] status: Timed out: Sleep RPC to unix:/tmp/dist-test-taskU5uprw/test-tmp/rpc-test-6c8ca0c746ab49f2b69da0b56fa1fdbb.sock timed out after 1.500s (SENT), seconds elapsed: 1.50152
W20260925 03:03:10.629819 10498 connection.cc:196] Error closing socket: Network error: TlsSocket::Close: Broken pipe
W20260925 03:03:11.119521 10504 rpcz_store.cc:267] Call kudu.rpc.GenericCalculatorService.Sleep from unix:<unnamed> (request call id 2) took 2001 ms (client timeout 1500 ms). Trace:
W20260925 03:03:11.119910 10504 rpcz_store.cc:269] 0925 03:03:09.118523 (+ 0us) service_pool.cc:170] Inserting onto call queue
0925 03:03:09.118720 (+ 197us) service_pool.cc:227] Handling call
0925 03:03:11.119421 (+2000701us) inbound_call.cc:173] Queueing success response
Metrics: {}
W20260925 03:03:11.120517 10498 connection.cc:441] server connection from unix:<unnamed> torn down before Call kudu.rpc.GenericCalculatorService.Sleep from unix:<unnamed> (request call id 2) could send its response
[ OK ] Parameters/TestRpc.TestCallTimeout/SSL_UnixSocket (2280 ms)
[ RUN ] Parameters/TestRpc.TestServerShutsDown/SSL_UnixSocket
I20260925 03:03:11.128391 10183 rpc-test.cc:1125] Connecting to 0.0.0.0:36001
W20260925 03:03:11.138669 10518 negotiation.cc:337] Failed RPC negotiation. Trace:
0925 03:03:11.136656 (+ 0us) reactor.cc:625] Submitting negotiation task for client connection to 0.0.0.0:36001 (local address 127.0.0.1:33970)
0925 03:03:11.137339 (+ 683us) negotiation.cc:107] Waiting for socket to connect
0925 03:03:11.137383 (+ 44us) client_negotiation.cc:174] Beginning negotiation
0925 03:03:11.137704 (+ 321us) client_negotiation.cc:252] Sending NEGOTIATE NegotiatePB request
0925 03:03:11.137983 (+ 279us) negotiation.cc:327] Negotiation complete: Network error: Client connection negotiation failed: client connection to 0.0.0.0:36001: BlockingWrite error: write error: Broken pipe (error 32)
Metrics: {"client-negotiator.queue_time_us":192}
[ OK ] Parameters/TestRpc.TestServerShutsDown/SSL_UnixSocket (15 ms)
[ RUN ] Parameters/TestRpc.TimedOutOnResponseMetric/SSL_UnixSocket
I20260925 03:03:11.160010 10535 acceptor_pool.cc:254] collecting diagnostics on the listening RPC socket unix:/tmp/dist-test-taskU5uprw/test-tmp/rpc-test-39245f7878d046cebf1c56514ce2c09e.sock every 8 connection(s)
I20260925 03:03:11.160827 10536 acceptor_pool.cc:254] collecting diagnostics on the listening RPC socket unix:/tmp/dist-test-taskU5uprw/test-tmp/rpc-test-39245f7878d046cebf1c56514ce2c09e.sock every 8 connection(s)
W20260925 03:03:11.404237 10539 rpcz_store.cc:267] Call kudu.rpc_test.CalculatorService.Sleep from unix:<unnamed> (request call id 3) took 50 ms (client timeout 25 ms). Trace:
W20260925 03:03:11.404585 10539 rpcz_store.cc:269] 0925 03:03:11.353585 (+ 0us) service_pool.cc:170] Inserting onto call queue
0925 03:03:11.353710 (+ 125us) service_pool.cc:227] Handling call
0925 03:03:11.404143 (+ 50433us) inbound_call.cc:173] Queueing success response
Related trace 'test_child':
Metrics: {"test_sleep_us":50000,"child_traces":[["test_child",{"related_trace_metric":1}]]}
W20260925 03:03:11.463621 10539 rpcz_store.cc:267] Call kudu.rpc_test.CalculatorService.Sleep from unix:<unnamed> (request call id 4) took 50 ms (client timeout 50 ms). Trace:
W20260925 03:03:11.463901 10539 rpcz_store.cc:269] 0925 03:03:11.413023 (+ 0us) service_pool.cc:170] Inserting onto call queue
0925 03:03:11.413196 (+ 173us) service_pool.cc:227] Handling call
0925 03:03:11.463558 (+ 50362us) inbound_call.cc:173] Queueing success response
Related trace 'test_child':
Metrics: {"test_sleep_us":50000,"child_traces":[["test_child",{"related_trace_metric":1}]]}
W20260925 03:03:11.468372 10532 connection.cc:196] Error closing socket: Network error: TlsSocket::Close: Broken pipe
[ OK ] Parameters/TestRpc.TimedOutOnResponseMetric/SSL_UnixSocket (332 ms)
[ RUN ] Parameters/TestRpc.AcceptorDispatchingTimesMetric/SSL_UnixSocket
I20260925 03:03:11.487306 10560 acceptor_pool.cc:254] collecting diagnostics on the listening RPC socket 0.0.0.0:38967 every 8 connection(s)
I20260925 03:03:11.488065 10561 acceptor_pool.cc:254] collecting diagnostics on the listening RPC socket 0.0.0.0:38967 every 8 connection(s)
W20260925 03:03:11.493659 10556 negotiation.cc:337] Failed RPC negotiation. Trace:
0925 03:03:11.492372 (+ 0us) reactor.cc:625] Submitting negotiation task for server connection from 127.0.0.1:36570 (local address 127.0.0.1:38967)
0925 03:03:11.492858 (+ 486us) server_negotiation.cc:206] Beginning negotiation
0925 03:03:11.492878 (+ 20us) server_negotiation.cc:399] Waiting for connection header
0925 03:03:11.493139 (+ 261us) negotiation.cc:327] Negotiation complete: Network error: Server connection negotiation failed: server connection from 127.0.0.1:36570: BlockingRecv error: recv got EOF from 127.0.0.1:36570 (error 108)
Metrics: {"server-negotiator.queue_time_us":136}
[ OK ] Parameters/TestRpc.AcceptorDispatchingTimesMetric/SSL_UnixSocket (25 ms)
[ RUN ] Parameters/TestRpc.TestRpcCallbackDestroysMessenger/SSL_UnixSocket
[ OK ] Parameters/TestRpc.TestRpcCallbackDestroysMessenger/SSL_UnixSocket (26 ms)
[ RUN ] Parameters/TestRpc.TestApplicationFeatureFlag/SSL_UnixSocket
I20260925 03:03:11.553012 10586 acceptor_pool.cc:254] collecting diagnostics on the listening RPC socket unix:/tmp/dist-test-taskU5uprw/test-tmp/rpc-test-1ba439e7ecfd42e9a57b3b2968c7055f.sock every 8 connection(s)
I20260925 03:03:11.553766 10587 acceptor_pool.cc:254] collecting diagnostics on the listening RPC socket unix:/tmp/dist-test-taskU5uprw/test-tmp/rpc-test-1ba439e7ecfd42e9a57b3b2968c7055f.sock every 8 connection(s)
W20260925 03:03:11.584656 10583 messenger.cc:357] Unable to handle RPC call: Not implemented: call requires unsupported application feature flags: 99
W20260925 03:03:11.587975 10583 connection.cc:196] Error closing socket: Network error: TlsSocket::Close: Broken pipe
[ OK ] Parameters/TestRpc.TestApplicationFeatureFlag/SSL_UnixSocket (67 ms)
[ RUN ] Parameters/TestRpc.TestCancellation/SSL_UnixSocket
I20260925 03:03:11.622067 10611 acceptor_pool.cc:254] collecting diagnostics on the listening RPC socket unix:/tmp/dist-test-taskU5uprw/test-tmp/rpc-test-5c261c10ef9247708189d2d7afd80519.sock every 8 connection(s)
I20260925 03:03:11.622895 10612 acceptor_pool.cc:254] collecting diagnostics on the listening RPC socket unix:/tmp/dist-test-taskU5uprw/test-tmp/rpc-test-5c261c10ef9247708189d2d7afd80519.sock every 8 connection(s)
I20260925 03:03:11.626430 10183 rpc-test.cc:1648] Connecting to unix:/tmp/dist-test-taskU5uprw/test-tmp/rpc-test-5c261c10ef9247708189d2d7afd80519.sock
I20260925 03:03:11.767177 10183 rpc-test-base.h:595] status: Aborted: Sleep RPC to unix:/tmp/dist-test-taskU5uprw/test-tmp/rpc-test-5c261c10ef9247708189d2d7afd80519.sock is cancelled in state READY, seconds elapsed: 0.000483446
I20260925 03:03:11.984387 10183 rpc-test-base.h:595] status: Aborted: Sleep RPC to unix:/tmp/dist-test-taskU5uprw/test-tmp/rpc-test-5c261c10ef9247708189d2d7afd80519.sock is cancelled in state SENT, seconds elapsed: 0.00111636
I20260925 03:03:11.984669 10614 rpc-test-base.h:222] got call: sleep_micros: 510000
I20260925 03:03:12.176455 10183 rpc-test-base.h:595] status: Aborted: Sleep RPC to unix:/tmp/dist-test-taskU5uprw/test-tmp/rpc-test-5c261c10ef9247708189d2d7afd80519.sock is cancelled in state SENT, seconds elapsed: 0.000642398
I20260925 03:03:12.176828 10613 rpc-test-base.h:222] got call: sleep_micros: 510000
I20260925 03:03:12.358780 10183 rpc-test-base.h:595] status: Aborted: Sleep RPC to unix:/tmp/dist-test-taskU5uprw/test-tmp/rpc-test-5c261c10ef9247708189d2d7afd80519.sock is cancelled in state SENT, seconds elapsed: 0.000850468
W20260925 03:03:12.369920 10615 rpcz_store.cc:267] Call kudu.rpc.GenericCalculatorService.Sleep from unix:<unnamed> (request call id 11) took 11 ms (client timeout 10 ms). Trace:
W20260925 03:03:12.370252 10615 rpcz_store.cc:269] 0925 03:03:12.358877 (+ 0us) service_pool.cc:170] Inserting onto call queue
0925 03:03:12.369693 (+ 10816us) service_pool.cc:214] Skipping call since client already timed out
0925 03:03:12.369770 (+ 77us) inbound_call.cc:173] Queueing failure response
Metrics: {}
I20260925 03:03:12.370859 10615 rpc-test-base.h:222] got call: sleep_micros: 1500000
W20260925 03:03:12.495378 10614 rpcz_store.cc:267] Call kudu.rpc.GenericCalculatorService.Sleep from unix:<unnamed> (request call id 3) took 511 ms (client timeout 10 ms). Trace:
W20260925 03:03:12.495718 10614 rpcz_store.cc:269] 0925 03:03:11.984472 (+ 0us) service_pool.cc:170] Inserting onto call queue
0925 03:03:11.984607 (+ 135us) service_pool.cc:227] Handling call
0925 03:03:12.495318 (+510711us) inbound_call.cc:173] Queueing success response
Metrics: {}
W20260925 03:03:12.687381 10613 rpcz_store.cc:267] Call kudu.rpc.GenericCalculatorService.Sleep from unix:<unnamed> (request call id 7) took 510 ms (client timeout 10 ms). Trace:
W20260925 03:03:12.687719 10613 rpcz_store.cc:269] 0925 03:03:12.176643 (+ 0us) service_pool.cc:170] Inserting onto call queue
0925 03:03:12.176777 (+ 134us) service_pool.cc:227] Handling call
0925 03:03:12.687319 (+510542us) inbound_call.cc:173] Queueing success response
Metrics: {}
I20260925 03:03:13.361449 10183 rpc-test-base.h:595] status: Timed out: Sleep RPC to unix:/tmp/dist-test-taskU5uprw/test-tmp/rpc-test-5c261c10ef9247708189d2d7afd80519.sock timed out after 1.000s (SENT), seconds elapsed: 1.00221
I20260925 03:03:13.363695 10613 rpc-test-base.h:222] got call: sleep_micros: 1500000
W20260925 03:03:13.871510 10615 rpcz_store.cc:267] Call kudu.rpc.GenericCalculatorService.Sleep from unix:<unnamed> (request call id 12) took 1511 ms (client timeout 1000 ms). Trace:
W20260925 03:03:13.871837 10615 rpcz_store.cc:269] 0925 03:03:12.359797 (+ 0us) service_pool.cc:170] Inserting onto call queue
0925 03:03:12.370824 (+ 11027us) service_pool.cc:227] Handling call
0925 03:03:13.871366 (+1500542us) inbound_call.cc:173] Queueing success response
Metrics: {}
I20260925 03:03:14.363319 10183 rpc-test-base.h:595] status: Timed out: Sleep RPC to unix:/tmp/dist-test-taskU5uprw/test-tmp/rpc-test-5c261c10ef9247708189d2d7afd80519.sock timed out after 1.000s (SENT), seconds elapsed: 1.00139
W20260925 03:03:14.364780 10608 messenger.cc:357] Unable to handle RPC call: Not implemented: call requires unsupported application feature flags: 99, 1
W20260925 03:03:14.366529 10608 messenger.cc:357] Unable to handle RPC call: Not implemented: call requires unsupported application feature flags: 99, 1
W20260925 03:03:14.585246 10608 connection.cc:196] Error closing socket: Network error: TlsSocket::Close: Broken pipe
W20260925 03:03:14.864501 10613 rpcz_store.cc:267] Call kudu.rpc.GenericCalculatorService.Sleep from unix:<unnamed> (request call id 13) took 1501 ms (client timeout 1000 ms). Trace:
W20260925 03:03:14.864897 10613 rpcz_store.cc:269] 0925 03:03:13.363287 (+ 0us) service_pool.cc:170] Inserting onto call queue
0925 03:03:13.363546 (+ 259us) service_pool.cc:227] Handling call
0925 03:03:14.864412 (+1500866us) inbound_call.cc:173] Queueing success response
Metrics: {}
W20260925 03:03:14.865476 10608 connection.cc:441] server connection from unix:<unnamed> torn down before Call kudu.rpc.GenericCalculatorService.Sleep from unix:<unnamed> (request call id 13) could send its response
[ OK ] Parameters/TestRpc.TestCancellation/SSL_UnixSocket (3280 ms)
[ RUN ] Parameters/TestRpc.TestCancellationMultiThreads/SSL_UnixSocket
I20260925 03:03:14.904279 10637 acceptor_pool.cc:254] collecting diagnostics on the listening RPC socket unix:/tmp/dist-test-taskU5uprw/test-tmp/rpc-test-2bbbef66bad34d2498a193ae78c53b01.sock every 8 connection(s)
I20260925 03:03:14.905301 10638 acceptor_pool.cc:254] collecting diagnostics on the listening RPC socket unix:/tmp/dist-test-taskU5uprw/test-tmp/rpc-test-2bbbef66bad34d2498a193ae78c53b01.sock every 8 connection(s)
I20260925 03:03:14.909159 10183 rpc-test.cc:1808] Connecting to unix:/tmp/dist-test-taskU5uprw/test-tmp/rpc-test-2bbbef66bad34d2498a193ae78c53b01.sock
I20260925 03:03:15.067124 10651 test_util.cc:268] Using random seed: -182663050
I20260925 03:03:15.068810 10652 test_util.cc:268] Using random seed: -182661290
I20260925 03:03:15.070533 10653 test_util.cc:268] Using random seed: -182659646
I20260925 03:03:15.072147 10654 test_util.cc:268] Using random seed: -182657951
I20260925 03:03:15.074055 10655 test_util.cc:268] Using random seed: -182656205
I20260925 03:03:15.075770 10656 test_util.cc:268] Using random seed: -182654453
I20260925 03:03:15.077706 10657 test_util.cc:268] Using random seed: -182652559
I20260925 03:03:15.079746 10658 test_util.cc:268] Using random seed: -182650561
I20260925 03:03:15.081302 10659 test_util.cc:268] Using random seed: -182648932
I20260925 03:03:15.082823 10660 test_util.cc:268] Using random seed: -182647399
I20260925 03:03:15.084376 10661 test_util.cc:268] Using random seed: -182645848
I20260925 03:03:15.086807 10662 test_util.cc:268] Using random seed: -182643456
I20260925 03:03:15.090750 10663 test_util.cc:268] Using random seed: -182639539
I20260925 03:03:15.092455 10664 test_util.cc:268] Using random seed: -182637809
I20260925 03:03:15.095870 10665 test_util.cc:268] Using random seed: -182634535
I20260925 03:03:15.099478 10666 test_util.cc:268] Using random seed: -182630903
I20260925 03:03:15.102138 10667 test_util.cc:268] Using random seed: -182628157
I20260925 03:03:15.104905 10668 test_util.cc:268] Using random seed: -182625361
I20260925 03:03:15.108399 10669 test_util.cc:268] Using random seed: -182621850
I20260925 03:03:15.110775 10670 test_util.cc:268] Using random seed: -182619541
I20260925 03:03:15.113575 10671 test_util.cc:268] Using random seed: -182616766
I20260925 03:03:15.116469 10672 test_util.cc:268] Using random seed: -182613846
I20260925 03:03:15.119064 10673 test_util.cc:268] Using random seed: -182611295
I20260925 03:03:15.121546 10674 test_util.cc:268] Using random seed: -182608784
I20260925 03:03:15.124819 10675 test_util.cc:268] Using random seed: -182605404
I20260925 03:03:15.127946 10676 test_util.cc:268] Using random seed: -182602852
I20260925 03:03:15.131376 10677 test_util.cc:268] Using random seed: -182598952
I20260925 03:03:15.133670 10678 test_util.cc:268] Using random seed: -182596780
I20260925 03:03:15.136024 10679 test_util.cc:268] Using random seed: -182594330
I20260925 03:03:15.138840 10680 test_util.cc:268] Using random seed: -182591574
W20260925 03:03:33.788858 10634 connection.cc:196] Error closing socket: Network error: TlsSocket::Close: Broken pipe
[ OK ] Parameters/TestRpc.TestCancellationMultiThreads/SSL_UnixSocket (18936 ms)
[ RUN ] Parameters/TestRpc.TestCallId/SSL_UnixSocket
I20260925 03:03:33.841143 10694 acceptor_pool.cc:254] collecting diagnostics on the listening RPC socket unix:/tmp/dist-test-taskU5uprw/test-tmp/rpc-test-463673c913654ee586a93e3aeb14821c.sock every 8 connection(s)
I20260925 03:03:33.841990 10695 acceptor_pool.cc:254] collecting diagnostics on the listening RPC socket unix:/tmp/dist-test-taskU5uprw/test-tmp/rpc-test-463673c913654ee586a93e3aeb14821c.sock every 8 connection(s)
[ OK ] Parameters/TestRpc.TestCallId/SSL_UnixSocket (91 ms)
[----------] 20 tests from Parameters/TestRpc (37689 ms total)
[----------] Global test environment tear-down
[==========] 21 tests from 2 test suites ran. (40915 ms total)
[ PASSED ] 20 tests.
[ FAILED ] 1 test, listed below:
[ FAILED ] Parameters/TestRpc.TestCallWithChainCertAndRootCA/SSL_UnixSocket, where GetParam() = (true, true)
1 FAILED TEST
I20260925 03:03:33.920893 10183 logging.cc:424] LogThrottler /data0/somelongdirectorytoavoidrpathissues/src/kudu/src/kudu/rpc/acceptor_pool.cc:285: suppressed but not reported on 3 messages since previous log ~33 seconds ago