Diagnosed failure

Parameters/TestRpc.TestCallWithChainCertAndChainCA/SSL_TCP: /data0/somelongdirectorytoavoidrpathissues/src/kudu/src/kudu/rpc/rpc-test.cc:270: Failure
Failed
Bad status: Runtime error: could not verify certificate chain (error with cert: subject=CN = localhost, ST = sadfjas, C = AS, emailAddress = sdflkdsajf, O = lskdfjlsad, OU = sldfkja, issuer=C = AS, ST = ASDfkjdhf, L = lskdjf, O = saldfja, OU = skdjf, CN = localhost, emailAddress = sadjflkadsj): : certificate has expired
Google Test trace:
/data0/somelongdirectorytoavoidrpathissues/src/kudu/src/kudu/rpc/rpc-test.cc:267: Connecting to 0.0.0.0:37179
I20260925 19:34:34.622215  3419 test_util.cc:175] -----------------------------------------------
I20260925 19:34:34.622378  3419 test_util.cc:176] Had fatal failures, leaving test files at /tmp/dist-test-task6di_CV/test-tmp/rpc-test.5.Parameters_TestRpc.TestCallWithChainCertAndChainCA_SSL_TCP.1790364873236591-3419-0

Full log

Note: This is test shard 6 of 8.
[==========] Running 21 tests from 2 test suites.
[----------] Global test environment set-up.
[----------] 20 tests from Parameters/TestRpc
[ RUN      ] Parameters/TestRpc.TestMessengerCreateDestroy/SSL_TCP
WARNING: Logging before InitGoogleLogging() is written to STDERR
I20260925 19:34:33.350731  3419 rpc-test.cc:169] started messenger TestCreateDestroy
[       OK ] Parameters/TestRpc.TestMessengerCreateDestroy/SSL_TCP (1196 ms)
[ RUN      ] Parameters/TestRpc.TestNegotiationDeadlock/SSL_TCP
I20260925 19:34:34.508749  3441 acceptor_pool.cc:254] collecting diagnostics on the listening RPC socket 0.0.0.0:37521 every 8 connection(s)
I20260925 19:34:34.510288  3442 acceptor_pool.cc:254] collecting diagnostics on the listening RPC socket 0.0.0.0:37521 every 8 connection(s)
[       OK ] Parameters/TestRpc.TestNegotiationDeadlock/SSL_TCP (76 ms)
[ RUN      ] Parameters/TestRpc.TestCallWithChainCertAndChainCA/SSL_TCP
I20260925 19:34:34.594053  3457 acceptor_pool.cc:254] collecting diagnostics on the listening RPC socket 0.0.0.0:37179 every 8 connection(s)
I20260925 19:34:34.596284  3458 acceptor_pool.cc:254] collecting diagnostics on the listening RPC socket 0.0.0.0:37179 every 8 connection(s)
/data0/somelongdirectorytoavoidrpathissues/src/kudu/src/kudu/rpc/rpc-test.cc:270: Failure
Failed
Bad status: Runtime error: could not verify certificate chain (error with cert: subject=CN = localhost, ST = sadfjas, C = AS, emailAddress = sdflkdsajf, O = lskdfjlsad, OU = sldfkja, issuer=C = AS, ST = ASDfkjdhf, L = lskdjf, O = saldfja, OU = skdjf, CN = localhost, emailAddress = sadjflkadsj): : certificate has expired
Google Test trace:
/data0/somelongdirectorytoavoidrpathissues/src/kudu/src/kudu/rpc/rpc-test.cc:267: Connecting to 0.0.0.0:37179
I20260925 19:34:34.622215  3419 test_util.cc:175] -----------------------------------------------
I20260925 19:34:34.622378  3419 test_util.cc:176] Had fatal failures, leaving test files at /tmp/dist-test-task6di_CV/test-tmp/rpc-test.5.Parameters_TestRpc.TestCallWithChainCertAndChainCA_SSL_TCP.1790364873236591-3419-0
[  FAILED  ] Parameters/TestRpc.TestCallWithChainCertAndChainCA/SSL_TCP, where GetParam() = (true, false) (58 ms)
[ RUN      ] Parameters/TestRpc.TestCallWithPasswordProtectedKey/SSL_TCP
I20260925 19:34:34.658270  3482 acceptor_pool.cc:254] collecting diagnostics on the listening RPC socket 0.0.0.0:43743 every 8 connection(s)
I20260925 19:34:34.659029  3483 acceptor_pool.cc:254] collecting diagnostics on the listening RPC socket 0.0.0.0:43743 every 8 connection(s)
[       OK ] Parameters/TestRpc.TestCallWithPasswordProtectedKey/SSL_TCP (85 ms)
[ RUN      ] Parameters/TestRpc.TestCallToBadServer/SSL_TCP
I20260925 19:34:34.735627  3419 rpc-test.cc:394] Status: Network error: Client connection negotiation failed: client connection to 0.0.0.0:0: connect: Connection refused (error 111)
I20260925 19:34:34.737195  3419 rpc-test.cc:394] Status: Network error: Client connection negotiation failed: client connection to 0.0.0.0:0: connect: Connection refused (error 111)
I20260925 19:34:34.738775  3419 rpc-test.cc:394] Status: Network error: Client connection negotiation failed: client connection to 0.0.0.0:0: connect: Connection refused (error 111)
I20260925 19:34:34.740191  3419 rpc-test.cc:394] Status: Network error: Client connection negotiation failed: client connection to 0.0.0.0:0: connect: Connection refused (error 111)
I20260925 19:34:34.741739  3419 rpc-test.cc:394] Status: Network error: Client connection negotiation failed: client connection to 0.0.0.0:0: connect: Connection refused (error 111)
[       OK ] Parameters/TestRpc.TestCallToBadServer/SSL_TCP (36 ms)
[ RUN      ] Parameters/TestRpc.TestWrongService/SSL_TCP
I20260925 19:34:34.767057  3517 acceptor_pool.cc:254] collecting diagnostics on the listening RPC socket 0.0.0.0:43371 every 8 connection(s)
I20260925 19:34:34.767875  3518 acceptor_pool.cc:254] collecting diagnostics on the listening RPC socket 0.0.0.0:43371 every 8 connection(s)
I20260925 19:34:34.798671  3515 messenger.cc:345] service WrongServiceName not registered on TestServer
[       OK ] Parameters/TestRpc.TestWrongService/SSL_TCP (62 ms)
[ RUN      ] Parameters/TestRpc.TestConnectionKeepalive/SSL_TCP
I20260925 19:34:34.825948  3540 acceptor_pool.cc:254] collecting diagnostics on the listening RPC socket 0.0.0.0:38673 every 8 connection(s)
I20260925 19:34:34.826686  3541 acceptor_pool.cc:254] collecting diagnostics on the listening RPC socket 0.0.0.0:38673 every 8 connection(s)
I20260925 19:34:34.829873  3419 rpc-test.cc:488] Connecting to 0.0.0.0:38673
[       OK ] Parameters/TestRpc.TestConnectionKeepalive/SSL_TCP (1101 ms)
[ RUN      ] Parameters/TestRpc.TestClientConnectionMetrics/SSL_TCP
I20260925 19:34:35.954176  3565 acceptor_pool.cc:254] collecting diagnostics on the listening RPC socket 0.0.0.0:33593 every 8 connection(s)
I20260925 19:34:35.954999  3566 acceptor_pool.cc:254] collecting diagnostics on the listening RPC socket 0.0.0.0:33593 every 8 connection(s)
I20260925 19:34:35.958607  3419 rpc-test.cc:569] Connecting to 0.0.0.0:33593
[       OK ] Parameters/TestRpc.TestClientConnectionMetrics/SSL_TCP (116926 ms)
[ RUN      ] Parameters/TestRpc.TestCredentialsPolicy/SSL_TCP
I20260925 19:36:32.864048  3599 acceptor_pool.cc:254] collecting diagnostics on the listening RPC socket 0.0.0.0:37489 every 8 connection(s)
I20260925 19:36:32.864929  3600 acceptor_pool.cc:254] collecting diagnostics on the listening RPC socket 0.0.0.0:37489 every 8 connection(s)
I20260925 19:36:32.868114  3419 rpc-test.cc:700] Connecting to 0.0.0.0:37489
[       OK ] Parameters/TestRpc.TestCredentialsPolicy/SSL_TCP (97 ms)
[ RUN      ] Parameters/TestRpc.TestCallLongerThanKeepalive/SSL_TCP
I20260925 19:36:32.954488  3624 acceptor_pool.cc:254] collecting diagnostics on the listening RPC socket 0.0.0.0:42213 every 8 connection(s)
I20260925 19:36:32.955228  3625 acceptor_pool.cc:254] collecting diagnostics on the listening RPC socket 0.0.0.0:42213 every 8 connection(s)
I20260925 19:36:32.987113  3628 rpc-test-base.h:222] got call: sleep_micros: 3000000 deferred: true
I20260925 19:36:35.991633  3628 rpcz_store.cc:275] Call kudu.rpc.GenericCalculatorService.Sleep from 127.0.0.1:35378 (request call id 0) took 3004 ms. Trace:
I20260925 19:36:35.992031  3628 rpcz_store.cc:276] 0925 19:36:32.986795 (+     0us) service_pool.cc:170] Inserting onto call queue
0925 19:36:32.986887 (+    92us) service_pool.cc:227] Handling call
0925 19:36:35.991454 (+3004567us) inbound_call.cc:173] Queueing success response
Metrics: {}
[       OK ] Parameters/TestRpc.TestCallLongerThanKeepalive/SSL_TCP (3072 ms)
[ RUN      ] Parameters/TestRpc.TestRpcSidecar/SSL_TCP
I20260925 19:36:36.024192  3650 acceptor_pool.cc:254] collecting diagnostics on the listening RPC socket 0.0.0.0:35413 every 8 connection(s)
I20260925 19:36:36.024989  3651 acceptor_pool.cc:254] collecting diagnostics on the listening RPC socket 0.0.0.0:35413 every 8 connection(s)
[       OK ] Parameters/TestRpc.TestRpcSidecar/SSL_TCP (521 ms)
[ RUN      ] Parameters/TestRpc.TestRpcSidecarLimits/SSL_TCP
I20260925 19:36:53.303853  3676 acceptor_pool.cc:254] collecting diagnostics on the listening RPC socket 0.0.0.0:41493 every 8 connection(s)
I20260925 19:36:53.304626  3677 acceptor_pool.cc:254] collecting diagnostics on the listening RPC socket 0.0.0.0:41493 every 8 connection(s)
W20260925 19:36:53.330111  3419 serialization.cc:72] Serialized kudu.rpc_test.PushStringsRequestPB (2147483654 bytes) is larger than the maximum configured RPC message size (52428800 bytes). Sending anyway, but peer may reject the data.
W20260925 19:36:53.342178  3673 connection.cc:535] server connection from 127.0.0.1:59880 recv error: Network error: RPC frame had a length of 2147483714, but we only support messages up to 52428800 bytes long.
W20260925 19:36:53.342602  3673 connection.cc:158] shutting down server connection from 127.0.0.1:59880 with pending inbound data: 4/2147483714 bytes received; last active 0 ns ago: status Network error: RPC frame had a length of 2147483714, but we only support messages up to 52428800 bytes long.
W20260925 19:36:53.343632  3689 connection.cc:698] client connection to 0.0.0.0:41493 send error: Network error: failed to write to TLS socket: Connection reset by peer
W20260925 19:36:53.344260  3689 connection.cc:196] Error closing socket: Network error: TlsSocket::Close: Success
[       OK ] Parameters/TestRpc.TestRpcSidecarLimits/SSL_TCP (17668 ms)
[ RUN      ] Parameters/TestRpc.TestCallTimeoutDoesntAffectNegotiation/SSL_TCP
I20260925 19:36:54.213927  3702 acceptor_pool.cc:254] collecting diagnostics on the listening RPC socket 0.0.0.0:34445 every 8 connection(s)
I20260925 19:36:54.214859  3703 acceptor_pool.cc:254] collecting diagnostics on the listening RPC socket 0.0.0.0:34445 every 8 connection(s)
W20260925 19:36:54.234205  3698 negotiation.cc:266] Injecting 500ms delay in negotiation
I20260925 19:36:54.283797  3419 rpc-test-base.h:595] status: Timed out: connection negotiation to 0.0.0.0:34445 for RPC Sleep timed out after 0.050s (ON_OUTBOUND_QUEUE), seconds elapsed: 0.0506665
[       OK ] Parameters/TestRpc.TestCallTimeoutDoesntAffectNegotiation/SSL_TCP (557 ms)
[ RUN      ] Parameters/TestRpc.TestRpcHandlerLatencyMetric/SSL_TCP
I20260925 19:36:54.776955  3727 acceptor_pool.cc:254] collecting diagnostics on the listening RPC socket 0.0.0.0:42459 every 8 connection(s)
I20260925 19:36:54.777727  3728 acceptor_pool.cc:254] collecting diagnostics on the listening RPC socket 0.0.0.0:42459 every 8 connection(s)
I20260925 19:36:54.826141  3419 rpc-test.cc:1236] Sleep() min lat: 21564
I20260925 19:36:54.826365  3419 rpc-test.cc:1237] Sleep() mean lat: 21564
I20260925 19:36:54.826599  3419 rpc-test.cc:1238] Sleep() max lat: 21564
I20260925 19:36:54.826771  3419 rpc-test.cc:1239] Sleep() #calls: 1
[       OK ] Parameters/TestRpc.TestRpcHandlerLatencyMetric/SSL_TCP (81 ms)
[ RUN      ] Parameters/TestRpc.TimedOutOnResponseMetricServiceQueue/SSL_TCP
I20260925 19:36:54.851918  3753 acceptor_pool.cc:254] collecting diagnostics on the listening RPC socket 0.0.0.0:45763 every 8 connection(s)
I20260925 19:36:54.852620  3754 acceptor_pool.cc:254] collecting diagnostics on the listening RPC socket 0.0.0.0:45763 every 8 connection(s)
W20260925 19:36:54.937789  3755 rpcz_store.cc:267] Call kudu.rpc_test.CalculatorService.Sleep from 127.0.0.1:58344 (request call id 2) took 20 ms (client timeout 20 ms). Trace:
W20260925 19:36:54.938135  3755 rpcz_store.cc:269] 0925 19:36:54.917438 (+     0us) service_pool.cc:170] Inserting onto call queue
0925 19:36:54.937667 (+ 20229us) service_pool.cc:214] Skipping call since client already timed out
0925 19:36:54.937744 (+    77us) inbound_call.cc:173] Queueing failure response
Metrics: {}
[       OK ] Parameters/TestRpc.TimedOutOnResponseMetricServiceQueue/SSL_TCP (110 ms)
[ RUN      ] Parameters/TestRpc.RpcPendingConnectionsMetric/SSL_TCP
I20260925 19:36:54.954792  3776 acceptor_pool.cc:254] collecting diagnostics on the listening RPC socket 0.0.0.0:34927 every 8 connection(s)
I20260925 19:36:54.955552  3777 acceptor_pool.cc:254] collecting diagnostics on the listening RPC socket 0.0.0.0:34927 every 8 connection(s)
W20260925 19:36:54.960567  3772 negotiation.cc:337] Failed RPC negotiation. Trace:
0925 19:36:54.959385 (+     0us) reactor.cc:625] Submitting negotiation task for server connection from 127.0.0.1:35694 (local address 127.0.0.1:34927)
0925 19:36:54.959787 (+   402us) server_negotiation.cc:206] Beginning negotiation
0925 19:36:54.959805 (+    18us) server_negotiation.cc:399] Waiting for connection header
0925 19:36:54.960049 (+   244us) negotiation.cc:327] Negotiation complete: Network error: Server connection negotiation failed: server connection from 127.0.0.1:35694: BlockingRecv error: recv got EOF from 127.0.0.1:35694 (error 108)
Metrics: {"server-negotiator.queue_time_us":109}
[       OK ] Parameters/TestRpc.RpcPendingConnectionsMetric/SSL_TCP (29 ms)
[ RUN      ] Parameters/TestRpc.TestRpcContextClientDeadline/SSL_TCP
I20260925 19:36:54.991647  3792 acceptor_pool.cc:254] collecting diagnostics on the listening RPC socket 0.0.0.0:43223 every 8 connection(s)
I20260925 19:36:54.992365  3793 acceptor_pool.cc:254] collecting diagnostics on the listening RPC socket 0.0.0.0:43223 every 8 connection(s)
[       OK ] Parameters/TestRpc.TestRpcContextClientDeadline/SSL_TCP (91 ms)
[ RUN      ] Parameters/TestRpc.TestApplicationFeatureFlagUnsupportedServer/SSL_TCP
I20260925 19:36:55.087440  3817 acceptor_pool.cc:254] collecting diagnostics on the listening RPC socket 0.0.0.0:46111 every 8 connection(s)
I20260925 19:36:55.088145  3818 acceptor_pool.cc:254] collecting diagnostics on the listening RPC socket 0.0.0.0:46111 every 8 connection(s)
[       OK ] Parameters/TestRpc.TestApplicationFeatureFlagUnsupportedServer/SSL_TCP (56 ms)
[ RUN      ] Parameters/TestRpc.TestCancellationAsync/SSL_TCP
I20260925 19:36:55.141269  3842 acceptor_pool.cc:254] collecting diagnostics on the listening RPC socket 0.0.0.0:39241 every 8 connection(s)
I20260925 19:36:55.142081  3843 acceptor_pool.cc:254] collecting diagnostics on the listening RPC socket 0.0.0.0:39241 every 8 connection(s)
I20260925 19:36:55.145153  3419 rpc-test.cc:1716] Connecting to 0.0.0.0:39241
I20260925 19:36:55.179860  3419 test_util.cc:268] Using random seed: -692092354
I20260925 19:36:55.410132  3846 rpc-test-base.h:240] got call: sleep_micros: 500 pattern: 4294967295 num_repetitions: 2097152 sidecar_idx: 0
I20260925 19:36:55.601771  3846 rpc-test-base.h:240] got call: sleep_micros: 500 pattern: 4294967295 num_repetitions: 2097152 sidecar_idx: 0
I20260925 19:36:55.785848  3846 rpc-test-base.h:240] got call: sleep_micros: 500 pattern: 4294967295 num_repetitions: 2097152 sidecar_idx: 0
I20260925 19:36:55.969148  3846 rpc-test-base.h:240] got call: sleep_micros: 500 pattern: 4294967295 num_repetitions: 2097152 sidecar_idx: 0
I20260925 19:36:56.153734  3846 rpc-test-base.h:240] got call: sleep_micros: 500 pattern: 4294967295 num_repetitions: 2097152 sidecar_idx: 0
I20260925 19:36:56.333990  3846 rpc-test-base.h:240] got call: sleep_micros: 500 pattern: 4294967295 num_repetitions: 2097152 sidecar_idx: 0
I20260925 19:36:56.507877  3845 rpc-test-base.h:240] got call: sleep_micros: 500 pattern: 4294967295 num_repetitions: 2097152 sidecar_idx: 0
I20260925 19:36:56.693596  3846 rpc-test-base.h:240] got call: sleep_micros: 500 pattern: 4294967295 num_repetitions: 2097152 sidecar_idx: 0
W20260925 19:36:56.845639  3840 connection.cc:196] Error closing socket: Network error: TlsSocket::Close: Broken pipe
W20260925 19:36:56.864570  3840 connection.cc:441] server connection from 127.0.0.1:58558 torn down before Call kudu.rpc.GenericCalculatorService.SleepWithSidecar from 127.0.0.1:58558 (request call id 8) could send its response
[       OK ] Parameters/TestRpc.TestCancellationAsync/SSL_TCP (1752 ms)
[ RUN      ] Parameters/TestRpc.TestPerformanceBySocketType/SSL_TCP
I20260925 19:36:56.979900  3867 acceptor_pool.cc:254] collecting diagnostics on the listening RPC socket 0.0.0.0:42459 every 8 connection(s)
I20260925 19:36:56.980718  3868 acceptor_pool.cc:254] collecting diagnostics on the listening RPC socket 0.0.0.0:42459 every 8 connection(s)
I20260925 19:36:56.984066  3419 rpc-test.cc:1846] Connecting to 0.0.0.0:42459
I20260925 19:37:16.314051  3419 rpc-test.cc:1859] Sending 1024MB via ssl-enabled tcp socket: real 19.318s	user 16.801s	sys 10.727s
I20260925 19:37:35.351850  3419 rpc-test.cc:1859] Sending 1024MB via ssl-enabled tcp socket: real 19.037s	user 16.465s	sys 10.533s
I20260925 19:37:54.351902  3419 rpc-test.cc:1859] Sending 1024MB via ssl-enabled tcp socket: real 19.000s	user 15.931s	sys 10.913s
I20260925 19:38:13.424311  3419 rpc-test.cc:1859] Sending 1024MB via ssl-enabled tcp socket: real 19.072s	user 16.336s	sys 10.686s
I20260925 19:38:32.390865  3419 rpc-test.cc:1859] Sending 1024MB via ssl-enabled tcp socket: real 18.966s	user 16.407s	sys 10.454s
[       OK ] Parameters/TestRpc.TestPerformanceBySocketType/SSL_TCP (95533 ms)
[----------] 20 tests from Parameters/TestRpc (239118 ms total)

[----------] 1 test from Parameters/TestRpcSocketTxRxQueue
[ RUN      ] Parameters/TestRpcSocketTxRxQueue.OverCapacity/0
W20260925 19:38:32.836715  3911 negotiation.cc:337] Failed RPC negotiation. Trace:
0925 19:38:32.431049 (+     0us) reactor.cc:625] Submitting negotiation task for client connection to 0.0.0.0:38275 (local address 127.0.0.1:48802)
0925 19:38:32.431461 (+   412us) negotiation.cc:107] Waiting for socket to connect
0925 19:38:32.431489 (+    28us) client_negotiation.cc:174] Beginning negotiation
0925 19:38:32.431659 (+   170us) client_negotiation.cc:252] Sending NEGOTIATE NegotiatePB request
0925 19:38:32.835577 (+403918us) negotiation.cc:327] Negotiation complete: Network error: Client connection negotiation failed: client connection to 0.0.0.0:38275: BlockingRecv error: recv error from unknown peer: Transport endpoint is not connected (error 107)
Metrics: {"client-negotiator.queue_time_us":98}
W20260925 19:38:32.836975  3893 negotiation.cc:337] Failed RPC negotiation. Trace:
0925 19:38:32.417393 (+     0us) reactor.cc:625] Submitting negotiation task for client connection to 0.0.0.0:38275 (local address 127.0.0.1:48782)
0925 19:38:32.418130 (+   737us) negotiation.cc:107] Waiting for socket to connect
0925 19:38:32.418178 (+    48us) client_negotiation.cc:174] Beginning negotiation
0925 19:38:32.418683 (+   505us) client_negotiation.cc:252] Sending NEGOTIATE NegotiatePB request
0925 19:38:32.835577 (+416894us) negotiation.cc:327] Negotiation complete: Network error: Client connection negotiation failed: client connection to 0.0.0.0:38275: BlockingRecv error: recv error from unknown peer: Transport endpoint is not connected (error 107)
Metrics: {"client-negotiator.queue_time_us":176}
W20260925 19:38:32.837007  3902 negotiation.cc:337] Failed RPC negotiation. Trace:
0925 19:38:32.423716 (+     0us) reactor.cc:625] Submitting negotiation task for client connection to 0.0.0.0:38275 (local address 127.0.0.1:48794)
0925 19:38:32.424216 (+   500us) negotiation.cc:107] Waiting for socket to connect
0925 19:38:32.424245 (+    29us) client_negotiation.cc:174] Beginning negotiation
0925 19:38:32.424414 (+   169us) client_negotiation.cc:252] Sending NEGOTIATE NegotiatePB request
0925 19:38:32.835772 (+411358us) negotiation.cc:327] Negotiation complete: Network error: Client connection negotiation failed: client connection to 0.0.0.0:38275: BlockingRecv error: recv error from unknown peer: Transport endpoint is not connected (error 107)
Metrics: {"client-negotiator.queue_time_us":103}
W20260925 19:38:32.837189  3929 negotiation.cc:337] Failed RPC negotiation. Trace:
0925 19:38:32.454639 (+     0us) reactor.cc:625] Submitting negotiation task for client connection to 0.0.0.0:38275 (local address 127.0.0.1:48810)
0925 19:38:32.455184 (+   545us) negotiation.cc:107] Waiting for socket to connect
0925 19:38:32.455213 (+    29us) client_negotiation.cc:174] Beginning negotiation
0925 19:38:32.455509 (+   296us) client_negotiation.cc:252] Sending NEGOTIATE NegotiatePB request
0925 19:38:32.836148 (+380639us) negotiation.cc:327] Negotiation complete: Network error: Client connection negotiation failed: client connection to 0.0.0.0:38275: BlockingRecv error: recv error from unknown peer: Transport endpoint is not connected (error 107)
Metrics: {"client-negotiator.queue_time_us":141}
W20260925 19:38:32.838331  3920 negotiation.cc:337] Failed RPC negotiation. Trace:
0925 19:38:32.442824 (+     0us) reactor.cc:625] Submitting negotiation task for client connection to 0.0.0.0:38275 (local address 127.0.0.1:48804)
0925 19:38:32.443386 (+   562us) negotiation.cc:107] Waiting for socket to connect
0925 19:38:32.443414 (+    28us) client_negotiation.cc:174] Beginning negotiation
0925 19:38:32.443710 (+   296us) client_negotiation.cc:252] Sending NEGOTIATE NegotiatePB request
0925 19:38:32.835711 (+392001us) negotiation.cc:327] Negotiation complete: Network error: Client connection negotiation failed: client connection to 0.0.0.0:38275: BlockingRecv error: recv error from unknown peer: Transport endpoint is not connected (error 107)
Metrics: {"client-negotiator.queue_time_us":150}
W20260925 19:38:32.839125  3938 negotiation.cc:337] Failed RPC negotiation. Trace:
0925 19:38:32.465967 (+     0us) reactor.cc:625] Submitting negotiation task for client connection to 0.0.0.0:38275 (local address 127.0.0.1:48814)
0925 19:38:32.466527 (+   560us) negotiation.cc:107] Waiting for socket to connect
0925 19:38:32.466590 (+    63us) client_negotiation.cc:174] Beginning negotiation
0925 19:38:32.466882 (+   292us) client_negotiation.cc:252] Sending NEGOTIATE NegotiatePB request
0925 19:38:32.838033 (+371151us) negotiation.cc:327] Negotiation complete: Network error: Client connection negotiation failed: client connection to 0.0.0.0:38275: BlockingRecv error: recv error from unknown peer: Transport endpoint is not connected (error 107)
Metrics: {"client-negotiator.queue_time_us":149}
[       OK ] Parameters/TestRpcSocketTxRxQueue.OverCapacity/0 (1231 ms)
[----------] 1 test from Parameters/TestRpcSocketTxRxQueue (1231 ms total)

[----------] Global test environment tear-down
[==========] 21 tests from 2 test suites ran. (240351 ms total)
[  PASSED  ] 20 tests.
[  FAILED  ] 1 test, listed below:
[  FAILED  ] Parameters/TestRpc.TestCallWithChainCertAndChainCA/SSL_TCP, where GetParam() = (true, false)

 1 FAILED TEST