Diagnosed failure
Parameters/TestRpc.TestCallWithChainCertAndChainCA/SSL_UnixSocket: /data0/somelongdirectorytoavoidrpathissues/src/kudu/src/kudu/rpc/rpc-test.cc:270: Failure
Failed
Bad status: Runtime error: could not verify certificate chain (error with cert: subject=CN = localhost, ST = sadfjas, C = AS, emailAddress = sdflkdsajf, O = lskdfjlsad, OU = sldfkja, issuer=C = AS, ST = ASDfkjdhf, L = lskdjf, O = saldfja, OU = skdjf, CN = localhost, emailAddress = sadjflkadsj): : certificate has expired
Google Test trace:
/data0/somelongdirectorytoavoidrpathissues/src/kudu/src/kudu/rpc/rpc-test.cc:267: Connecting to unix:/tmp/dist-test-taskR_p0OX/test-tmp/rpc-test-0f4849ef0aa24bca943ebb5616f79f40.sock
I20260928 03:52:38.410123 6609 test_util.cc:175] -----------------------------------------------
I20260928 03:52:38.410322 6609 test_util.cc:176] Had fatal failures, leaving test files at /tmp/dist-test-taskR_p0OX/test-tmp/rpc-test.6.Parameters_TestRpc.TestCallWithChainCertAndChainCA_SSL_UnixSocket.1790567557012426-6609-0
Full log
Note: This is test shard 7 of 8.
[==========] Running 21 tests from 2 test suites.
[----------] Global test environment set-up.
[----------] 20 tests from Parameters/TestRpc
[ RUN ] Parameters/TestRpc.TestMessengerCreateDestroy/SSL_UnixSocket
WARNING: Logging before InitGoogleLogging() is written to STDERR
I20260928 03:52:37.115098 6609 rpc-test.cc:169] started messenger TestCreateDestroy
[ OK ] Parameters/TestRpc.TestMessengerCreateDestroy/SSL_UnixSocket (1186 ms)
[ RUN ] Parameters/TestRpc.TestNegotiationDeadlock/SSL_UnixSocket
I20260928 03:52:38.290707 6631 acceptor_pool.cc:254] collecting diagnostics on the listening RPC socket unix:/tmp/dist-test-taskR_p0OX/test-tmp/rpc-test-cc65d59e6c9a4468aa9596652bb2a921.sock every 8 connection(s)
I20260928 03:52:38.292470 6632 acceptor_pool.cc:254] collecting diagnostics on the listening RPC socket unix:/tmp/dist-test-taskR_p0OX/test-tmp/rpc-test-cc65d59e6c9a4468aa9596652bb2a921.sock every 8 connection(s)
[ OK ] Parameters/TestRpc.TestNegotiationDeadlock/SSL_UnixSocket (93 ms)
[ RUN ] Parameters/TestRpc.TestCallWithChainCertAndChainCA/SSL_UnixSocket
I20260928 03:52:38.378988 6647 acceptor_pool.cc:254] collecting diagnostics on the listening RPC socket unix:/tmp/dist-test-taskR_p0OX/test-tmp/rpc-test-0f4849ef0aa24bca943ebb5616f79f40.sock every 8 connection(s)
I20260928 03:52:38.381420 6648 acceptor_pool.cc:254] collecting diagnostics on the listening RPC socket unix:/tmp/dist-test-taskR_p0OX/test-tmp/rpc-test-0f4849ef0aa24bca943ebb5616f79f40.sock every 8 connection(s)
/data0/somelongdirectorytoavoidrpathissues/src/kudu/src/kudu/rpc/rpc-test.cc:270: Failure
Failed
Bad status: Runtime error: could not verify certificate chain (error with cert: subject=CN = localhost, ST = sadfjas, C = AS, emailAddress = sdflkdsajf, O = lskdfjlsad, OU = sldfkja, issuer=C = AS, ST = ASDfkjdhf, L = lskdjf, O = saldfja, OU = skdjf, CN = localhost, emailAddress = sadjflkadsj): : certificate has expired
Google Test trace:
/data0/somelongdirectorytoavoidrpathissues/src/kudu/src/kudu/rpc/rpc-test.cc:267: Connecting to unix:/tmp/dist-test-taskR_p0OX/test-tmp/rpc-test-0f4849ef0aa24bca943ebb5616f79f40.sock
I20260928 03:52:38.410123 6609 test_util.cc:175] -----------------------------------------------
I20260928 03:52:38.410322 6609 test_util.cc:176] Had fatal failures, leaving test files at /tmp/dist-test-taskR_p0OX/test-tmp/rpc-test.6.Parameters_TestRpc.TestCallWithChainCertAndChainCA_SSL_UnixSocket.1790567557012426-6609-0
[ FAILED ] Parameters/TestRpc.TestCallWithChainCertAndChainCA/SSL_UnixSocket, where GetParam() = (true, true) (64 ms)
[ RUN ] Parameters/TestRpc.TestCallWithPasswordProtectedKey/SSL_UnixSocket
I20260928 03:52:38.439515 6672 acceptor_pool.cc:254] collecting diagnostics on the listening RPC socket unix:/tmp/dist-test-taskR_p0OX/test-tmp/rpc-test-9628446704f14557b6d1a6aff09a857a.sock every 8 connection(s)
I20260928 03:52:38.440295 6673 acceptor_pool.cc:254] collecting diagnostics on the listening RPC socket unix:/tmp/dist-test-taskR_p0OX/test-tmp/rpc-test-9628446704f14557b6d1a6aff09a857a.sock every 8 connection(s)
W20260928 03:52:38.484542 6669 connection.cc:196] Error closing socket: Network error: TlsSocket::Close: Broken pipe
[ OK ] Parameters/TestRpc.TestCallWithPasswordProtectedKey/SSL_UnixSocket (79 ms)
[ RUN ] Parameters/TestRpc.TestCallToBadServer/SSL_UnixSocket
I20260928 03:52:38.507323 6609 rpc-test.cc:394] Status: Network error: Client connection negotiation failed: client connection to 0.0.0.0:0: connect: Connection refused (error 111)
I20260928 03:52:38.508708 6609 rpc-test.cc:394] Status: Network error: Client connection negotiation failed: client connection to 0.0.0.0:0: connect: Connection refused (error 111)
I20260928 03:52:38.510058 6609 rpc-test.cc:394] Status: Network error: Client connection negotiation failed: client connection to 0.0.0.0:0: connect: Connection refused (error 111)
I20260928 03:52:38.511405 6609 rpc-test.cc:394] Status: Network error: Client connection negotiation failed: client connection to 0.0.0.0:0: connect: Connection refused (error 111)
I20260928 03:52:38.512701 6609 rpc-test.cc:394] Status: Network error: Client connection negotiation failed: client connection to 0.0.0.0:0: connect: Connection refused (error 111)
[ OK ] Parameters/TestRpc.TestCallToBadServer/SSL_UnixSocket (25 ms)
[ RUN ] Parameters/TestRpc.TestWrongService/SSL_UnixSocket
I20260928 03:52:38.530470 6707 acceptor_pool.cc:254] collecting diagnostics on the listening RPC socket unix:/tmp/dist-test-taskR_p0OX/test-tmp/rpc-test-4772c20f44644148b0b5e816e16d2853.sock every 8 connection(s)
I20260928 03:52:38.531307 6708 acceptor_pool.cc:254] collecting diagnostics on the listening RPC socket unix:/tmp/dist-test-taskR_p0OX/test-tmp/rpc-test-4772c20f44644148b0b5e816e16d2853.sock every 8 connection(s)
I20260928 03:52:38.575556 6704 messenger.cc:345] service WrongServiceName not registered on TestServer
[ OK ] Parameters/TestRpc.TestWrongService/SSL_UnixSocket (72 ms)
[ RUN ] Parameters/TestRpc.TestConnectionKeepalive/SSL_UnixSocket
I20260928 03:52:38.616500 6730 acceptor_pool.cc:254] collecting diagnostics on the listening RPC socket unix:/tmp/dist-test-taskR_p0OX/test-tmp/rpc-test-aff90358f14b4c9da22441732e6cd81b.sock every 8 connection(s)
I20260928 03:52:38.617437 6731 acceptor_pool.cc:254] collecting diagnostics on the listening RPC socket unix:/tmp/dist-test-taskR_p0OX/test-tmp/rpc-test-aff90358f14b4c9da22441732e6cd81b.sock every 8 connection(s)
I20260928 03:52:38.621845 6609 rpc-test.cc:488] Connecting to unix:/tmp/dist-test-taskR_p0OX/test-tmp/rpc-test-aff90358f14b4c9da22441732e6cd81b.sock
W20260928 03:52:39.091096 6743 connection.cc:196] Error closing socket: Network error: TlsSocket::Close: Broken pipe
[ OK ] Parameters/TestRpc.TestConnectionKeepalive/SSL_UnixSocket (1089 ms)
[ RUN ] Parameters/TestRpc.TestClientConnectionMetrics/SSL_UnixSocket
I20260928 03:52:39.733808 6755 acceptor_pool.cc:254] collecting diagnostics on the listening RPC socket unix:/tmp/dist-test-taskR_p0OX/test-tmp/rpc-test-9ece36c2282542f198b0122ac8ecdcab.sock every 8 connection(s)
I20260928 03:52:39.734516 6756 acceptor_pool.cc:254] collecting diagnostics on the listening RPC socket unix:/tmp/dist-test-taskR_p0OX/test-tmp/rpc-test-9ece36c2282542f198b0122ac8ecdcab.sock every 8 connection(s)
I20260928 03:52:39.738175 6609 rpc-test.cc:569] Connecting to unix:/tmp/dist-test-taskR_p0OX/test-tmp/rpc-test-9ece36c2282542f198b0122ac8ecdcab.sock
W20260928 03:55:00.893559 6752 connection.cc:196] Error closing socket: Network error: TlsSocket::Close: Broken pipe
[ OK ] Parameters/TestRpc.TestClientConnectionMetrics/SSL_UnixSocket (141224 ms)
[ RUN ] Parameters/TestRpc.TestCredentialsPolicy/SSL_UnixSocket
I20260928 03:55:00.931250 6792 acceptor_pool.cc:254] collecting diagnostics on the listening RPC socket unix:/tmp/dist-test-taskR_p0OX/test-tmp/rpc-test-dbd8611db77c43d0805f4ffa09d0dc13.sock every 8 connection(s)
I20260928 03:55:00.932291 6793 acceptor_pool.cc:254] collecting diagnostics on the listening RPC socket unix:/tmp/dist-test-taskR_p0OX/test-tmp/rpc-test-dbd8611db77c43d0805f4ffa09d0dc13.sock every 8 connection(s)
I20260928 03:55:00.935971 6609 rpc-test.cc:700] Connecting to unix:/tmp/dist-test-taskR_p0OX/test-tmp/rpc-test-dbd8611db77c43d0805f4ffa09d0dc13.sock
W20260928 03:55:00.999720 6791 connection.cc:196] Error closing socket: Network error: TlsSocket::Close: Broken pipe
[ OK ] Parameters/TestRpc.TestCredentialsPolicy/SSL_UnixSocket (120 ms)
[ RUN ] Parameters/TestRpc.TestCallLongerThanKeepalive/SSL_UnixSocket
I20260928 03:55:01.041972 6817 acceptor_pool.cc:254] collecting diagnostics on the listening RPC socket unix:/tmp/dist-test-taskR_p0OX/test-tmp/rpc-test-af9f3e6bf76c4585b6d7eb2a2c05cf3f.sock every 8 connection(s)
I20260928 03:55:01.042729 6818 acceptor_pool.cc:254] collecting diagnostics on the listening RPC socket unix:/tmp/dist-test-taskR_p0OX/test-tmp/rpc-test-af9f3e6bf76c4585b6d7eb2a2c05cf3f.sock every 8 connection(s)
I20260928 03:55:01.089061 6821 rpc-test-base.h:222] got call: sleep_micros: 3000000 deferred: true
I20260928 03:55:04.093350 6821 rpcz_store.cc:275] Call kudu.rpc.GenericCalculatorService.Sleep from unix:<unnamed> (request call id 0) took 3004 ms. Trace:
I20260928 03:55:04.093647 6821 rpcz_store.cc:276] 0928 03:55:01.088891 (+ 0us) service_pool.cc:170] Inserting onto call queue
0928 03:55:01.089003 (+ 112us) service_pool.cc:227] Handling call
0928 03:55:04.093284 (+3004281us) inbound_call.cc:173] Queueing success response
Metrics: {}
W20260928 03:55:04.098014 6814 connection.cc:196] Error closing socket: Network error: TlsSocket::Close: Broken pipe
[ OK ] Parameters/TestRpc.TestCallLongerThanKeepalive/SSL_UnixSocket (3081 ms)
[ RUN ] Parameters/TestRpc.TestRpcSidecar/SSL_UnixSocket
I20260928 03:55:04.140093 6842 acceptor_pool.cc:254] collecting diagnostics on the listening RPC socket unix:/tmp/dist-test-taskR_p0OX/test-tmp/rpc-test-1d7b0d6411a143b18c1afa76501ee296.sock every 8 connection(s)
I20260928 03:55:04.140965 6843 acceptor_pool.cc:254] collecting diagnostics on the listening RPC socket unix:/tmp/dist-test-taskR_p0OX/test-tmp/rpc-test-1d7b0d6411a143b18c1afa76501ee296.sock every 8 connection(s)
W20260928 03:55:04.670140 6839 connection.cc:196] Error closing socket: Network error: TlsSocket::Close: Broken pipe
[ OK ] Parameters/TestRpc.TestRpcSidecar/SSL_UnixSocket (571 ms)
[ RUN ] Parameters/TestRpc.TestRpcSidecarLimits/SSL_UnixSocket
I20260928 03:55:21.598156 6869 acceptor_pool.cc:254] collecting diagnostics on the listening RPC socket unix:/tmp/dist-test-taskR_p0OX/test-tmp/rpc-test-27cd80b04f4343a09a0c483b44e6739e.sock every 8 connection(s)
I20260928 03:55:21.599004 6870 acceptor_pool.cc:254] collecting diagnostics on the listening RPC socket unix:/tmp/dist-test-taskR_p0OX/test-tmp/rpc-test-27cd80b04f4343a09a0c483b44e6739e.sock every 8 connection(s)
W20260928 03:55:21.622435 6609 serialization.cc:72] Serialized kudu.rpc_test.PushStringsRequestPB (2147483654 bytes) is larger than the maximum configured RPC message size (52428800 bytes). Sending anyway, but peer may reject the data.
W20260928 03:55:21.632369 6866 connection.cc:535] server connection from unix:<unnamed> recv error: Network error: RPC frame had a length of 2147483714, but we only support messages up to 52428800 bytes long.
W20260928 03:55:21.632696 6866 connection.cc:158] shutting down server connection from unix:<unnamed> with pending inbound data: 4/2147483714 bytes received; last active 0 ns ago: status Network error: RPC frame had a length of 2147483714, but we only support messages up to 52428800 bytes long.
W20260928 03:55:21.633633 6882 connection.cc:698] client connection to unix:/tmp/dist-test-taskR_p0OX/test-tmp/rpc-test-27cd80b04f4343a09a0c483b44e6739e.sock send error: Network error: failed to write to TLS socket: Broken pipe
W20260928 03:55:21.634181 6882 connection.cc:196] Error closing socket: Network error: TlsSocket::Close: Success
[ OK ] Parameters/TestRpc.TestRpcSidecarLimits/SSL_UnixSocket (17632 ms)
[ RUN ] Parameters/TestRpc.TestCallTimeoutDoesntAffectNegotiation/SSL_UnixSocket
I20260928 03:55:22.331459 6894 acceptor_pool.cc:254] collecting diagnostics on the listening RPC socket unix:/tmp/dist-test-taskR_p0OX/test-tmp/rpc-test-d3e90be03096474c85db9b042b79f75f.sock every 8 connection(s)
I20260928 03:55:22.332221 6895 acceptor_pool.cc:254] collecting diagnostics on the listening RPC socket unix:/tmp/dist-test-taskR_p0OX/test-tmp/rpc-test-d3e90be03096474c85db9b042b79f75f.sock every 8 connection(s)
W20260928 03:55:22.368239 6890 negotiation.cc:266] Injecting 500ms delay in negotiation
I20260928 03:55:22.417780 6609 rpc-test-base.h:595] status: Timed out: connection negotiation to unix:/tmp/dist-test-taskR_p0OX/test-tmp/rpc-test-d3e90be03096474c85db9b042b79f75f.sock for RPC Sleep timed out after 0.050s (ON_OUTBOUND_QUEUE), seconds elapsed: 0.0505681
[ OK ] Parameters/TestRpc.TestCallTimeoutDoesntAffectNegotiation/SSL_UnixSocket (576 ms)
[ RUN ] Parameters/TestRpc.TestRpcHandlerLatencyMetric/SSL_UnixSocket
I20260928 03:55:22.921206 6919 acceptor_pool.cc:254] collecting diagnostics on the listening RPC socket unix:/tmp/dist-test-taskR_p0OX/test-tmp/rpc-test-1b5c8c69551a4b8f9620fddeddf30f89.sock every 8 connection(s)
I20260928 03:55:22.921814 6920 acceptor_pool.cc:254] collecting diagnostics on the listening RPC socket unix:/tmp/dist-test-taskR_p0OX/test-tmp/rpc-test-1b5c8c69551a4b8f9620fddeddf30f89.sock every 8 connection(s)
I20260928 03:55:22.974947 6609 rpc-test.cc:1236] Sleep() min lat: 21679
I20260928 03:55:22.975147 6609 rpc-test.cc:1237] Sleep() mean lat: 21679
I20260928 03:55:22.975332 6609 rpc-test.cc:1238] Sleep() max lat: 21679
I20260928 03:55:22.975492 6609 rpc-test.cc:1239] Sleep() #calls: 1
W20260928 03:55:22.977877 6916 connection.cc:196] Error closing socket: Network error: TlsSocket::Close: Broken pipe
[ OK ] Parameters/TestRpc.TestRpcHandlerLatencyMetric/SSL_UnixSocket (98 ms)
[ RUN ] Parameters/TestRpc.TimedOutOnResponseMetricServiceQueue/SSL_UnixSocket
I20260928 03:55:22.998862 6945 acceptor_pool.cc:254] collecting diagnostics on the listening RPC socket unix:/tmp/dist-test-taskR_p0OX/test-tmp/rpc-test-be18956fc92e47aead46b94d87eafbf2.sock every 8 connection(s)
I20260928 03:55:22.999583 6946 acceptor_pool.cc:254] collecting diagnostics on the listening RPC socket unix:/tmp/dist-test-taskR_p0OX/test-tmp/rpc-test-be18956fc92e47aead46b94d87eafbf2.sock every 8 connection(s)
W20260928 03:55:23.092278 6947 rpcz_store.cc:267] Call kudu.rpc_test.CalculatorService.Sleep from unix:<unnamed> (request call id 2) took 20 ms (client timeout 20 ms). Trace:
W20260928 03:55:23.092648 6947 rpcz_store.cc:269] 0928 03:55:23.071797 (+ 0us) service_pool.cc:170] Inserting onto call queue
0928 03:55:23.092147 (+ 20350us) service_pool.cc:214] Skipping call since client already timed out
0928 03:55:23.092231 (+ 84us) inbound_call.cc:173] Queueing failure response
Metrics: {}
W20260928 03:55:23.095193 6942 connection.cc:196] Error closing socket: Network error: TlsSocket::Close: Broken pipe
[ OK ] Parameters/TestRpc.TimedOutOnResponseMetricServiceQueue/SSL_UnixSocket (118 ms)
[ RUN ] Parameters/TestRpc.RpcPendingConnectionsMetric/SSL_UnixSocket
I20260928 03:55:23.111730 6968 acceptor_pool.cc:254] collecting diagnostics on the listening RPC socket 0.0.0.0:38123 every 8 connection(s)
I20260928 03:55:23.112449 6969 acceptor_pool.cc:254] collecting diagnostics on the listening RPC socket 0.0.0.0:38123 every 8 connection(s)
W20260928 03:55:23.117689 6964 negotiation.cc:337] Failed RPC negotiation. Trace:
0928 03:55:23.116329 (+ 0us) reactor.cc:625] Submitting negotiation task for server connection from 127.0.0.1:39468 (local address 127.0.0.1:38123)
0928 03:55:23.116863 (+ 534us) server_negotiation.cc:206] Beginning negotiation
0928 03:55:23.116881 (+ 18us) server_negotiation.cc:399] Waiting for connection header
0928 03:55:23.117122 (+ 241us) negotiation.cc:327] Negotiation complete: Network error: Server connection negotiation failed: server connection from 127.0.0.1:39468: BlockingRecv error: recv got EOF from 127.0.0.1:39468 (error 108)
Metrics: {"server-negotiator.queue_time_us":225}
[ OK ] Parameters/TestRpc.RpcPendingConnectionsMetric/SSL_UnixSocket (29 ms)
[ RUN ] Parameters/TestRpc.TestRpcContextClientDeadline/SSL_UnixSocket
I20260928 03:55:23.147388 6984 acceptor_pool.cc:254] collecting diagnostics on the listening RPC socket unix:/tmp/dist-test-taskR_p0OX/test-tmp/rpc-test-472be347478a419589d6c1126d866422.sock every 8 connection(s)
I20260928 03:55:23.148109 6985 acceptor_pool.cc:254] collecting diagnostics on the listening RPC socket unix:/tmp/dist-test-taskR_p0OX/test-tmp/rpc-test-472be347478a419589d6c1126d866422.sock every 8 connection(s)
[ OK ] Parameters/TestRpc.TestRpcContextClientDeadline/SSL_UnixSocket (82 ms)
[ RUN ] Parameters/TestRpc.TestApplicationFeatureFlagUnsupportedServer/SSL_UnixSocket
I20260928 03:55:23.229833 7009 acceptor_pool.cc:254] collecting diagnostics on the listening RPC socket unix:/tmp/dist-test-taskR_p0OX/test-tmp/rpc-test-748f6b2bc3bd40d795abe273f12e30af.sock every 8 connection(s)
I20260928 03:55:23.230558 7010 acceptor_pool.cc:254] collecting diagnostics on the listening RPC socket unix:/tmp/dist-test-taskR_p0OX/test-tmp/rpc-test-748f6b2bc3bd40d795abe273f12e30af.sock every 8 connection(s)
W20260928 03:55:23.262147 7006 connection.cc:196] Error closing socket: Network error: TlsSocket::Close: Broken pipe
[ OK ] Parameters/TestRpc.TestApplicationFeatureFlagUnsupportedServer/SSL_UnixSocket (53 ms)
[ RUN ] Parameters/TestRpc.TestCancellationAsync/SSL_UnixSocket
I20260928 03:55:23.290516 7034 acceptor_pool.cc:254] collecting diagnostics on the listening RPC socket unix:/tmp/dist-test-taskR_p0OX/test-tmp/rpc-test-104f36f502ea48458e442fcf49178dc7.sock every 8 connection(s)
I20260928 03:55:23.291289 7035 acceptor_pool.cc:254] collecting diagnostics on the listening RPC socket unix:/tmp/dist-test-taskR_p0OX/test-tmp/rpc-test-104f36f502ea48458e442fcf49178dc7.sock every 8 connection(s)
I20260928 03:55:23.294344 6609 rpc-test.cc:1716] Connecting to unix:/tmp/dist-test-taskR_p0OX/test-tmp/rpc-test-104f36f502ea48458e442fcf49178dc7.sock
I20260928 03:55:23.314848 6609 test_util.cc:268] Using random seed: 152579692
I20260928 03:55:23.540023 7038 rpc-test-base.h:240] got call: sleep_micros: 500 pattern: 4294967295 num_repetitions: 2097152 sidecar_idx: 0
I20260928 03:55:23.754925 7038 rpc-test-base.h:240] got call: sleep_micros: 500 pattern: 4294967295 num_repetitions: 2097152 sidecar_idx: 0
I20260928 03:55:23.985093 7038 rpc-test-base.h:240] got call: sleep_micros: 500 pattern: 4294967295 num_repetitions: 2097152 sidecar_idx: 0
I20260928 03:55:24.205145 7038 rpc-test-base.h:240] got call: sleep_micros: 500 pattern: 4294967295 num_repetitions: 2097152 sidecar_idx: 0
I20260928 03:55:24.408674 7037 rpc-test-base.h:240] got call: sleep_micros: 500 pattern: 4294967295 num_repetitions: 2097152 sidecar_idx: 0
I20260928 03:55:24.591682 7038 rpc-test-base.h:240] got call: sleep_micros: 500 pattern: 4294967295 num_repetitions: 2097152 sidecar_idx: 0
I20260928 03:55:24.812705 7037 rpc-test-base.h:240] got call: sleep_micros: 500 pattern: 4294967295 num_repetitions: 2097152 sidecar_idx: 0
I20260928 03:55:25.004074 7038 rpc-test-base.h:240] got call: sleep_micros: 500 pattern: 4294967295 num_repetitions: 2097152 sidecar_idx: 0
I20260928 03:55:25.221138 7038 rpc-test-base.h:240] got call: sleep_micros: 500 pattern: 4294967295 num_repetitions: 2097152 sidecar_idx: 0
W20260928 03:55:25.235677 7031 connection.cc:196] Error closing socket: Network error: TlsSocket::Close: Broken pipe
W20260928 03:55:25.353756 7031 connection.cc:441] server connection from unix:<unnamed> torn down before Call kudu.rpc.GenericCalculatorService.SleepWithSidecar from unix:<unnamed> (request call id 9) could send its response
[ OK ] Parameters/TestRpc.TestCancellationAsync/SSL_UnixSocket (2095 ms)
[ RUN ] Parameters/TestRpc.TestPerformanceBySocketType/SSL_UnixSocket
I20260928 03:55:25.467514 7059 acceptor_pool.cc:254] collecting diagnostics on the listening RPC socket unix:/tmp/dist-test-taskR_p0OX/test-tmp/rpc-test-bc8da72a22f440ed81580573125dfb1c.sock every 8 connection(s)
I20260928 03:55:25.468235 7060 acceptor_pool.cc:254] collecting diagnostics on the listening RPC socket unix:/tmp/dist-test-taskR_p0OX/test-tmp/rpc-test-bc8da72a22f440ed81580573125dfb1c.sock every 8 connection(s)
I20260928 03:55:25.471414 6609 rpc-test.cc:1846] Connecting to unix:/tmp/dist-test-taskR_p0OX/test-tmp/rpc-test-bc8da72a22f440ed81580573125dfb1c.sock
I20260928 03:55:47.210988 6609 rpc-test.cc:1859] Sending 1024MB via ssl-enabled unix socket: real 21.713s user 19.248s sys 13.412s
I20260928 03:56:08.922061 6609 rpc-test.cc:1859] Sending 1024MB via ssl-enabled unix socket: real 21.711s user 19.413s sys 13.287s
I20260928 03:56:30.957540 6609 rpc-test.cc:1859] Sending 1024MB via ssl-enabled unix socket: real 22.035s user 19.981s sys 13.230s
I20260928 03:56:52.575390 6609 rpc-test.cc:1859] Sending 1024MB via ssl-enabled unix socket: real 21.617s user 19.507s sys 13.033s
I20260928 03:57:14.477687 6609 rpc-test.cc:1859] Sending 1024MB via ssl-enabled unix socket: real 21.902s user 19.660s sys 13.334s
W20260928 03:57:14.483939 7056 connection.cc:196] Error closing socket: Network error: TlsSocket::Close: Broken pipe
[ OK ] Parameters/TestRpc.TestPerformanceBySocketType/SSL_UnixSocket (109132 ms)
[----------] 20 tests from Parameters/TestRpc (277430 ms total)
[----------] 1 test from Parameters/TestRpcSocketTxRxQueue
[ RUN ] Parameters/TestRpcSocketTxRxQueue.AcceptorRxQueueSizeMetric/0
I20260928 03:57:14.507601 7095 acceptor_pool.cc:254] collecting diagnostics on the listening RPC socket 0.0.0.0:40961 every 1 connection(s)
I20260928 03:57:14.508483 7096 acceptor_pool.cc:254] collecting diagnostics on the listening RPC socket 0.0.0.0:40961 every 1 connection(s)
W20260928 03:57:14.514112 7091 negotiation.cc:337] Failed RPC negotiation. Trace:
0928 03:57:14.512465 (+ 0us) reactor.cc:625] Submitting negotiation task for server connection from 127.0.0.1:37450 (local address 127.0.0.1:40961)
0928 03:57:14.512939 (+ 474us) server_negotiation.cc:206] Beginning negotiation
0928 03:57:14.512962 (+ 23us) server_negotiation.cc:399] Waiting for connection header
0928 03:57:14.513208 (+ 246us) negotiation.cc:327] Negotiation complete: Network error: Server connection negotiation failed: server connection from 127.0.0.1:37450: BlockingRecv error: recv got EOF from 127.0.0.1:37450 (error 108)
Metrics: {"server-negotiator.queue_time_us":130}
[ OK ] Parameters/TestRpcSocketTxRxQueue.AcceptorRxQueueSizeMetric/0 (24 ms)
[----------] 1 test from Parameters/TestRpcSocketTxRxQueue (24 ms total)
[----------] Global test environment tear-down
[==========] 21 tests from 2 test suites ran. (277455 ms total)
[ PASSED ] 20 tests.
[ FAILED ] 1 test, listed below:
[ FAILED ] Parameters/TestRpc.TestCallWithChainCertAndChainCA/SSL_UnixSocket, where GetParam() = (true, true)
1 FAILED TEST