Parameters/TestRpc.TestCallWithChainCertAndRootCA/SSL_TCP: /data0/somelongdirectorytoavoidrpathissues/src/kudu/src/kudu/rpc/rpc-test.cc:303: Failure
Failed
Bad status: Runtime error: could not verify certificate chain (error with cert: subject=CN = localhost, ST = sadfjas, C = AS, emailAddress = sdflkdsajf, O = lskdfjlsad, OU = sldfkja, issuer=C = AS, ST = ASDfkjdhf, L = lskdjf, O = saldfja, OU = skdjf, CN = localhost, emailAddress = sadjflkadsj): : certificate has expired
Google Test trace:
/data0/somelongdirectorytoavoidrpathissues/src/kudu/src/kudu/rpc/rpc-test.cc:300: Connecting to 0.0.0.0:36101
I20260929 21:42:02.272476 390 test_util.cc:175] -----------------------------------------------
I20260929 21:42:02.272660 390 test_util.cc:176] Had fatal failures, leaving test files at /tmp/dist-test-taskF6lETu/test-tmp/rpc-test.1.Parameters_TestRpc.TestCallWithChainCertAndRootCA_SSL_TCP.1790718120708432-390-0
Note: This is test shard 2 of 8.
[==========] Running 21 tests from 2 test suites.
[----------] Global test environment set-up.
[----------] 1 test from TestRpc
[ RUN ] TestRpc.TestMethodsByName
[ OK ] TestRpc.TestMethodsByName (6 ms)
[----------] 1 test from TestRpc (7 ms total)
[----------] 20 tests from Parameters/TestRpc
[ RUN ] Parameters/TestRpc.TestAcceptorPoolStartStop/SSL_TCP
WARNING: Logging before InitGoogleLogging() is written to STDERR
I20260929 21:42:00.841889 405 acceptor_pool.cc:254] collecting diagnostics on the listening RPC socket 0.0.0.0:35709 every 8 connection(s)
I20260929 21:42:00.843453 406 acceptor_pool.cc:254] collecting diagnostics on the listening RPC socket 0.0.0.0:35709 every 8 connection(s)
I20260929 21:42:02.055366 417 acceptor_pool.cc:254] collecting diagnostics on the listening RPC socket 0.0.0.0:42275 every 8 connection(s)
I20260929 21:42:02.056879 418 acceptor_pool.cc:254] collecting diagnostics on the listening RPC socket 0.0.0.0:42275 every 8 connection(s)
I20260929 21:42:02.077797 428 acceptor_pool.cc:254] collecting diagnostics on the listening RPC socket 0.0.0.0:46035 every 8 connection(s)
I20260929 21:42:02.079097 429 acceptor_pool.cc:254] collecting diagnostics on the listening RPC socket 0.0.0.0:46035 every 8 connection(s)
I20260929 21:42:02.100337 439 acceptor_pool.cc:254] collecting diagnostics on the listening RPC socket 0.0.0.0:38003 every 8 connection(s)
I20260929 21:42:02.101105 440 acceptor_pool.cc:254] collecting diagnostics on the listening RPC socket 0.0.0.0:38003 every 8 connection(s)
I20260929 21:42:02.121580 450 acceptor_pool.cc:254] collecting diagnostics on the listening RPC socket 0.0.0.0:42295 every 8 connection(s)
I20260929 21:42:02.122299 451 acceptor_pool.cc:254] collecting diagnostics on the listening RPC socket 0.0.0.0:42295 every 8 connection(s)
[ OK ] Parameters/TestRpc.TestAcceptorPoolStartStop/SSL_TCP (1359 ms)
[ RUN ] Parameters/TestRpc.TestCall/SSL_TCP
I20260929 21:42:02.154748 463 acceptor_pool.cc:254] collecting diagnostics on the listening RPC socket 0.0.0.0:46461 every 8 connection(s)
I20260929 21:42:02.157363 464 acceptor_pool.cc:254] collecting diagnostics on the listening RPC socket 0.0.0.0:46461 every 8 connection(s)
I20260929 21:42:02.163156 390 rpc-test.cc:234] Connecting to 0.0.0.0:46461
[ OK ] Parameters/TestRpc.TestCall/SSL_TCP (108 ms)
[ RUN ] Parameters/TestRpc.TestCallWithChainCertAndRootCA/SSL_TCP
I20260929 21:42:02.251984 488 acceptor_pool.cc:254] collecting diagnostics on the listening RPC socket 0.0.0.0:36101 every 8 connection(s)
I20260929 21:42:02.252745 489 acceptor_pool.cc:254] collecting diagnostics on the listening RPC socket 0.0.0.0:36101 every 8 connection(s)
/data0/somelongdirectorytoavoidrpathissues/src/kudu/src/kudu/rpc/rpc-test.cc:303: Failure
Failed
Bad status: Runtime error: could not verify certificate chain (error with cert: subject=CN = localhost, ST = sadfjas, C = AS, emailAddress = sdflkdsajf, O = lskdfjlsad, OU = sldfkja, issuer=C = AS, ST = ASDfkjdhf, L = lskdjf, O = saldfja, OU = skdjf, CN = localhost, emailAddress = sadjflkadsj): : certificate has expired
Google Test trace:
/data0/somelongdirectorytoavoidrpathissues/src/kudu/src/kudu/rpc/rpc-test.cc:300: Connecting to 0.0.0.0:36101
I20260929 21:42:02.272476 390 test_util.cc:175] -----------------------------------------------
I20260929 21:42:02.272660 390 test_util.cc:176] Had fatal failures, leaving test files at /tmp/dist-test-taskF6lETu/test-tmp/rpc-test.1.Parameters_TestRpc.TestCallWithChainCertAndRootCA_SSL_TCP.1790718120708432-390-0
[ FAILED ] Parameters/TestRpc.TestCallWithChainCertAndRootCA/SSL_TCP, where GetParam() = (true, false) (37 ms)
[ RUN ] Parameters/TestRpc.TestCallWithBadPasswordProtectedKey/SSL_TCP
[ OK ] Parameters/TestRpc.TestCallWithBadPasswordProtectedKey/SSL_TCP (30 ms)
[ RUN ] Parameters/TestRpc.TestInvalidMethodCall/SSL_TCP
I20260929 21:42:02.328163 525 acceptor_pool.cc:254] collecting diagnostics on the listening RPC socket 0.0.0.0:42297 every 8 connection(s)
I20260929 21:42:02.329058 526 acceptor_pool.cc:254] collecting diagnostics on the listening RPC socket 0.0.0.0:42297 every 8 connection(s)
I20260929 21:42:02.332446 390 rpc-test.cc:406] Connecting to 0.0.0.0:42297
[ OK ] Parameters/TestRpc.TestInvalidMethodCall/SSL_TCP (65 ms)
[ RUN ] Parameters/TestRpc.TestHighFDs/SSL_TCP
I20260929 21:42:02.582048 550 acceptor_pool.cc:254] collecting diagnostics on the listening RPC socket 0.0.0.0:41445 every 8 connection(s)
I20260929 21:42:02.582779 551 acceptor_pool.cc:254] collecting diagnostics on the listening RPC socket 0.0.0.0:41445 every 8 connection(s)
[ OK ] Parameters/TestRpc.TestHighFDs/SSL_TCP (271 ms)
[ RUN ] Parameters/TestRpc.TestConnectionAlwaysKeepalive/SSL_TCP
I20260929 21:42:02.679332 573 acceptor_pool.cc:254] collecting diagnostics on the listening RPC socket 0.0.0.0:41159 every 8 connection(s)
I20260929 21:42:02.680043 574 acceptor_pool.cc:254] collecting diagnostics on the listening RPC socket 0.0.0.0:41159 every 8 connection(s)
I20260929 21:42:02.683118 390 rpc-test.cc:532] Connecting to 0.0.0.0:41159
[ OK ] Parameters/TestRpc.TestConnectionAlwaysKeepalive/SSL_TCP (3076 ms)
[ RUN ] Parameters/TestRpc.TestReopenOutboundConnections/SSL_TCP
I20260929 21:42:05.743721 596 acceptor_pool.cc:254] collecting diagnostics on the listening RPC socket 0.0.0.0:45937 every 8 connection(s)
I20260929 21:42:05.744477 597 acceptor_pool.cc:254] collecting diagnostics on the listening RPC socket 0.0.0.0:45937 every 8 connection(s)
I20260929 21:42:05.747762 390 rpc-test.cc:658] Connecting to 0.0.0.0:45937
[ OK ] Parameters/TestRpc.TestReopenOutboundConnections/SSL_TCP (388 ms)
[ RUN ] Parameters/TestRpc.TestConnectionNetworkPlane/SSL_TCP
I20260929 21:42:06.122849 619 acceptor_pool.cc:254] collecting diagnostics on the listening RPC socket 0.0.0.0:39327 every 8 connection(s)
I20260929 21:42:06.123569 620 acceptor_pool.cc:254] collecting diagnostics on the listening RPC socket 0.0.0.0:39327 every 8 connection(s)
I20260929 21:42:06.126713 390 rpc-test.cc:772] Connecting to 0.0.0.0:39327
[ OK ] Parameters/TestRpc.TestConnectionNetworkPlane/SSL_TCP (72 ms)
[ RUN ] Parameters/TestRpc.TestTCPKeepalive/SSL_TCP
I20260929 21:42:06.202178 644 acceptor_pool.cc:254] collecting diagnostics on the listening RPC socket 0.0.0.0:39475 every 8 connection(s)
I20260929 21:42:06.202889 645 acceptor_pool.cc:254] collecting diagnostics on the listening RPC socket 0.0.0.0:39475 every 8 connection(s)
I20260929 21:42:06.236124 648 rpc-test-base.h:222] got call: sleep_micros: 8000000 deferred: true
I20260929 21:42:14.240226 648 rpcz_store.cc:275] Call kudu.rpc.GenericCalculatorService.Sleep from 127.0.0.1:49108 (request call id 0) took 8004 ms. Trace:
I20260929 21:42:14.240667 648 rpcz_store.cc:276] 0929 21:42:06.235862 (+ 0us) service_pool.cc:170] Inserting onto call queue
0929 21:42:06.235962 (+ 100us) service_pool.cc:227] Handling call
0929 21:42:14.240024 (+8004062us) inbound_call.cc:173] Queueing success response
Metrics: {}
[ OK ] Parameters/TestRpc.TestTCPKeepalive/SSL_TCP (8074 ms)
[ RUN ] Parameters/TestRpc.TestMaxSmallSidecars/SSL_TCP
I20260929 21:42:14.279208 670 acceptor_pool.cc:254] collecting diagnostics on the listening RPC socket 0.0.0.0:34963 every 8 connection(s)
I20260929 21:42:14.280040 671 acceptor_pool.cc:254] collecting diagnostics on the listening RPC socket 0.0.0.0:34963 every 8 connection(s)
[ OK ] Parameters/TestRpc.TestMaxSmallSidecars/SSL_TCP (200 ms)
[ RUN ] Parameters/TestRpc.TestCallTimeout/SSL_TCP
I20260929 21:42:14.474169 695 acceptor_pool.cc:254] collecting diagnostics on the listening RPC socket 0.0.0.0:34645 every 8 connection(s)
I20260929 21:42:14.474890 696 acceptor_pool.cc:254] collecting diagnostics on the listening RPC socket 0.0.0.0:34645 every 8 connection(s)
I20260929 21:42:14.495715 390 rpc-test-base.h:595] status: Timed out: connection negotiation to 0.0.0.0:34645 for RPC Sleep timed out after 0.000s (ON_OUTBOUND_QUEUE), seconds elapsed: 0.00256721
I20260929 21:42:14.504464 699 rpc-test-base.h:222] got call: sleep_micros: 700000
I20260929 21:42:14.697139 390 rpc-test-base.h:595] status: Timed out: Sleep RPC to 0.0.0.0:34645 timed out after 0.200s (SENT), seconds elapsed: 0.200901
I20260929 21:42:14.698612 698 rpc-test-base.h:222] got call: sleep_micros: 2000000
W20260929 21:42:15.205096 699 rpcz_store.cc:267] Call kudu.rpc.GenericCalculatorService.Sleep from 127.0.0.1:44234 (request call id 1) took 700 ms (client timeout 200 ms). Trace:
W20260929 21:42:15.205437 699 rpcz_store.cc:269] 0929 21:42:14.504311 (+ 0us) service_pool.cc:170] Inserting onto call queue
0929 21:42:14.504409 (+ 98us) service_pool.cc:227] Handling call
0929 21:42:15.205032 (+700623us) inbound_call.cc:173] Queueing success response
Metrics: {}
I20260929 21:42:16.199445 390 rpc-test-base.h:595] status: Timed out: Sleep RPC to 0.0.0.0:34645 timed out after 1.500s (SENT), seconds elapsed: 1.502
W20260929 21:42:16.699103 698 rpcz_store.cc:267] Call kudu.rpc.GenericCalculatorService.Sleep from 127.0.0.1:44234 (request call id 2) took 2000 ms (client timeout 1500 ms). Trace:
W20260929 21:42:16.699404 698 rpcz_store.cc:269] 0929 21:42:14.698323 (+ 0us) service_pool.cc:170] Inserting onto call queue
0929 21:42:14.698455 (+ 132us) service_pool.cc:227] Handling call
0929 21:42:16.699049 (+2000594us) inbound_call.cc:173] Queueing success response
Metrics: {}
W20260929 21:42:16.700043 692 connection.cc:441] server connection from 127.0.0.1:44234 torn down before Call kudu.rpc.GenericCalculatorService.Sleep from 127.0.0.1:44234 (request call id 2) could send its response
[ OK ] Parameters/TestRpc.TestCallTimeout/SSL_TCP (2250 ms)
[ RUN ] Parameters/TestRpc.TestServerShutsDown/SSL_TCP
I20260929 21:42:16.707002 390 rpc-test.cc:1125] Connecting to 0.0.0.0:33939
W20260929 21:42:16.716709 712 negotiation.cc:337] Failed RPC negotiation. Trace:
0929 21:42:16.715175 (+ 0us) reactor.cc:625] Submitting negotiation task for client connection to 0.0.0.0:33939 (local address 127.0.0.1:34462)
0929 21:42:16.715639 (+ 464us) negotiation.cc:107] Waiting for socket to connect
0929 21:42:16.715674 (+ 35us) client_negotiation.cc:174] Beginning negotiation
0929 21:42:16.715889 (+ 215us) client_negotiation.cc:252] Sending NEGOTIATE NegotiatePB request
0929 21:42:16.716099 (+ 210us) negotiation.cc:327] Negotiation complete: Network error: Client connection negotiation failed: client connection to 0.0.0.0:33939: BlockingWrite error: write error: Broken pipe (error 32)
Metrics: {"client-negotiator.queue_time_us":124}
[ OK ] Parameters/TestRpc.TestServerShutsDown/SSL_TCP (14 ms)
[ RUN ] Parameters/TestRpc.TimedOutOnResponseMetric/SSL_TCP
I20260929 21:42:16.744414 729 acceptor_pool.cc:254] collecting diagnostics on the listening RPC socket 0.0.0.0:42129 every 8 connection(s)
I20260929 21:42:16.745151 730 acceptor_pool.cc:254] collecting diagnostics on the listening RPC socket 0.0.0.0:42129 every 8 connection(s)
W20260929 21:42:16.989619 733 rpcz_store.cc:267] Call kudu.rpc_test.CalculatorService.Sleep from 127.0.0.1:36040 (request call id 3) took 50 ms (client timeout 25 ms). Trace:
W20260929 21:42:16.989902 733 rpcz_store.cc:269] 0929 21:42:16.939006 (+ 0us) service_pool.cc:170] Inserting onto call queue
0929 21:42:16.939151 (+ 145us) service_pool.cc:227] Handling call
0929 21:42:16.989552 (+ 50401us) inbound_call.cc:173] Queueing success response
Related trace 'test_child':
Metrics: {"test_sleep_us":50000,"child_traces":[["test_child",{"related_trace_metric":1}]]}
W20260929 21:42:17.049252 733 rpcz_store.cc:267] Call kudu.rpc_test.CalculatorService.Sleep from 127.0.0.1:36040 (request call id 4) took 50 ms (client timeout 50 ms). Trace:
W20260929 21:42:17.049554 733 rpcz_store.cc:269] 0929 21:42:16.998677 (+ 0us) service_pool.cc:170] Inserting onto call queue
0929 21:42:16.998795 (+ 118us) service_pool.cc:227] Handling call
0929 21:42:17.049183 (+ 50388us) inbound_call.cc:173] Queueing success response
Related trace 'test_child':
Metrics: {"test_sleep_us":50000,"child_traces":[["test_child",{"related_trace_metric":1}]]}
[ OK ] Parameters/TestRpc.TimedOutOnResponseMetric/SSL_TCP (338 ms)
[ RUN ] Parameters/TestRpc.AcceptorDispatchingTimesMetric/SSL_TCP
I20260929 21:42:17.070106 754 acceptor_pool.cc:254] collecting diagnostics on the listening RPC socket 0.0.0.0:36967 every 8 connection(s)
I20260929 21:42:17.070844 755 acceptor_pool.cc:254] collecting diagnostics on the listening RPC socket 0.0.0.0:36967 every 8 connection(s)
W20260929 21:42:17.075778 750 negotiation.cc:337] Failed RPC negotiation. Trace:
0929 21:42:17.074641 (+ 0us) reactor.cc:625] Submitting negotiation task for server connection from 127.0.0.1:59686 (local address 127.0.0.1:36967)
0929 21:42:17.075091 (+ 450us) server_negotiation.cc:206] Beginning negotiation
0929 21:42:17.075108 (+ 17us) server_negotiation.cc:399] Waiting for connection header
0929 21:42:17.075334 (+ 226us) negotiation.cc:327] Negotiation complete: Network error: Server connection negotiation failed: server connection from 127.0.0.1:59686: BlockingRecv error: recv got EOF from 127.0.0.1:59686 (error 108)
Metrics: {"server-negotiator.queue_time_us":141}
[ OK ] Parameters/TestRpc.AcceptorDispatchingTimesMetric/SSL_TCP (22 ms)
[ RUN ] Parameters/TestRpc.TestRpcCallbackDestroysMessenger/SSL_TCP
[ OK ] Parameters/TestRpc.TestRpcCallbackDestroysMessenger/SSL_TCP (20 ms)
[ RUN ] Parameters/TestRpc.TestApplicationFeatureFlag/SSL_TCP
I20260929 21:42:17.125659 779 acceptor_pool.cc:254] collecting diagnostics on the listening RPC socket 0.0.0.0:43885 every 8 connection(s)
I20260929 21:42:17.126389 780 acceptor_pool.cc:254] collecting diagnostics on the listening RPC socket 0.0.0.0:43885 every 8 connection(s)
W20260929 21:42:17.162149 778 messenger.cc:357] Unable to handle RPC call: Not implemented: call requires unsupported application feature flags: 99
[ OK ] Parameters/TestRpc.TestApplicationFeatureFlag/SSL_TCP (68 ms)
[ RUN ] Parameters/TestRpc.TestCancellation/SSL_TCP
I20260929 21:42:17.190505 804 acceptor_pool.cc:254] collecting diagnostics on the listening RPC socket 0.0.0.0:34003 every 8 connection(s)
I20260929 21:42:17.191226 805 acceptor_pool.cc:254] collecting diagnostics on the listening RPC socket 0.0.0.0:34003 every 8 connection(s)
I20260929 21:42:17.194306 390 rpc-test.cc:1648] Connecting to 0.0.0.0:34003
I20260929 21:42:17.341240 390 rpc-test-base.h:595] status: Aborted: Sleep RPC to 0.0.0.0:34003 is cancelled in state READY, seconds elapsed: 0.000415272
I20260929 21:42:17.485702 390 rpc-test-base.h:595] status: Aborted: Sleep RPC to 0.0.0.0:34003 is cancelled in state SENT, seconds elapsed: 0.000920504
I20260929 21:42:17.555951 807 rpc-test-base.h:222] got call: sleep_micros: 510000
I20260929 21:42:17.667181 390 rpc-test-base.h:595] status: Aborted: Sleep RPC to 0.0.0.0:34003 is cancelled in state SENT, seconds elapsed: 0.00083798
I20260929 21:42:17.709390 806 rpc-test-base.h:222] got call: sleep_micros: 510000
I20260929 21:42:17.831390 390 rpc-test-base.h:595] status: Aborted: Sleep RPC to 0.0.0.0:34003 is cancelled in state SENT, seconds elapsed: 0.000827585
W20260929 21:42:17.871572 808 rpcz_store.cc:267] Call kudu.rpc.GenericCalculatorService.Sleep from 127.0.0.1:47690 (request call id 11) took 14 ms (client timeout 10 ms). Trace:
W20260929 21:42:17.871946 808 rpcz_store.cc:269] 0929 21:42:17.856678 (+ 0us) service_pool.cc:170] Inserting onto call queue
0929 21:42:17.871278 (+ 14600us) service_pool.cc:214] Skipping call since client already timed out
0929 21:42:17.871392 (+ 114us) inbound_call.cc:173] Queueing failure response
Metrics: {}
I20260929 21:42:17.872488 808 rpc-test-base.h:222] got call: sleep_micros: 1500000
W20260929 21:42:18.066665 807 rpcz_store.cc:267] Call kudu.rpc.GenericCalculatorService.Sleep from 127.0.0.1:47690 (request call id 3) took 510 ms (client timeout 10 ms). Trace:
W20260929 21:42:18.066991 807 rpcz_store.cc:269] 0929 21:42:17.555746 (+ 0us) service_pool.cc:170] Inserting onto call queue
0929 21:42:17.555882 (+ 136us) service_pool.cc:227] Handling call
0929 21:42:18.066614 (+510732us) inbound_call.cc:173] Queueing success response
Metrics: {}
W20260929 21:42:18.220010 806 rpcz_store.cc:267] Call kudu.rpc.GenericCalculatorService.Sleep from 127.0.0.1:47690 (request call id 7) took 510 ms (client timeout 10 ms). Trace:
W20260929 21:42:18.220312 806 rpcz_store.cc:269] 0929 21:42:17.709207 (+ 0us) service_pool.cc:170] Inserting onto call queue
0929 21:42:17.709332 (+ 125us) service_pool.cc:227] Handling call
0929 21:42:18.219957 (+510625us) inbound_call.cc:173] Queueing success response
Metrics: {}
I20260929 21:42:18.832872 390 rpc-test-base.h:595] status: Timed out: Sleep RPC to 0.0.0.0:34003 timed out after 1.000s (SENT), seconds elapsed: 1.00114
I20260929 21:42:18.834252 806 rpc-test-base.h:222] got call: sleep_micros: 1500000
W20260929 21:42:19.372956 808 rpcz_store.cc:267] Call kudu.rpc.GenericCalculatorService.Sleep from 127.0.0.1:47690 (request call id 12) took 1516 ms (client timeout 1000 ms). Trace:
W20260929 21:42:19.373373 808 rpcz_store.cc:269] 0929 21:42:17.857000 (+ 0us) service_pool.cc:170] Inserting onto call queue
0929 21:42:17.872452 (+ 15452us) service_pool.cc:227] Handling call
0929 21:42:19.372910 (+1500458us) inbound_call.cc:173] Queueing success response
Metrics: {}
I20260929 21:42:19.834408 390 rpc-test-base.h:595] status: Timed out: Sleep RPC to 0.0.0.0:34003 timed out after 1.000s (SENT), seconds elapsed: 1.00119
W20260929 21:42:19.835840 801 messenger.cc:357] Unable to handle RPC call: Not implemented: call requires unsupported application feature flags: 99, 1
W20260929 21:42:19.837313 801 messenger.cc:357] Unable to handle RPC call: Not implemented: call requires unsupported application feature flags: 99, 1
W20260929 21:42:20.334792 806 rpcz_store.cc:267] Call kudu.rpc.GenericCalculatorService.Sleep from 127.0.0.1:47690 (request call id 13) took 1500 ms (client timeout 1000 ms). Trace:
W20260929 21:42:20.335089 806 rpcz_store.cc:269] 0929 21:42:18.834054 (+ 0us) service_pool.cc:170] Inserting onto call queue
0929 21:42:18.834199 (+ 145us) service_pool.cc:227] Handling call
0929 21:42:20.334719 (+1500520us) inbound_call.cc:173] Queueing success response
Metrics: {}
W20260929 21:42:20.335579 801 connection.cc:441] server connection from 127.0.0.1:47690 torn down before Call kudu.rpc.GenericCalculatorService.Sleep from 127.0.0.1:47690 (request call id 13) could send its response
[ OK ] Parameters/TestRpc.TestCancellation/SSL_TCP (3171 ms)
[ RUN ] Parameters/TestRpc.TestCancellationMultiThreads/SSL_TCP
I20260929 21:42:20.377130 829 acceptor_pool.cc:254] collecting diagnostics on the listening RPC socket 0.0.0.0:34445 every 8 connection(s)
I20260929 21:42:20.377879 830 acceptor_pool.cc:254] collecting diagnostics on the listening RPC socket 0.0.0.0:34445 every 8 connection(s)
I20260929 21:42:20.380858 390 rpc-test.cc:1808] Connecting to 0.0.0.0:34445
I20260929 21:42:20.525784 843 test_util.cc:268] Using random seed: 245935288
I20260929 21:42:20.527335 844 test_util.cc:268] Using random seed: 245936841
I20260929 21:42:20.528798 845 test_util.cc:268] Using random seed: 245938307
I20260929 21:42:20.530205 846 test_util.cc:268] Using random seed: 245939698
I20260929 21:42:20.531899 847 test_util.cc:268] Using random seed: 245941263
I20260929 21:42:20.533473 848 test_util.cc:268] Using random seed: 245942849
I20260929 21:42:20.535092 849 test_util.cc:268] Using random seed: 245944452
I20260929 21:42:20.536649 850 test_util.cc:268] Using random seed: 245945983
I20260929 21:42:20.538911 851 test_util.cc:268] Using random seed: 245948337
I20260929 21:42:20.540898 852 test_util.cc:268] Using random seed: 245950296
I20260929 21:42:20.542527 853 test_util.cc:268] Using random seed: 245951565
I20260929 21:42:20.543887 854 test_util.cc:268] Using random seed: 245953277
I20260929 21:42:20.545746 855 test_util.cc:268] Using random seed: 245955131
I20260929 21:42:20.547734 856 test_util.cc:268] Using random seed: 245957083
I20260929 21:42:20.550611 857 test_util.cc:268] Using random seed: 245959896
I20260929 21:42:20.552728 858 test_util.cc:268] Using random seed: 245961763
I20260929 21:42:20.554402 859 test_util.cc:268] Using random seed: 245963780
I20260929 21:42:20.556190 860 test_util.cc:268] Using random seed: 245965571
I20260929 21:42:20.558578 861 test_util.cc:268] Using random seed: 245967926
I20260929 21:42:20.560920 862 test_util.cc:268] Using random seed: 245970257
I20260929 21:42:20.563041 863 test_util.cc:268] Using random seed: 245972435
I20260929 21:42:20.565001 864 test_util.cc:268] Using random seed: 245974380
I20260929 21:42:20.566923 865 test_util.cc:268] Using random seed: 245975959
I20260929 21:42:20.569188 866 test_util.cc:268] Using random seed: 245978579
I20260929 21:42:20.571143 867 test_util.cc:268] Using random seed: 245980540
I20260929 21:42:20.573391 868 test_util.cc:268] Using random seed: 245982577
I20260929 21:42:20.575227 869 test_util.cc:268] Using random seed: 245984536
I20260929 21:42:20.577297 870 test_util.cc:268] Using random seed: 245986632
I20260929 21:42:20.578790 871 test_util.cc:268] Using random seed: 245988167
I20260929 21:42:20.580608 872 test_util.cc:268] Using random seed: 245989975
[ OK ] Parameters/TestRpc.TestCancellationMultiThreads/SSL_TCP (17832 ms)
[ RUN ] Parameters/TestRpc.TestCallId/SSL_TCP
I20260929 21:42:38.193008 886 acceptor_pool.cc:254] collecting diagnostics on the listening RPC socket 0.0.0.0:42913 every 8 connection(s)
I20260929 21:42:38.193778 887 acceptor_pool.cc:254] collecting diagnostics on the listening RPC socket 0.0.0.0:42913 every 8 connection(s)
[ OK ] Parameters/TestRpc.TestCallId/SSL_TCP (71 ms)
[----------] 20 tests from Parameters/TestRpc (37478 ms total)
[----------] Global test environment tear-down
[==========] 21 tests from 2 test suites ran. (37486 ms total)
[ PASSED ] 20 tests.
[ FAILED ] 1 test, listed below:
[ FAILED ] Parameters/TestRpc.TestCallWithChainCertAndRootCA/SSL_TCP, where GetParam() = (true, false)
1 FAILED TEST