Diagnosed failure

Parameters/TestRpc.TestCallWithChainCertAndChainCA/SSL_TCP: /data0/somelongdirectorytoavoidrpathissues/src/kudu/src/kudu/rpc/rpc-test.cc:270: Failure
Failed
Bad status: Runtime error: could not verify certificate chain (error with cert: subject=CN = localhost, ST = sadfjas, C = AS, emailAddress = sdflkdsajf, O = lskdfjlsad, OU = sldfkja, issuer=C = AS, ST = ASDfkjdhf, L = lskdjf, O = saldfja, OU = skdjf, CN = localhost, emailAddress = sadjflkadsj): : certificate has expired
Google Test trace:
/data0/somelongdirectorytoavoidrpathissues/src/kudu/src/kudu/rpc/rpc-test.cc:267: Connecting to 0.0.0.0:33349
I20260929 03:05:22.655238   781 test_util.cc:175] -----------------------------------------------
I20260929 03:05:22.655285   781 test_util.cc:176] Had fatal failures, leaving test files at /tmp/dist-test-taskTH3v8O/test-tmp/rpc-test.5.Parameters_TestRpc.TestCallWithChainCertAndChainCA_SSL_TCP.1790651122567283-781-0

Full log

Note: This is test shard 6 of 8.
[==========] Running 21 tests from 2 test suites.
[----------] Global test environment set-up.
[----------] 20 tests from Parameters/TestRpc
[ RUN      ] Parameters/TestRpc.TestMessengerCreateDestroy/SSL_TCP
WARNING: Logging before InitGoogleLogging() is written to STDERR
I20260929 03:05:22.597275   781 rpc-test.cc:169] started messenger TestCreateDestroy
[       OK ] Parameters/TestRpc.TestMessengerCreateDestroy/SSL_TCP (24 ms)
[ RUN      ] Parameters/TestRpc.TestNegotiationDeadlock/SSL_TCP
I20260929 03:05:22.624043   801 acceptor_pool.cc:254] collecting diagnostics on the listening RPC socket 0.0.0.0:33747 every 8 connection(s)
I20260929 03:05:22.624089   802 acceptor_pool.cc:254] collecting diagnostics on the listening RPC socket 0.0.0.0:33747 every 8 connection(s)
[       OK ] Parameters/TestRpc.TestNegotiationDeadlock/SSL_TCP (36 ms)
[ RUN      ] Parameters/TestRpc.TestCallWithChainCertAndChainCA/SSL_TCP
I20260929 03:05:22.649726   817 acceptor_pool.cc:254] collecting diagnostics on the listening RPC socket 0.0.0.0:33349 every 8 connection(s)
I20260929 03:05:22.649793   818 acceptor_pool.cc:254] collecting diagnostics on the listening RPC socket 0.0.0.0:33349 every 8 connection(s)
/data0/somelongdirectorytoavoidrpathissues/src/kudu/src/kudu/rpc/rpc-test.cc:270: Failure
Failed
Bad status: Runtime error: could not verify certificate chain (error with cert: subject=CN = localhost, ST = sadfjas, C = AS, emailAddress = sdflkdsajf, O = lskdfjlsad, OU = sldfkja, issuer=C = AS, ST = ASDfkjdhf, L = lskdjf, O = saldfja, OU = skdjf, CN = localhost, emailAddress = sadjflkadsj): : certificate has expired
Google Test trace:
/data0/somelongdirectorytoavoidrpathissues/src/kudu/src/kudu/rpc/rpc-test.cc:267: Connecting to 0.0.0.0:33349
I20260929 03:05:22.655238   781 test_util.cc:175] -----------------------------------------------
I20260929 03:05:22.655285   781 test_util.cc:176] Had fatal failures, leaving test files at /tmp/dist-test-taskTH3v8O/test-tmp/rpc-test.5.Parameters_TestRpc.TestCallWithChainCertAndChainCA_SSL_TCP.1790651122567283-781-0
[  FAILED  ] Parameters/TestRpc.TestCallWithChainCertAndChainCA/SSL_TCP, where GetParam() = (true, false) (19 ms)
[ RUN      ] Parameters/TestRpc.TestCallWithPasswordProtectedKey/SSL_TCP
I20260929 03:05:22.665210   842 acceptor_pool.cc:254] collecting diagnostics on the listening RPC socket 0.0.0.0:45611 every 8 connection(s)
I20260929 03:05:22.665244   843 acceptor_pool.cc:254] collecting diagnostics on the listening RPC socket 0.0.0.0:45611 every 8 connection(s)
[       OK ] Parameters/TestRpc.TestCallWithPasswordProtectedKey/SSL_TCP (24 ms)
[ RUN      ] Parameters/TestRpc.TestCallToBadServer/SSL_TCP
I20260929 03:05:22.698354   781 rpc-test.cc:394] Status: Network error: Client connection negotiation failed: client connection to 0.0.0.0:0: connect: Connection refused (error 111)
I20260929 03:05:22.699064   781 rpc-test.cc:394] Status: Network error: Client connection negotiation failed: client connection to 0.0.0.0:0: connect: Connection refused (error 111)
I20260929 03:05:22.699595   781 rpc-test.cc:394] Status: Network error: Client connection negotiation failed: client connection to 0.0.0.0:0: connect: Connection refused (error 111)
I20260929 03:05:22.700085   781 rpc-test.cc:394] Status: Network error: Client connection negotiation failed: client connection to 0.0.0.0:0: connect: Connection refused (error 111)
I20260929 03:05:22.700594   781 rpc-test.cc:394] Status: Network error: Client connection negotiation failed: client connection to 0.0.0.0:0: connect: Connection refused (error 111)
[       OK ] Parameters/TestRpc.TestCallToBadServer/SSL_TCP (21 ms)
[ RUN      ] Parameters/TestRpc.TestWrongService/SSL_TCP
I20260929 03:05:22.715197   877 acceptor_pool.cc:254] collecting diagnostics on the listening RPC socket 0.0.0.0:33111 every 8 connection(s)
I20260929 03:05:22.715252   878 acceptor_pool.cc:254] collecting diagnostics on the listening RPC socket 0.0.0.0:33111 every 8 connection(s)
I20260929 03:05:22.726531   874 messenger.cc:345] service WrongServiceName not registered on TestServer
[       OK ] Parameters/TestRpc.TestWrongService/SSL_TCP (27 ms)
[ RUN      ] Parameters/TestRpc.TestConnectionKeepalive/SSL_TCP
I20260929 03:05:22.754686   900 acceptor_pool.cc:254] collecting diagnostics on the listening RPC socket 0.0.0.0:41611 every 8 connection(s)
I20260929 03:05:22.754720   901 acceptor_pool.cc:254] collecting diagnostics on the listening RPC socket 0.0.0.0:41611 every 8 connection(s)
I20260929 03:05:22.755224   781 rpc-test.cc:488] Connecting to 0.0.0.0:41611
[       OK ] Parameters/TestRpc.TestConnectionKeepalive/SSL_TCP (1051 ms)
[ RUN      ] Parameters/TestRpc.TestClientConnectionMetrics/SSL_TCP
I20260929 03:05:23.792673   925 acceptor_pool.cc:254] collecting diagnostics on the listening RPC socket 0.0.0.0:39171 every 8 connection(s)
I20260929 03:05:23.792732   926 acceptor_pool.cc:254] collecting diagnostics on the listening RPC socket 0.0.0.0:39171 every 8 connection(s)
I20260929 03:05:23.793058   781 rpc-test.cc:569] Connecting to 0.0.0.0:39171
[       OK ] Parameters/TestRpc.TestClientConnectionMetrics/SSL_TCP (11527 ms)
[ RUN      ] Parameters/TestRpc.TestCredentialsPolicy/SSL_TCP
I20260929 03:05:35.319476   948 acceptor_pool.cc:254] collecting diagnostics on the listening RPC socket 0.0.0.0:39529 every 8 connection(s)
I20260929 03:05:35.319528   949 acceptor_pool.cc:254] collecting diagnostics on the listening RPC socket 0.0.0.0:39529 every 8 connection(s)
I20260929 03:05:35.319828   781 rpc-test.cc:700] Connecting to 0.0.0.0:39529
[       OK ] Parameters/TestRpc.TestCredentialsPolicy/SSL_TCP (33 ms)
[ RUN      ] Parameters/TestRpc.TestCallLongerThanKeepalive/SSL_TCP
I20260929 03:05:35.369271   973 acceptor_pool.cc:254] collecting diagnostics on the listening RPC socket 0.0.0.0:33551 every 8 connection(s)
I20260929 03:05:35.369325   974 acceptor_pool.cc:254] collecting diagnostics on the listening RPC socket 0.0.0.0:33551 every 8 connection(s)
I20260929 03:05:35.387393   977 rpc-test-base.h:222] got call: sleep_micros: 3000000 deferred: true
I20260929 03:05:38.388221   977 rpcz_store.cc:275] Call kudu.rpc.GenericCalculatorService.Sleep from 127.0.0.1:48038 (request call id 0) took 3000 ms. Trace:
I20260929 03:05:38.388332   977 rpcz_store.cc:276] 0929 03:05:35.387294 (+     0us) service_pool.cc:170] Inserting onto call queue
0929 03:05:35.387367 (+    73us) service_pool.cc:227] Handling call
0929 03:05:38.388202 (+3000835us) inbound_call.cc:173] Queueing success response
Metrics: {}
[       OK ] Parameters/TestRpc.TestCallLongerThanKeepalive/SSL_TCP (3050 ms)
[ RUN      ] Parameters/TestRpc.TestRpcSidecar/SSL_TCP
I20260929 03:05:38.408963   998 acceptor_pool.cc:254] collecting diagnostics on the listening RPC socket 0.0.0.0:44235 every 8 connection(s)
I20260929 03:05:38.408963   999 acceptor_pool.cc:254] collecting diagnostics on the listening RPC socket 0.0.0.0:44235 every 8 connection(s)
[       OK ] Parameters/TestRpc.TestRpcSidecar/SSL_TCP (83 ms)
[ RUN      ] Parameters/TestRpc.TestRpcSidecarLimits/SSL_TCP
I20260929 03:05:40.185369  1023 acceptor_pool.cc:254] collecting diagnostics on the listening RPC socket 0.0.0.0:42879 every 8 connection(s)
I20260929 03:05:40.185388  1024 acceptor_pool.cc:254] collecting diagnostics on the listening RPC socket 0.0.0.0:42879 every 8 connection(s)
W20260929 03:05:40.205077   781 serialization.cc:72] Serialized kudu.rpc_test.PushStringsRequestPB (2147483654 bytes) is larger than the maximum configured RPC message size (52428800 bytes). Sending anyway, but peer may reject the data.
W20260929 03:05:40.208938  1020 connection.cc:535] server connection from 127.0.0.1:51468 recv error: Network error: RPC frame had a length of 2147483714, but we only support messages up to 52428800 bytes long.
W20260929 03:05:40.208995  1020 connection.cc:158] shutting down server connection from 127.0.0.1:51468 with pending inbound data: 4/2147483714 bytes received; last active 0 ns ago: status Network error: RPC frame had a length of 2147483714, but we only support messages up to 52428800 bytes long.
W20260929 03:05:40.209270  1036 connection.cc:196] Error closing socket: Network error: TlsSocket::Close: Connection reset by peer
I20260929 03:05:40.227546  1048 acceptor_pool.cc:254] collecting diagnostics on the listening RPC socket 0.0.0.0:35865 every 8 connection(s)
I20260929 03:05:40.227569  1049 acceptor_pool.cc:254] collecting diagnostics on the listening RPC socket 0.0.0.0:35865 every 8 connection(s)
W20260929 03:05:44.509145  1046 connection.cc:577] server connection from 127.0.0.1:40732: received bad data: 'Corruption: Invalid packet: message had a length of 2147483710, but we only support messages up to 2147483647 bytes
'
[       OK ] Parameters/TestRpc.TestRpcSidecarLimits/SSL_TCP (6037 ms)
[ RUN      ] Parameters/TestRpc.TestCallTimeoutDoesntAffectNegotiation/SSL_TCP
I20260929 03:05:44.521519  1073 acceptor_pool.cc:254] collecting diagnostics on the listening RPC socket 0.0.0.0:38947 every 8 connection(s)
I20260929 03:05:44.521752  1074 acceptor_pool.cc:254] collecting diagnostics on the listening RPC socket 0.0.0.0:38947 every 8 connection(s)
W20260929 03:05:44.527097  1069 negotiation.cc:266] Injecting 500ms delay in negotiation
I20260929 03:05:44.577514   781 rpc-test-base.h:595] status: Timed out: connection negotiation to 0.0.0.0:38947 for RPC Sleep timed out after 0.050s (ON_OUTBOUND_QUEUE), seconds elapsed: 0.0508283
[       OK ] Parameters/TestRpc.TestCallTimeoutDoesntAffectNegotiation/SSL_TCP (521 ms)
[ RUN      ] Parameters/TestRpc.TestRpcHandlerLatencyMetric/SSL_TCP
I20260929 03:05:45.049475  1098 acceptor_pool.cc:254] collecting diagnostics on the listening RPC socket 0.0.0.0:35761 every 8 connection(s)
I20260929 03:05:45.049533  1099 acceptor_pool.cc:254] collecting diagnostics on the listening RPC socket 0.0.0.0:35761 every 8 connection(s)
I20260929 03:05:45.095422   781 rpc-test.cc:1236] Sleep() min lat: 20346
I20260929 03:05:45.095492   781 rpc-test.cc:1237] Sleep() mean lat: 20346
I20260929 03:05:45.095546   781 rpc-test.cc:1238] Sleep() max lat: 20346
I20260929 03:05:45.095561   781 rpc-test.cc:1239] Sleep() #calls: 1
[       OK ] Parameters/TestRpc.TestRpcHandlerLatencyMetric/SSL_TCP (64 ms)
[ RUN      ] Parameters/TestRpc.TimedOutOnResponseMetricServiceQueue/SSL_TCP
I20260929 03:05:45.111040  1124 acceptor_pool.cc:254] collecting diagnostics on the listening RPC socket 0.0.0.0:46367 every 8 connection(s)
I20260929 03:05:45.111092  1125 acceptor_pool.cc:254] collecting diagnostics on the listening RPC socket 0.0.0.0:46367 every 8 connection(s)
W20260929 03:05:45.175884  1126 rpcz_store.cc:267] Call kudu.rpc_test.CalculatorService.Sleep from 127.0.0.1:41560 (request call id 2) took 20 ms (client timeout 20 ms). Trace:
W20260929 03:05:45.176011  1126 rpcz_store.cc:269] 0929 03:05:45.155521 (+     0us) service_pool.cc:170] Inserting onto call queue
0929 03:05:45.175839 (+ 20318us) service_pool.cc:214] Skipping call since client already timed out
0929 03:05:45.175866 (+    27us) inbound_call.cc:173] Queueing failure response
Metrics: {}
[       OK ] Parameters/TestRpc.TimedOutOnResponseMetricServiceQueue/SSL_TCP (80 ms)
[ RUN      ] Parameters/TestRpc.RpcPendingConnectionsMetric/SSL_TCP
I20260929 03:05:45.180397  1147 acceptor_pool.cc:254] collecting diagnostics on the listening RPC socket 0.0.0.0:45425 every 8 connection(s)
I20260929 03:05:45.180462  1148 acceptor_pool.cc:254] collecting diagnostics on the listening RPC socket 0.0.0.0:45425 every 8 connection(s)
W20260929 03:05:45.190532  1143 negotiation.cc:337] Failed RPC negotiation. Trace:
0929 03:05:45.190026 (+     0us) reactor.cc:625] Submitting negotiation task for server connection from 127.0.0.1:46900 (local address 127.0.0.1:45425)
0929 03:05:45.190156 (+   130us) server_negotiation.cc:206] Beginning negotiation
0929 03:05:45.190160 (+     4us) server_negotiation.cc:399] Waiting for connection header
0929 03:05:45.190270 (+   110us) negotiation.cc:327] Negotiation complete: Network error: Server connection negotiation failed: server connection from 127.0.0.1:46900: BlockingRecv error: recv got EOF from 127.0.0.1:46900 (error 108)
Metrics: {"server-negotiator.queue_time_us":30}
[       OK ] Parameters/TestRpc.RpcPendingConnectionsMetric/SSL_TCP (23 ms)
[ RUN      ] Parameters/TestRpc.TestRpcContextClientDeadline/SSL_TCP
I20260929 03:05:45.212422  1163 acceptor_pool.cc:254] collecting diagnostics on the listening RPC socket 0.0.0.0:41617 every 8 connection(s)
I20260929 03:05:45.212471  1164 acceptor_pool.cc:254] collecting diagnostics on the listening RPC socket 0.0.0.0:41617 every 8 connection(s)
[       OK ] Parameters/TestRpc.TestRpcContextClientDeadline/SSL_TCP (46 ms)
[ RUN      ] Parameters/TestRpc.TestApplicationFeatureFlagUnsupportedServer/SSL_TCP
I20260929 03:05:45.259656  1188 acceptor_pool.cc:254] collecting diagnostics on the listening RPC socket 0.0.0.0:37999 every 8 connection(s)
I20260929 03:05:45.259697  1189 acceptor_pool.cc:254] collecting diagnostics on the listening RPC socket 0.0.0.0:37999 every 8 connection(s)
[       OK ] Parameters/TestRpc.TestApplicationFeatureFlagUnsupportedServer/SSL_TCP (30 ms)
[ RUN      ] Parameters/TestRpc.TestCancellationAsync/SSL_TCP
I20260929 03:05:45.287904  1213 acceptor_pool.cc:254] collecting diagnostics on the listening RPC socket 0.0.0.0:41717 every 8 connection(s)
I20260929 03:05:45.287942  1214 acceptor_pool.cc:254] collecting diagnostics on the listening RPC socket 0.0.0.0:41717 every 8 connection(s)
I20260929 03:05:45.288242   781 rpc-test.cc:1716] Connecting to 0.0.0.0:41717
I20260929 03:05:45.306022   781 test_util.cc:268] Using random seed: 1970192292
I20260929 03:05:45.325606  1217 rpc-test-base.h:240] got call: sleep_micros: 500 pattern: 4294967295 num_repetitions: 2097152 sidecar_idx: 0
I20260929 03:05:45.341162  1216 rpc-test-base.h:240] got call: sleep_micros: 500 pattern: 4294967295 num_repetitions: 2097152 sidecar_idx: 0
I20260929 03:05:45.357196  1217 rpc-test-base.h:240] got call: sleep_micros: 500 pattern: 4294967295 num_repetitions: 2097152 sidecar_idx: 0
I20260929 03:05:45.375228  1216 rpc-test-base.h:240] got call: sleep_micros: 500 pattern: 4294967295 num_repetitions: 2097152 sidecar_idx: 0
I20260929 03:05:45.393352  1217 rpc-test-base.h:240] got call: sleep_micros: 500 pattern: 4294967295 num_repetitions: 2097152 sidecar_idx: 0
I20260929 03:05:45.413312  1216 rpc-test-base.h:240] got call: sleep_micros: 500 pattern: 4294967295 num_repetitions: 2097152 sidecar_idx: 0
I20260929 03:05:45.431157  1217 rpc-test-base.h:240] got call: sleep_micros: 500 pattern: 4294967295 num_repetitions: 2097152 sidecar_idx: 0
W20260929 03:05:45.437906  1210 connection.cc:441] server connection from 127.0.0.1:41202 torn down before Call kudu.rpc.GenericCalculatorService.SleepWithSidecar from 127.0.0.1:41202 (request call id 8) could send its response
W20260929 03:05:45.449098  1210 connection.cc:441] server connection from 127.0.0.1:41202 torn down before Call kudu.rpc.GenericCalculatorService.SleepWithSidecar from 127.0.0.1:41202 (request call id 9) could send its response
[       OK ] Parameters/TestRpc.TestCancellationAsync/SSL_TCP (172 ms)
[ RUN      ] Parameters/TestRpc.TestPerformanceBySocketType/SSL_TCP
I20260929 03:05:45.467532  1238 acceptor_pool.cc:254] collecting diagnostics on the listening RPC socket 0.0.0.0:43909 every 8 connection(s)
I20260929 03:05:45.467574  1239 acceptor_pool.cc:254] collecting diagnostics on the listening RPC socket 0.0.0.0:43909 every 8 connection(s)
I20260929 03:05:45.467873   781 rpc-test.cc:1846] Connecting to 0.0.0.0:43909
I20260929 03:05:47.607257   781 rpc-test.cc:1859] Sending 1024MB via ssl-enabled tcp socket: real 2.130s	user 2.199s	sys 1.579s
I20260929 03:05:49.789556   781 rpc-test.cc:1859] Sending 1024MB via ssl-enabled tcp socket: real 2.182s	user 2.172s	sys 1.700s
I20260929 03:05:52.011917   781 rpc-test.cc:1859] Sending 1024MB via ssl-enabled tcp socket: real 2.222s	user 2.297s	sys 1.640s
I20260929 03:05:54.105957   781 rpc-test.cc:1859] Sending 1024MB via ssl-enabled tcp socket: real 2.094s	user 2.198s	sys 1.487s
I20260929 03:05:56.273340   781 rpc-test.cc:1859] Sending 1024MB via ssl-enabled tcp socket: real 2.167s	user 2.330s	sys 1.533s
[       OK ] Parameters/TestRpc.TestPerformanceBySocketType/SSL_TCP (10824 ms)
[----------] 20 tests from Parameters/TestRpc (33701 ms total)

[----------] 1 test from Parameters/TestRpcSocketTxRxQueue
[ RUN      ] Parameters/TestRpcSocketTxRxQueue.OverCapacity/0
W20260929 03:05:56.545167  1255 negotiation.cc:337] Failed RPC negotiation. Trace:
0929 03:05:56.277586 (+     0us) reactor.cc:625] Submitting negotiation task for client connection to 0.0.0.0:44809 (local address 127.0.0.1:35384)
0929 03:05:56.277687 (+   101us) negotiation.cc:107] Waiting for socket to connect
0929 03:05:56.277703 (+    16us) client_negotiation.cc:174] Beginning negotiation
0929 03:05:56.277790 (+    87us) client_negotiation.cc:252] Sending NEGOTIATE NegotiatePB request
0929 03:05:56.545008 (+267218us) negotiation.cc:327] Negotiation complete: Network error: Client connection negotiation failed: client connection to 0.0.0.0:44809: BlockingRecv error: recv error from unknown peer: Transport endpoint is not connected (error 107)
Metrics: {"client-negotiator.queue_time_us":26}
W20260929 03:05:56.545288  1273 negotiation.cc:337] Failed RPC negotiation. Trace:
0929 03:05:56.279973 (+     0us) reactor.cc:625] Submitting negotiation task for client connection to 0.0.0.0:44809 (local address 127.0.0.1:35404)
0929 03:05:56.280083 (+   110us) negotiation.cc:107] Waiting for socket to connect
0929 03:05:56.280102 (+    19us) client_negotiation.cc:174] Beginning negotiation
0929 03:05:56.280164 (+    62us) client_negotiation.cc:252] Sending NEGOTIATE NegotiatePB request
0929 03:05:56.545062 (+264898us) negotiation.cc:327] Negotiation complete: Network error: Client connection negotiation failed: client connection to 0.0.0.0:44809: BlockingRecv error: recv error from unknown peer: Transport endpoint is not connected (error 107)
Metrics: {"client-negotiator.queue_time_us":46}
W20260929 03:05:56.545296  1282 negotiation.cc:337] Failed RPC negotiation. Trace:
0929 03:05:56.281126 (+     0us) reactor.cc:625] Submitting negotiation task for client connection to 0.0.0.0:44809 (local address 127.0.0.1:35408)
0929 03:05:56.281233 (+   107us) negotiation.cc:107] Waiting for socket to connect
0929 03:05:56.281247 (+    14us) client_negotiation.cc:174] Beginning negotiation
0929 03:05:56.281319 (+    72us) client_negotiation.cc:252] Sending NEGOTIATE NegotiatePB request
0929 03:05:56.545254 (+263935us) negotiation.cc:327] Negotiation complete: Network error: Client connection negotiation failed: client connection to 0.0.0.0:44809: BlockingRecv error: recv error from unknown peer: Transport endpoint is not connected (error 107)
Metrics: {"client-negotiator.queue_time_us":45}
W20260929 03:05:56.545303  1300 negotiation.cc:337] Failed RPC negotiation. Trace:
0929 03:05:56.283310 (+     0us) reactor.cc:625] Submitting negotiation task for client connection to 0.0.0.0:44809 (local address 127.0.0.1:35426)
0929 03:05:56.283455 (+   145us) negotiation.cc:107] Waiting for socket to connect
0929 03:05:56.283468 (+    13us) client_negotiation.cc:174] Beginning negotiation
0929 03:05:56.283565 (+    97us) client_negotiation.cc:252] Sending NEGOTIATE NegotiatePB request
0929 03:05:56.545008 (+261443us) negotiation.cc:327] Negotiation complete: Network error: Client connection negotiation failed: client connection to 0.0.0.0:44809: BlockingRecv error: recv error from unknown peer: Transport endpoint is not connected (error 107)
Metrics: {"client-negotiator.queue_time_us":60}
W20260929 03:05:56.545598  1264 negotiation.cc:337] Failed RPC negotiation. Trace:
0929 03:05:56.278731 (+     0us) reactor.cc:625] Submitting negotiation task for client connection to 0.0.0.0:44809 (local address 127.0.0.1:35398)
0929 03:05:56.278867 (+   136us) negotiation.cc:107] Waiting for socket to connect
0929 03:05:56.278881 (+    14us) client_negotiation.cc:174] Beginning negotiation
0929 03:05:56.278984 (+   103us) client_negotiation.cc:252] Sending NEGOTIATE NegotiatePB request
0929 03:05:56.545062 (+266078us) negotiation.cc:327] Negotiation complete: Network error: Client connection negotiation failed: client connection to 0.0.0.0:44809: BlockingRecv error: recv error from unknown peer: Transport endpoint is not connected (error 107)
Metrics: {"client-negotiator.queue_time_us":44}
W20260929 03:05:56.545827  1291 negotiation.cc:337] Failed RPC negotiation. Trace:
0929 03:05:56.282266 (+     0us) reactor.cc:625] Submitting negotiation task for client connection to 0.0.0.0:44809 (local address 127.0.0.1:35416)
0929 03:05:56.282369 (+   103us) negotiation.cc:107] Waiting for socket to connect
0929 03:05:56.282384 (+    15us) client_negotiation.cc:174] Beginning negotiation
0929 03:05:56.282459 (+    75us) client_negotiation.cc:252] Sending NEGOTIATE NegotiatePB request
0929 03:05:56.545137 (+262678us) negotiation.cc:327] Negotiation complete: Network error: Client connection negotiation failed: client connection to 0.0.0.0:44809: BlockingRecv error: recv error from unknown peer: Transport endpoint is not connected (error 107)
Metrics: {"client-negotiator.queue_time_us":24}
[       OK ] Parameters/TestRpcSocketTxRxQueue.OverCapacity/0 (1049 ms)
[----------] 1 test from Parameters/TestRpcSocketTxRxQueue (1049 ms total)

[----------] Global test environment tear-down
[==========] 21 tests from 2 test suites ran. (34751 ms total)
[  PASSED  ] 20 tests.
[  FAILED  ] 1 test, listed below:
[  FAILED  ] Parameters/TestRpc.TestCallWithChainCertAndChainCA/SSL_TCP, where GetParam() = (true, false)

 1 FAILED TEST