Diagnosed failure
Parameters/TestRpc.TestCallWithChainCertAndChainCA/SSL_UnixSocket: /data0/somelongdirectorytoavoidrpathissues/src/kudu/src/kudu/rpc/rpc-test.cc:270: Failure
Failed
Bad status: Runtime error: could not verify certificate chain (error with cert: subject=CN = localhost, ST = sadfjas, C = AS, emailAddress = sdflkdsajf, O = lskdfjlsad, OU = sldfkja, issuer=C = AS, ST = ASDfkjdhf, L = lskdjf, O = saldfja, OU = skdjf, CN = localhost, emailAddress = sadjflkadsj): : certificate has expired
Google Test trace:
/data0/somelongdirectorytoavoidrpathissues/src/kudu/src/kudu/rpc/rpc-test.cc:267: Connecting to unix:/tmp/dist-test-taskabeQ4R/test-tmp/rpc-test-251a2a898a8942e0ba9d2146d4df1185.sock
I20260928 16:35:25.899606 24227 test_util.cc:175] -----------------------------------------------
I20260928 16:35:25.899695 24227 test_util.cc:176] Had fatal failures, leaving test files at /tmp/dist-test-taskabeQ4R/test-tmp/rpc-test.6.Parameters_TestRpc.TestCallWithChainCertAndChainCA_SSL_UnixSocket.1790613325820455-24227-0
Full log
Note: This is test shard 7 of 8.
[==========] Running 21 tests from 2 test suites.
[----------] Global test environment set-up.
[----------] 20 tests from Parameters/TestRpc
[ RUN ] Parameters/TestRpc.TestMessengerCreateDestroy/SSL_UnixSocket
WARNING: Logging before InitGoogleLogging() is written to STDERR
I20260928 16:35:25.849201 24227 rpc-test.cc:169] started messenger TestCreateDestroy
[ OK ] Parameters/TestRpc.TestMessengerCreateDestroy/SSL_UnixSocket (23 ms)
[ RUN ] Parameters/TestRpc.TestNegotiationDeadlock/SSL_UnixSocket
I20260928 16:35:25.865340 24247 acceptor_pool.cc:254] collecting diagnostics on the listening RPC socket unix:/tmp/dist-test-taskabeQ4R/test-tmp/rpc-test-70c41366089744a58430a94dd767f60d.sock every 8 connection(s)
I20260928 16:35:25.865375 24248 acceptor_pool.cc:254] collecting diagnostics on the listening RPC socket unix:/tmp/dist-test-taskabeQ4R/test-tmp/rpc-test-70c41366089744a58430a94dd767f60d.sock every 8 connection(s)
[ OK ] Parameters/TestRpc.TestNegotiationDeadlock/SSL_UnixSocket (24 ms)
[ RUN ] Parameters/TestRpc.TestCallWithChainCertAndChainCA/SSL_UnixSocket
I20260928 16:35:25.894038 24263 acceptor_pool.cc:254] collecting diagnostics on the listening RPC socket unix:/tmp/dist-test-taskabeQ4R/test-tmp/rpc-test-251a2a898a8942e0ba9d2146d4df1185.sock every 8 connection(s)
I20260928 16:35:25.894079 24264 acceptor_pool.cc:254] collecting diagnostics on the listening RPC socket unix:/tmp/dist-test-taskabeQ4R/test-tmp/rpc-test-251a2a898a8942e0ba9d2146d4df1185.sock every 8 connection(s)
/data0/somelongdirectorytoavoidrpathissues/src/kudu/src/kudu/rpc/rpc-test.cc:270: Failure
Failed
Bad status: Runtime error: could not verify certificate chain (error with cert: subject=CN = localhost, ST = sadfjas, C = AS, emailAddress = sdflkdsajf, O = lskdfjlsad, OU = sldfkja, issuer=C = AS, ST = ASDfkjdhf, L = lskdjf, O = saldfja, OU = skdjf, CN = localhost, emailAddress = sadjflkadsj): : certificate has expired
Google Test trace:
/data0/somelongdirectorytoavoidrpathissues/src/kudu/src/kudu/rpc/rpc-test.cc:267: Connecting to unix:/tmp/dist-test-taskabeQ4R/test-tmp/rpc-test-251a2a898a8942e0ba9d2146d4df1185.sock
I20260928 16:35:25.899606 24227 test_util.cc:175] -----------------------------------------------
I20260928 16:35:25.899695 24227 test_util.cc:176] Had fatal failures, leaving test files at /tmp/dist-test-taskabeQ4R/test-tmp/rpc-test.6.Parameters_TestRpc.TestCallWithChainCertAndChainCA_SSL_UnixSocket.1790613325820455-24227-0
[ FAILED ] Parameters/TestRpc.TestCallWithChainCertAndChainCA/SSL_UnixSocket, where GetParam() = (true, true) (23 ms)
[ RUN ] Parameters/TestRpc.TestCallWithPasswordProtectedKey/SSL_UnixSocket
I20260928 16:35:25.914713 24289 acceptor_pool.cc:254] collecting diagnostics on the listening RPC socket unix:/tmp/dist-test-taskabeQ4R/test-tmp/rpc-test-2cf7bad1d8e240c59b5da5757b211742.sock every 8 connection(s)
I20260928 16:35:25.914750 24290 acceptor_pool.cc:254] collecting diagnostics on the listening RPC socket unix:/tmp/dist-test-taskabeQ4R/test-tmp/rpc-test-2cf7bad1d8e240c59b5da5757b211742.sock every 8 connection(s)
[ OK ] Parameters/TestRpc.TestCallWithPasswordProtectedKey/SSL_UnixSocket (30 ms)
[ RUN ] Parameters/TestRpc.TestCallToBadServer/SSL_UnixSocket
I20260928 16:35:25.960884 24227 rpc-test.cc:394] Status: Network error: Client connection negotiation failed: client connection to 0.0.0.0:0: connect: Connection refused (error 111)
I20260928 16:35:25.961427 24227 rpc-test.cc:394] Status: Network error: Client connection negotiation failed: client connection to 0.0.0.0:0: connect: Connection refused (error 111)
I20260928 16:35:25.962023 24227 rpc-test.cc:394] Status: Network error: Client connection negotiation failed: client connection to 0.0.0.0:0: connect: Connection refused (error 111)
I20260928 16:35:25.962595 24227 rpc-test.cc:394] Status: Network error: Client connection negotiation failed: client connection to 0.0.0.0:0: connect: Connection refused (error 111)
I20260928 16:35:25.963043 24227 rpc-test.cc:394] Status: Network error: Client connection negotiation failed: client connection to 0.0.0.0:0: connect: Connection refused (error 111)
[ OK ] Parameters/TestRpc.TestCallToBadServer/SSL_UnixSocket (33 ms)
[ RUN ] Parameters/TestRpc.TestWrongService/SSL_UnixSocket
I20260928 16:35:25.983793 24324 acceptor_pool.cc:254] collecting diagnostics on the listening RPC socket unix:/tmp/dist-test-taskabeQ4R/test-tmp/rpc-test-ba7ab39bb9c947419b7cc2fa58537328.sock every 8 connection(s)
I20260928 16:35:25.983826 24325 acceptor_pool.cc:254] collecting diagnostics on the listening RPC socket unix:/tmp/dist-test-taskabeQ4R/test-tmp/rpc-test-ba7ab39bb9c947419b7cc2fa58537328.sock every 8 connection(s)
I20260928 16:35:25.999004 24321 messenger.cc:345] service WrongServiceName not registered on TestServer
[ OK ] Parameters/TestRpc.TestWrongService/SSL_UnixSocket (37 ms)
[ RUN ] Parameters/TestRpc.TestConnectionKeepalive/SSL_UnixSocket
I20260928 16:35:26.023450 24348 acceptor_pool.cc:254] collecting diagnostics on the listening RPC socket unix:/tmp/dist-test-taskabeQ4R/test-tmp/rpc-test-8773c81323ca47a99fdce0d35bf8abdd.sock every 8 connection(s)
I20260928 16:35:26.023442 24347 acceptor_pool.cc:254] collecting diagnostics on the listening RPC socket unix:/tmp/dist-test-taskabeQ4R/test-tmp/rpc-test-8773c81323ca47a99fdce0d35bf8abdd.sock every 8 connection(s)
I20260928 16:35:26.023779 24227 rpc-test.cc:488] Connecting to unix:/tmp/dist-test-taskabeQ4R/test-tmp/rpc-test-8773c81323ca47a99fdce0d35bf8abdd.sock
W20260928 16:35:26.503039 24361 connection.cc:196] Error closing socket: Network error: TlsSocket::Close: Broken pipe
[ OK ] Parameters/TestRpc.TestConnectionKeepalive/SSL_UnixSocket (1050 ms)
[ RUN ] Parameters/TestRpc.TestClientConnectionMetrics/SSL_UnixSocket
I20260928 16:35:27.076259 24374 acceptor_pool.cc:254] collecting diagnostics on the listening RPC socket unix:/tmp/dist-test-taskabeQ4R/test-tmp/rpc-test-1092963a943342018ae498e0a63343c7.sock every 8 connection(s)
I20260928 16:35:27.076447 24375 acceptor_pool.cc:254] collecting diagnostics on the listening RPC socket unix:/tmp/dist-test-taskabeQ4R/test-tmp/rpc-test-1092963a943342018ae498e0a63343c7.sock every 8 connection(s)
I20260928 16:35:27.076957 24227 rpc-test.cc:569] Connecting to unix:/tmp/dist-test-taskabeQ4R/test-tmp/rpc-test-1092963a943342018ae498e0a63343c7.sock
W20260928 16:35:37.219856 24371 connection.cc:196] Error closing socket: Network error: TlsSocket::Close: Broken pipe
[ OK ] Parameters/TestRpc.TestClientConnectionMetrics/SSL_UnixSocket (10169 ms)
[ RUN ] Parameters/TestRpc.TestCredentialsPolicy/SSL_UnixSocket
I20260928 16:35:37.227023 24398 acceptor_pool.cc:254] collecting diagnostics on the listening RPC socket unix:/tmp/dist-test-taskabeQ4R/test-tmp/rpc-test-7fcdea3196494916ae05fc15c2ecaeda.sock every 8 connection(s)
I20260928 16:35:37.227166 24399 acceptor_pool.cc:254] collecting diagnostics on the listening RPC socket unix:/tmp/dist-test-taskabeQ4R/test-tmp/rpc-test-7fcdea3196494916ae05fc15c2ecaeda.sock every 8 connection(s)
I20260928 16:35:37.227447 24227 rpc-test.cc:700] Connecting to unix:/tmp/dist-test-taskabeQ4R/test-tmp/rpc-test-7fcdea3196494916ae05fc15c2ecaeda.sock
W20260928 16:35:37.251892 24397 connection.cc:196] Error closing socket: Network error: TlsSocket::Close: Broken pipe
[ OK ] Parameters/TestRpc.TestCredentialsPolicy/SSL_UnixSocket (36 ms)
[ RUN ] Parameters/TestRpc.TestCallLongerThanKeepalive/SSL_UnixSocket
I20260928 16:35:37.295938 24425 acceptor_pool.cc:254] collecting diagnostics on the listening RPC socket unix:/tmp/dist-test-taskabeQ4R/test-tmp/rpc-test-7c0c8704bc724802b225b01ecdda6425.sock every 8 connection(s)
I20260928 16:35:37.295981 24426 acceptor_pool.cc:254] collecting diagnostics on the listening RPC socket unix:/tmp/dist-test-taskabeQ4R/test-tmp/rpc-test-7c0c8704bc724802b225b01ecdda6425.sock every 8 connection(s)
I20260928 16:35:37.316461 24429 rpc-test-base.h:222] got call: sleep_micros: 3000000 deferred: true
I20260928 16:35:40.317474 24429 rpcz_store.cc:275] Call kudu.rpc.GenericCalculatorService.Sleep from unix:<unnamed> (request call id 0) took 3001 ms. Trace:
I20260928 16:35:40.317590 24429 rpcz_store.cc:276] 0928 16:35:37.316380 (+ 0us) service_pool.cc:170] Inserting onto call queue
0928 16:35:37.316436 (+ 56us) service_pool.cc:227] Handling call
0928 16:35:40.317442 (+3001006us) inbound_call.cc:173] Queueing success response
Metrics: {}
W20260928 16:35:40.319214 24421 connection.cc:196] Error closing socket: Network error: TlsSocket::Close: Broken pipe
[ OK ] Parameters/TestRpc.TestCallLongerThanKeepalive/SSL_UnixSocket (3062 ms)
[ RUN ] Parameters/TestRpc.TestRpcSidecar/SSL_UnixSocket
I20260928 16:35:40.345765 24451 acceptor_pool.cc:254] collecting diagnostics on the listening RPC socket unix:/tmp/dist-test-taskabeQ4R/test-tmp/rpc-test-31f03c03333748ab9490204c50276189.sock every 8 connection(s)
I20260928 16:35:40.345737 24450 acceptor_pool.cc:254] collecting diagnostics on the listening RPC socket unix:/tmp/dist-test-taskabeQ4R/test-tmp/rpc-test-31f03c03333748ab9490204c50276189.sock every 8 connection(s)
W20260928 16:35:40.402737 24447 connection.cc:196] Error closing socket: Network error: TlsSocket::Close: Broken pipe
[ OK ] Parameters/TestRpc.TestRpcSidecar/SSL_UnixSocket (83 ms)
[ RUN ] Parameters/TestRpc.TestRpcSidecarLimits/SSL_UnixSocket
I20260928 16:35:42.248586 24475 acceptor_pool.cc:254] collecting diagnostics on the listening RPC socket unix:/tmp/dist-test-taskabeQ4R/test-tmp/rpc-test-4ecb176be40445829910a9b775aa4519.sock every 8 connection(s)
I20260928 16:35:42.248612 24476 acceptor_pool.cc:254] collecting diagnostics on the listening RPC socket unix:/tmp/dist-test-taskabeQ4R/test-tmp/rpc-test-4ecb176be40445829910a9b775aa4519.sock every 8 connection(s)
W20260928 16:35:42.259722 24227 serialization.cc:72] Serialized kudu.rpc_test.PushStringsRequestPB (2147483654 bytes) is larger than the maximum configured RPC message size (52428800 bytes). Sending anyway, but peer may reject the data.
W20260928 16:35:42.264113 24472 connection.cc:535] server connection from unix:<unnamed> recv error: Network error: RPC frame had a length of 2147483714, but we only support messages up to 52428800 bytes long.
W20260928 16:35:42.264204 24472 connection.cc:158] shutting down server connection from unix:<unnamed> with pending inbound data: 4/2147483714 bytes received; last active 0 ns ago: status Network error: RPC frame had a length of 2147483714, but we only support messages up to 52428800 bytes long.
W20260928 16:35:42.264472 24488 connection.cc:196] Error closing socket: Network error: TlsSocket::Close: Broken pipe
I20260928 16:35:42.279644 24502 acceptor_pool.cc:254] collecting diagnostics on the listening RPC socket unix:/tmp/dist-test-taskabeQ4R/test-tmp/rpc-test-4ecb176be40445829910a9b775aa4519.sock every 8 connection(s)
I20260928 16:35:42.279678 24503 acceptor_pool.cc:254] collecting diagnostics on the listening RPC socket unix:/tmp/dist-test-taskabeQ4R/test-tmp/rpc-test-4ecb176be40445829910a9b775aa4519.sock every 8 connection(s)
W20260928 16:35:50.117900 24499 connection.cc:577] server connection from unix:<unnamed>: received bad data: 'Corruption: Invalid packet: message had a length of 2147483710, but we only support messages up to 2147483647 bytes
'
W20260928 16:35:50.118242 24516 connection.cc:196] Error closing socket: Network error: TlsSocket::Close: Broken pipe
[ OK ] Parameters/TestRpc.TestRpcSidecarLimits/SSL_UnixSocket (9716 ms)
[ RUN ] Parameters/TestRpc.TestCallTimeoutDoesntAffectNegotiation/SSL_UnixSocket
I20260928 16:35:50.136474 24528 acceptor_pool.cc:254] collecting diagnostics on the listening RPC socket unix:/tmp/dist-test-taskabeQ4R/test-tmp/rpc-test-69c8de2db30344d8859722522e41d6dc.sock every 8 connection(s)
I20260928 16:35:50.136510 24529 acceptor_pool.cc:254] collecting diagnostics on the listening RPC socket unix:/tmp/dist-test-taskabeQ4R/test-tmp/rpc-test-69c8de2db30344d8859722522e41d6dc.sock every 8 connection(s)
W20260928 16:35:50.143332 24524 negotiation.cc:266] Injecting 500ms delay in negotiation
I20260928 16:35:50.193770 24227 rpc-test-base.h:595] status: Timed out: connection negotiation to unix:/tmp/dist-test-taskabeQ4R/test-tmp/rpc-test-69c8de2db30344d8859722522e41d6dc.sock for RPC Sleep timed out after 0.050s (ON_OUTBOUND_QUEUE), seconds elapsed: 0.0508353
[ OK ] Parameters/TestRpc.TestCallTimeoutDoesntAffectNegotiation/SSL_UnixSocket (528 ms)
[ RUN ] Parameters/TestRpc.TestRpcHandlerLatencyMetric/SSL_UnixSocket
I20260928 16:35:50.660706 24553 acceptor_pool.cc:254] collecting diagnostics on the listening RPC socket unix:/tmp/dist-test-taskabeQ4R/test-tmp/rpc-test-8ac34906c24548e0b3c9f5a848a2a445.sock every 8 connection(s)
I20260928 16:35:50.660871 24554 acceptor_pool.cc:254] collecting diagnostics on the listening RPC socket unix:/tmp/dist-test-taskabeQ4R/test-tmp/rpc-test-8ac34906c24548e0b3c9f5a848a2a445.sock every 8 connection(s)
I20260928 16:35:50.699065 24227 rpc-test.cc:1236] Sleep() min lat: 20391
I20260928 16:35:50.699151 24227 rpc-test.cc:1237] Sleep() mean lat: 20391
I20260928 16:35:50.699182 24227 rpc-test.cc:1238] Sleep() max lat: 20391
I20260928 16:35:50.699195 24227 rpc-test.cc:1239] Sleep() #calls: 1
W20260928 16:35:50.700071 24550 connection.cc:196] Error closing socket: Network error: TlsSocket::Close: Broken pipe
[ OK ] Parameters/TestRpc.TestRpcHandlerLatencyMetric/SSL_UnixSocket (51 ms)
[ RUN ] Parameters/TestRpc.TimedOutOnResponseMetricServiceQueue/SSL_UnixSocket
I20260928 16:35:50.715461 24580 acceptor_pool.cc:254] collecting diagnostics on the listening RPC socket unix:/tmp/dist-test-taskabeQ4R/test-tmp/rpc-test-706b60ada2224a0a90427e19e2f1601b.sock every 8 connection(s)
I20260928 16:35:50.715507 24581 acceptor_pool.cc:254] collecting diagnostics on the listening RPC socket unix:/tmp/dist-test-taskabeQ4R/test-tmp/rpc-test-706b60ada2224a0a90427e19e2f1601b.sock every 8 connection(s)
W20260928 16:35:50.765596 24582 rpcz_store.cc:267] Call kudu.rpc_test.CalculatorService.Sleep from unix:<unnamed> (request call id 2) took 20 ms (client timeout 20 ms). Trace:
W20260928 16:35:50.765718 24582 rpcz_store.cc:269] 0928 16:35:50.745196 (+ 0us) service_pool.cc:170] Inserting onto call queue
0928 16:35:50.765550 (+ 20354us) service_pool.cc:214] Skipping call since client already timed out
0928 16:35:50.765579 (+ 29us) inbound_call.cc:173] Queueing failure response
Metrics: {}
[ OK ] Parameters/TestRpc.TimedOutOnResponseMetricServiceQueue/SSL_UnixSocket (66 ms)
[ RUN ] Parameters/TestRpc.RpcPendingConnectionsMetric/SSL_UnixSocket
I20260928 16:35:50.769991 24603 acceptor_pool.cc:254] collecting diagnostics on the listening RPC socket 0.0.0.0:38797 every 8 connection(s)
I20260928 16:35:50.770061 24604 acceptor_pool.cc:254] collecting diagnostics on the listening RPC socket 0.0.0.0:38797 every 8 connection(s)
W20260928 16:35:50.771109 24599 negotiation.cc:337] Failed RPC negotiation. Trace:
0928 16:35:50.770732 (+ 0us) reactor.cc:625] Submitting negotiation task for server connection from 127.0.0.1:53468 (local address 127.0.0.1:38797)
0928 16:35:50.770813 (+ 81us) server_negotiation.cc:206] Beginning negotiation
0928 16:35:50.770816 (+ 3us) server_negotiation.cc:399] Waiting for connection header
0928 16:35:50.770904 (+ 88us) negotiation.cc:327] Negotiation complete: Network error: Server connection negotiation failed: server connection from 127.0.0.1:53468: BlockingRecv error: recv got EOF from 127.0.0.1:53468 (error 108)
Metrics: {"server-negotiator.queue_time_us":19}
[ OK ] Parameters/TestRpc.RpcPendingConnectionsMetric/SSL_UnixSocket (14 ms)
[ RUN ] Parameters/TestRpc.TestRpcContextClientDeadline/SSL_UnixSocket
I20260928 16:35:50.797917 24620 acceptor_pool.cc:254] collecting diagnostics on the listening RPC socket unix:/tmp/dist-test-taskabeQ4R/test-tmp/rpc-test-2ce9506462034b7da7b45f4548f7af7e.sock every 8 connection(s)
I20260928 16:35:50.797899 24619 acceptor_pool.cc:254] collecting diagnostics on the listening RPC socket unix:/tmp/dist-test-taskabeQ4R/test-tmp/rpc-test-2ce9506462034b7da7b45f4548f7af7e.sock every 8 connection(s)
[ OK ] Parameters/TestRpc.TestRpcContextClientDeadline/SSL_UnixSocket (50 ms)
[ RUN ] Parameters/TestRpc.TestApplicationFeatureFlagUnsupportedServer/SSL_UnixSocket
I20260928 16:35:50.854768 24645 acceptor_pool.cc:254] collecting diagnostics on the listening RPC socket unix:/tmp/dist-test-taskabeQ4R/test-tmp/rpc-test-7728a4ff597b4d83977cab399ee64a02.sock every 8 connection(s)
I20260928 16:35:50.854800 24646 acceptor_pool.cc:254] collecting diagnostics on the listening RPC socket unix:/tmp/dist-test-taskabeQ4R/test-tmp/rpc-test-7728a4ff597b4d83977cab399ee64a02.sock every 8 connection(s)
W20260928 16:35:50.878171 24642 connection.cc:196] Error closing socket: Network error: TlsSocket::Close: Broken pipe
[ OK ] Parameters/TestRpc.TestApplicationFeatureFlagUnsupportedServer/SSL_UnixSocket (46 ms)
[ RUN ] Parameters/TestRpc.TestCancellationAsync/SSL_UnixSocket
I20260928 16:35:50.898939 24671 acceptor_pool.cc:254] collecting diagnostics on the listening RPC socket unix:/tmp/dist-test-taskabeQ4R/test-tmp/rpc-test-327df91c2d2f4acd9d5f32155af55c8e.sock every 8 connection(s)
I20260928 16:35:50.898965 24672 acceptor_pool.cc:254] collecting diagnostics on the listening RPC socket unix:/tmp/dist-test-taskabeQ4R/test-tmp/rpc-test-327df91c2d2f4acd9d5f32155af55c8e.sock every 8 connection(s)
I20260928 16:35:50.899273 24227 rpc-test.cc:1716] Connecting to unix:/tmp/dist-test-taskabeQ4R/test-tmp/rpc-test-327df91c2d2f4acd9d5f32155af55c8e.sock
I20260928 16:35:50.907176 24227 test_util.cc:268] Using random seed: -1464468187
I20260928 16:35:50.927565 24675 rpc-test-base.h:240] got call: sleep_micros: 500 pattern: 4294967295 num_repetitions: 2097152 sidecar_idx: 0
I20260928 16:35:50.944442 24674 rpc-test-base.h:240] got call: sleep_micros: 500 pattern: 4294967295 num_repetitions: 2097152 sidecar_idx: 0
I20260928 16:35:50.965456 24675 rpc-test-base.h:240] got call: sleep_micros: 500 pattern: 4294967295 num_repetitions: 2097152 sidecar_idx: 0
I20260928 16:35:50.982007 24674 rpc-test-base.h:240] got call: sleep_micros: 500 pattern: 4294967295 num_repetitions: 2097152 sidecar_idx: 0
I20260928 16:35:51.002868 24675 rpc-test-base.h:240] got call: sleep_micros: 500 pattern: 4294967295 num_repetitions: 2097152 sidecar_idx: 0
I20260928 16:35:51.020911 24674 rpc-test-base.h:240] got call: sleep_micros: 500 pattern: 4294967295 num_repetitions: 2097152 sidecar_idx: 0
I20260928 16:35:51.037014 24675 rpc-test-base.h:240] got call: sleep_micros: 500 pattern: 4294967295 num_repetitions: 2097152 sidecar_idx: 0
I20260928 16:35:51.052961 24674 rpc-test-base.h:240] got call: sleep_micros: 500 pattern: 4294967295 num_repetitions: 2097152 sidecar_idx: 0
W20260928 16:35:51.054759 24668 connection.cc:196] Error closing socket: Network error: TlsSocket::Close: Broken pipe
W20260928 16:35:51.061044 24668 connection.cc:441] server connection from unix:<unnamed> torn down before Call kudu.rpc.GenericCalculatorService.SleepWithSidecar from unix:<unnamed> (request call id 8) could send its response
W20260928 16:35:51.071141 24668 connection.cc:441] server connection from unix:<unnamed> torn down before Call kudu.rpc.GenericCalculatorService.SleepWithSidecar from unix:<unnamed> (request call id 9) could send its response
[ OK ] Parameters/TestRpc.TestCancellationAsync/SSL_UnixSocket (193 ms)
[ RUN ] Parameters/TestRpc.TestPerformanceBySocketType/SSL_UnixSocket
I20260928 16:35:51.092016 24696 acceptor_pool.cc:254] collecting diagnostics on the listening RPC socket unix:/tmp/dist-test-taskabeQ4R/test-tmp/rpc-test-4500d22d485d403bbdcfc91e5036f10b.sock every 8 connection(s)
I20260928 16:35:51.092049 24697 acceptor_pool.cc:254] collecting diagnostics on the listening RPC socket unix:/tmp/dist-test-taskabeQ4R/test-tmp/rpc-test-4500d22d485d403bbdcfc91e5036f10b.sock every 8 connection(s)
I20260928 16:35:51.092348 24227 rpc-test.cc:1846] Connecting to unix:/tmp/dist-test-taskabeQ4R/test-tmp/rpc-test-4500d22d485d403bbdcfc91e5036f10b.sock
I20260928 16:35:52.631284 24227 rpc-test.cc:1859] Sending 1024MB via ssl-enabled unix socket: real 1.517s user 1.863s sys 0.900s
I20260928 16:35:54.200274 24227 rpc-test.cc:1859] Sending 1024MB via ssl-enabled unix socket: real 1.569s user 1.975s sys 0.860s
I20260928 16:35:55.696985 24227 rpc-test.cc:1859] Sending 1024MB via ssl-enabled unix socket: real 1.497s user 1.830s sys 0.891s
I20260928 16:35:57.191921 24227 rpc-test.cc:1859] Sending 1024MB via ssl-enabled unix socket: real 1.495s user 1.815s sys 0.906s
I20260928 16:35:58.713775 24227 rpc-test.cc:1859] Sending 1024MB via ssl-enabled unix socket: real 1.522s user 1.867s sys 0.892s
W20260928 16:35:58.715013 24693 connection.cc:196] Error closing socket: Network error: TlsSocket::Close: Broken pipe
[ OK ] Parameters/TestRpc.TestPerformanceBySocketType/SSL_UnixSocket (7643 ms)
[----------] 20 tests from Parameters/TestRpc (32889 ms total)
[----------] 1 test from Parameters/TestRpcSocketTxRxQueue
[ RUN ] Parameters/TestRpcSocketTxRxQueue.AcceptorRxQueueSizeMetric/0
I20260928 16:35:58.728369 24722 acceptor_pool.cc:254] collecting diagnostics on the listening RPC socket 0.0.0.0:40871 every 1 connection(s)
I20260928 16:35:58.728515 24723 acceptor_pool.cc:254] collecting diagnostics on the listening RPC socket 0.0.0.0:40871 every 1 connection(s)
W20260928 16:35:58.729470 24718 negotiation.cc:337] Failed RPC negotiation. Trace:
0928 16:35:58.729181 (+ 0us) reactor.cc:625] Submitting negotiation task for server connection from 127.0.0.1:42154 (local address 127.0.0.1:40871)
0928 16:35:58.729281 (+ 100us) server_negotiation.cc:206] Beginning negotiation
0928 16:35:58.729284 (+ 3us) server_negotiation.cc:399] Waiting for connection header
0928 16:35:58.729382 (+ 98us) negotiation.cc:327] Negotiation complete: Network error: Server connection negotiation failed: server connection from 127.0.0.1:42154: BlockingRecv error: recv got EOF from 127.0.0.1:42154 (error 108)
Metrics: {"server-negotiator.queue_time_us":27}
[ OK ] Parameters/TestRpcSocketTxRxQueue.AcceptorRxQueueSizeMetric/0 (15 ms)
[----------] 1 test from Parameters/TestRpcSocketTxRxQueue (15 ms total)
[----------] Global test environment tear-down
[==========] 21 tests from 2 test suites ran. (32904 ms total)
[ PASSED ] 20 tests.
[ FAILED ] 1 test, listed below:
[ FAILED ] Parameters/TestRpc.TestCallWithChainCertAndChainCA/SSL_UnixSocket, where GetParam() = (true, true)
1 FAILED TEST