Diagnosed failure

Parameters/TestRpc.TestCallWithChainCertAndChainCA/SSL_UnixSocket: /data0/somelongdirectorytoavoidrpathissues/src/kudu/src/kudu/rpc/rpc-test.cc:270: Failure
Failed
Bad status: Runtime error: could not verify certificate chain (error with cert: subject=CN = localhost, ST = sadfjas, C = AS, emailAddress = sdflkdsajf, O = lskdfjlsad, OU = sldfkja, issuer=C = AS, ST = ASDfkjdhf, L = lskdjf, O = saldfja, OU = skdjf, CN = localhost, emailAddress = sadjflkadsj): : certificate has expired
Google Test trace:
/data0/somelongdirectorytoavoidrpathissues/src/kudu/src/kudu/rpc/rpc-test.cc:267: Connecting to unix:/tmp/dist-test-taskvhPfgH/test-tmp/rpc-test-9b908142ed1747cfab84aeb7f2307362.sock
I20260924 09:58:58.764536 13743 test_util.cc:175] -----------------------------------------------
I20260924 09:58:58.764633 13743 test_util.cc:176] Had fatal failures, leaving test files at /tmp/dist-test-taskvhPfgH/test-tmp/rpc-test.6.Parameters_TestRpc.TestCallWithChainCertAndChainCA_SSL_UnixSocket.1790243938606036-13743-0

Full log

Note: This is test shard 7 of 8.
[==========] Running 21 tests from 2 test suites.
[----------] Global test environment set-up.
[----------] 20 tests from Parameters/TestRpc
[ RUN      ] Parameters/TestRpc.TestMessengerCreateDestroy/SSL_UnixSocket
WARNING: Logging before InitGoogleLogging() is written to STDERR
I20260924 09:58:58.648175 13743 rpc-test.cc:169] started messenger TestCreateDestroy
[       OK ] Parameters/TestRpc.TestMessengerCreateDestroy/SSL_UnixSocket (24 ms)
[ RUN      ] Parameters/TestRpc.TestNegotiationDeadlock/SSL_UnixSocket
I20260924 09:58:58.683881 13763 acceptor_pool.cc:254] collecting diagnostics on the listening RPC socket unix:/tmp/dist-test-taskvhPfgH/test-tmp/rpc-test-dcff2870fd6840ecad715df7b3941d7b.sock every 8 connection(s)
I20260924 09:58:58.684259 13764 acceptor_pool.cc:254] collecting diagnostics on the listening RPC socket unix:/tmp/dist-test-taskvhPfgH/test-tmp/rpc-test-dcff2870fd6840ecad715df7b3941d7b.sock every 8 connection(s)
[       OK ] Parameters/TestRpc.TestNegotiationDeadlock/SSL_UnixSocket (51 ms)
[ RUN      ] Parameters/TestRpc.TestCallWithChainCertAndChainCA/SSL_UnixSocket
I20260924 09:58:58.752723 13779 acceptor_pool.cc:254] collecting diagnostics on the listening RPC socket unix:/tmp/dist-test-taskvhPfgH/test-tmp/rpc-test-9b908142ed1747cfab84aeb7f2307362.sock every 8 connection(s)
I20260924 09:58:58.753123 13780 acceptor_pool.cc:254] collecting diagnostics on the listening RPC socket unix:/tmp/dist-test-taskvhPfgH/test-tmp/rpc-test-9b908142ed1747cfab84aeb7f2307362.sock every 8 connection(s)
/data0/somelongdirectorytoavoidrpathissues/src/kudu/src/kudu/rpc/rpc-test.cc:270: Failure
Failed
Bad status: Runtime error: could not verify certificate chain (error with cert: subject=CN = localhost, ST = sadfjas, C = AS, emailAddress = sdflkdsajf, O = lskdfjlsad, OU = sldfkja, issuer=C = AS, ST = ASDfkjdhf, L = lskdjf, O = saldfja, OU = skdjf, CN = localhost, emailAddress = sadjflkadsj): : certificate has expired
Google Test trace:
/data0/somelongdirectorytoavoidrpathissues/src/kudu/src/kudu/rpc/rpc-test.cc:267: Connecting to unix:/tmp/dist-test-taskvhPfgH/test-tmp/rpc-test-9b908142ed1747cfab84aeb7f2307362.sock
I20260924 09:58:58.764536 13743 test_util.cc:175] -----------------------------------------------
I20260924 09:58:58.764633 13743 test_util.cc:176] Had fatal failures, leaving test files at /tmp/dist-test-taskvhPfgH/test-tmp/rpc-test.6.Parameters_TestRpc.TestCallWithChainCertAndChainCA_SSL_UnixSocket.1790243938606036-13743-0
[  FAILED  ] Parameters/TestRpc.TestCallWithChainCertAndChainCA/SSL_UnixSocket, where GetParam() = (true, true) (61 ms)
[ RUN      ] Parameters/TestRpc.TestCallWithPasswordProtectedKey/SSL_UnixSocket
I20260924 09:58:58.776336 13804 acceptor_pool.cc:254] collecting diagnostics on the listening RPC socket unix:/tmp/dist-test-taskvhPfgH/test-tmp/rpc-test-db9e19da8611441e935e8390b370a442.sock every 8 connection(s)
I20260924 09:58:58.776640 13805 acceptor_pool.cc:254] collecting diagnostics on the listening RPC socket unix:/tmp/dist-test-taskvhPfgH/test-tmp/rpc-test-db9e19da8611441e935e8390b370a442.sock every 8 connection(s)
[       OK ] Parameters/TestRpc.TestCallWithPasswordProtectedKey/SSL_UnixSocket (46 ms)
[ RUN      ] Parameters/TestRpc.TestCallToBadServer/SSL_UnixSocket
I20260924 09:58:58.824985 13743 rpc-test.cc:394] Status: Network error: Client connection negotiation failed: client connection to 0.0.0.0:0: connect: Connection refused (error 111)
I20260924 09:58:58.825843 13743 rpc-test.cc:394] Status: Network error: Client connection negotiation failed: client connection to 0.0.0.0:0: connect: Connection refused (error 111)
I20260924 09:58:58.826499 13743 rpc-test.cc:394] Status: Network error: Client connection negotiation failed: client connection to 0.0.0.0:0: connect: Connection refused (error 111)
I20260924 09:58:58.827097 13743 rpc-test.cc:394] Status: Network error: Client connection negotiation failed: client connection to 0.0.0.0:0: connect: Connection refused (error 111)
I20260924 09:58:58.827649 13743 rpc-test.cc:394] Status: Network error: Client connection negotiation failed: client connection to 0.0.0.0:0: connect: Connection refused (error 111)
[       OK ] Parameters/TestRpc.TestCallToBadServer/SSL_UnixSocket (18 ms)
[ RUN      ] Parameters/TestRpc.TestWrongService/SSL_UnixSocket
I20260924 09:58:58.871738 13839 acceptor_pool.cc:254] collecting diagnostics on the listening RPC socket unix:/tmp/dist-test-taskvhPfgH/test-tmp/rpc-test-f0b689aa6c744df7a7e0da414925664c.sock every 8 connection(s)
I20260924 09:58:58.872015 13840 acceptor_pool.cc:254] collecting diagnostics on the listening RPC socket unix:/tmp/dist-test-taskvhPfgH/test-tmp/rpc-test-f0b689aa6c744df7a7e0da414925664c.sock every 8 connection(s)
I20260924 09:58:58.898754 13836 messenger.cc:345] service WrongServiceName not registered on TestServer
[       OK ] Parameters/TestRpc.TestWrongService/SSL_UnixSocket (74 ms)
[ RUN      ] Parameters/TestRpc.TestConnectionKeepalive/SSL_UnixSocket
I20260924 09:58:58.922057 13862 acceptor_pool.cc:254] collecting diagnostics on the listening RPC socket unix:/tmp/dist-test-taskvhPfgH/test-tmp/rpc-test-c25c686fe5494bfbbc27107f124e6867.sock every 8 connection(s)
I20260924 09:58:58.922336 13863 acceptor_pool.cc:254] collecting diagnostics on the listening RPC socket unix:/tmp/dist-test-taskvhPfgH/test-tmp/rpc-test-c25c686fe5494bfbbc27107f124e6867.sock every 8 connection(s)
I20260924 09:58:58.923276 13743 rpc-test.cc:488] Connecting to unix:/tmp/dist-test-taskvhPfgH/test-tmp/rpc-test-c25c686fe5494bfbbc27107f124e6867.sock
W20260924 09:58:59.406442 13875 connection.cc:196] Error closing socket: Network error: TlsSocket::Close: Broken pipe
[       OK ] Parameters/TestRpc.TestConnectionKeepalive/SSL_UnixSocket (1054 ms)
[ RUN      ] Parameters/TestRpc.TestClientConnectionMetrics/SSL_UnixSocket
I20260924 09:58:59.978268 13887 acceptor_pool.cc:254] collecting diagnostics on the listening RPC socket unix:/tmp/dist-test-taskvhPfgH/test-tmp/rpc-test-3c09547293ff4b05b61b268c11c141f4.sock every 8 connection(s)
I20260924 09:58:59.978504 13888 acceptor_pool.cc:254] collecting diagnostics on the listening RPC socket unix:/tmp/dist-test-taskvhPfgH/test-tmp/rpc-test-3c09547293ff4b05b61b268c11c141f4.sock every 8 connection(s)
I20260924 09:58:59.979498 13743 rpc-test.cc:569] Connecting to unix:/tmp/dist-test-taskvhPfgH/test-tmp/rpc-test-3c09547293ff4b05b61b268c11c141f4.sock
[       OK ] Parameters/TestRpc.TestClientConnectionMetrics/SSL_UnixSocket (22009 ms)
[ RUN      ] Parameters/TestRpc.TestCredentialsPolicy/SSL_UnixSocket
I20260924 09:59:21.995127 13910 acceptor_pool.cc:254] collecting diagnostics on the listening RPC socket unix:/tmp/dist-test-taskvhPfgH/test-tmp/rpc-test-6897028274bc4dbfaf6b2fe6ffe114cb.sock every 8 connection(s)
I20260924 09:59:21.995404 13911 acceptor_pool.cc:254] collecting diagnostics on the listening RPC socket unix:/tmp/dist-test-taskvhPfgH/test-tmp/rpc-test-6897028274bc4dbfaf6b2fe6ffe114cb.sock every 8 connection(s)
I20260924 09:59:21.996454 13743 rpc-test.cc:700] Connecting to unix:/tmp/dist-test-taskvhPfgH/test-tmp/rpc-test-6897028274bc4dbfaf6b2fe6ffe114cb.sock
W20260924 09:59:22.041842 13909 connection.cc:196] Error closing socket: Network error: TlsSocket::Close: Broken pipe
W20260924 09:59:22.049772 13909 connection.cc:196] Error closing socket: Network error: TlsSocket::Close: Broken pipe
[       OK ] Parameters/TestRpc.TestCredentialsPolicy/SSL_UnixSocket (84 ms)
[ RUN      ] Parameters/TestRpc.TestCallLongerThanKeepalive/SSL_UnixSocket
I20260924 09:59:22.069877 13935 acceptor_pool.cc:254] collecting diagnostics on the listening RPC socket unix:/tmp/dist-test-taskvhPfgH/test-tmp/rpc-test-5dbd9597a8434f089588fc83b5d00112.sock every 8 connection(s)
I20260924 09:59:22.070116 13936 acceptor_pool.cc:254] collecting diagnostics on the listening RPC socket unix:/tmp/dist-test-taskvhPfgH/test-tmp/rpc-test-5dbd9597a8434f089588fc83b5d00112.sock every 8 connection(s)
I20260924 09:59:22.115047 13939 rpc-test-base.h:222] got call: sleep_micros: 3000000 deferred: true
I20260924 09:59:25.116755 13939 rpcz_store.cc:275] Call kudu.rpc.GenericCalculatorService.Sleep from unix:<unnamed> (request call id 0) took 3001 ms. Trace:
I20260924 09:59:25.116906 13939 rpcz_store.cc:276] 0924 09:59:22.114934 (+     0us) service_pool.cc:170] Inserting onto call queue
0924 09:59:22.114998 (+    64us) service_pool.cc:227] Handling call
0924 09:59:25.116690 (+3001692us) inbound_call.cc:173] Queueing success response
Metrics: {}
W20260924 09:59:25.119459 13932 connection.cc:196] Error closing socket: Network error: TlsSocket::Close: Broken pipe
[       OK ] Parameters/TestRpc.TestCallLongerThanKeepalive/SSL_UnixSocket (3070 ms)
[ RUN      ] Parameters/TestRpc.TestRpcSidecar/SSL_UnixSocket
I20260924 09:59:25.145608 13960 acceptor_pool.cc:254] collecting diagnostics on the listening RPC socket unix:/tmp/dist-test-taskvhPfgH/test-tmp/rpc-test-a73dc7f3b92842f5a3939b443310ee6d.sock every 8 connection(s)
I20260924 09:59:25.145864 13961 acceptor_pool.cc:254] collecting diagnostics on the listening RPC socket unix:/tmp/dist-test-taskvhPfgH/test-tmp/rpc-test-a73dc7f3b92842f5a3939b443310ee6d.sock every 8 connection(s)
W20260924 09:59:25.261850 13957 connection.cc:196] Error closing socket: Network error: TlsSocket::Close: Broken pipe
[       OK ] Parameters/TestRpc.TestRpcSidecar/SSL_UnixSocket (141 ms)
[ RUN      ] Parameters/TestRpc.TestRpcSidecarLimits/SSL_UnixSocket
I20260924 09:59:27.352144 13985 acceptor_pool.cc:254] collecting diagnostics on the listening RPC socket unix:/tmp/dist-test-taskvhPfgH/test-tmp/rpc-test-4d8b9f695e1e46f3b42cdfb25fb111a5.sock every 8 connection(s)
I20260924 09:59:27.352869 13986 acceptor_pool.cc:254] collecting diagnostics on the listening RPC socket unix:/tmp/dist-test-taskvhPfgH/test-tmp/rpc-test-4d8b9f695e1e46f3b42cdfb25fb111a5.sock every 8 connection(s)
W20260924 09:59:27.364992 13743 serialization.cc:72] Serialized kudu.rpc_test.PushStringsRequestPB (2147483654 bytes) is larger than the maximum configured RPC message size (52428800 bytes). Sending anyway, but peer may reject the data.
W20260924 09:59:27.371201 13982 connection.cc:535] server connection from unix:<unnamed> recv error: Network error: RPC frame had a length of 2147483714, but we only support messages up to 52428800 bytes long.
W20260924 09:59:27.371359 13982 connection.cc:158] shutting down server connection from unix:<unnamed> with pending inbound data: 4/2147483714 bytes received; last active 0 ns ago: status Network error: RPC frame had a length of 2147483714, but we only support messages up to 52428800 bytes long.
W20260924 09:59:27.371863 13998 connection.cc:196] Error closing socket: Network error: TlsSocket::Close: Broken pipe
I20260924 09:59:27.387825 14010 acceptor_pool.cc:254] collecting diagnostics on the listening RPC socket unix:/tmp/dist-test-taskvhPfgH/test-tmp/rpc-test-4d8b9f695e1e46f3b42cdfb25fb111a5.sock every 8 connection(s)
I20260924 09:59:27.388247 14011 acceptor_pool.cc:254] collecting diagnostics on the listening RPC socket unix:/tmp/dist-test-taskvhPfgH/test-tmp/rpc-test-4d8b9f695e1e46f3b42cdfb25fb111a5.sock every 8 connection(s)
W20260924 09:59:33.233556 14007 connection.cc:577] server connection from unix:<unnamed>: received bad data: 'Corruption: Invalid packet: message had a length of 2147483710, but we only support messages up to 2147483647 bytes
'
W20260924 09:59:33.234179 14023 connection.cc:196] Error closing socket: Network error: TlsSocket::Close: Broken pipe
[       OK ] Parameters/TestRpc.TestRpcSidecarLimits/SSL_UnixSocket (8472 ms)
[ RUN      ] Parameters/TestRpc.TestCallTimeoutDoesntAffectNegotiation/SSL_UnixSocket
I20260924 09:59:33.765643 14035 acceptor_pool.cc:254] collecting diagnostics on the listening RPC socket unix:/tmp/dist-test-taskvhPfgH/test-tmp/rpc-test-90ac3d5aef3c40c6bd4c9a10d05b993e.sock every 8 connection(s)
I20260924 09:59:33.765887 14036 acceptor_pool.cc:254] collecting diagnostics on the listening RPC socket unix:/tmp/dist-test-taskvhPfgH/test-tmp/rpc-test-90ac3d5aef3c40c6bd4c9a10d05b993e.sock every 8 connection(s)
W20260924 09:59:33.781132 14031 negotiation.cc:266] Injecting 500ms delay in negotiation
I20260924 09:59:33.831652 13743 rpc-test-base.h:595] status: Timed out: connection negotiation to unix:/tmp/dist-test-taskvhPfgH/test-tmp/rpc-test-90ac3d5aef3c40c6bd4c9a10d05b993e.sock for RPC Sleep timed out after 0.050s (ON_OUTBOUND_QUEUE), seconds elapsed: 0.0510902
W20260924 09:59:34.287735 14032 connection.cc:196] Error closing socket: Network error: TlsSocket::Close: Broken pipe
[       OK ] Parameters/TestRpc.TestCallTimeoutDoesntAffectNegotiation/SSL_UnixSocket (553 ms)
[ RUN      ] Parameters/TestRpc.TestRpcHandlerLatencyMetric/SSL_UnixSocket
I20260924 09:59:34.303831 14060 acceptor_pool.cc:254] collecting diagnostics on the listening RPC socket unix:/tmp/dist-test-taskvhPfgH/test-tmp/rpc-test-c15c4bd61f97492d96e40613e2307b50.sock every 8 connection(s)
I20260924 09:59:34.304133 14061 acceptor_pool.cc:254] collecting diagnostics on the listening RPC socket unix:/tmp/dist-test-taskvhPfgH/test-tmp/rpc-test-c15c4bd61f97492d96e40613e2307b50.sock every 8 connection(s)
I20260924 09:59:34.343933 13743 rpc-test.cc:1236] Sleep() min lat: 20586
I20260924 09:59:34.344028 13743 rpc-test.cc:1237] Sleep() mean lat: 20586
I20260924 09:59:34.344069 13743 rpc-test.cc:1238] Sleep() max lat: 20586
I20260924 09:59:34.344125 13743 rpc-test.cc:1239] Sleep() #calls: 1
W20260924 09:59:34.345340 14057 connection.cc:196] Error closing socket: Network error: TlsSocket::Close: Broken pipe
[       OK ] Parameters/TestRpc.TestRpcHandlerLatencyMetric/SSL_UnixSocket (57 ms)
[ RUN      ] Parameters/TestRpc.TimedOutOnResponseMetricServiceQueue/SSL_UnixSocket
I20260924 09:59:34.372026 14086 acceptor_pool.cc:254] collecting diagnostics on the listening RPC socket unix:/tmp/dist-test-taskvhPfgH/test-tmp/rpc-test-3bb4b663ec064f21a7e4e00c9172c6ef.sock every 8 connection(s)
I20260924 09:59:34.372349 14087 acceptor_pool.cc:254] collecting diagnostics on the listening RPC socket unix:/tmp/dist-test-taskvhPfgH/test-tmp/rpc-test-3bb4b663ec064f21a7e4e00c9172c6ef.sock every 8 connection(s)
W20260924 09:59:34.429905 14088 rpcz_store.cc:267] Call kudu.rpc_test.CalculatorService.Sleep from unix:<unnamed> (request call id 2) took 20 ms (client timeout 20 ms). Trace:
W20260924 09:59:34.430058 14088 rpcz_store.cc:269] 0924 09:59:34.409436 (+     0us) service_pool.cc:170] Inserting onto call queue
0924 09:59:34.429813 (+ 20377us) service_pool.cc:214] Skipping call since client already timed out
0924 09:59:34.429866 (+    53us) inbound_call.cc:173] Queueing failure response
Metrics: {}
[       OK ] Parameters/TestRpc.TimedOutOnResponseMetricServiceQueue/SSL_UnixSocket (84 ms)
[ RUN      ] Parameters/TestRpc.RpcPendingConnectionsMetric/SSL_UnixSocket
I20260924 09:59:34.438771 14109 acceptor_pool.cc:254] collecting diagnostics on the listening RPC socket 0.0.0.0:33609 every 8 connection(s)
I20260924 09:59:34.438992 14110 acceptor_pool.cc:254] collecting diagnostics on the listening RPC socket 0.0.0.0:33609 every 8 connection(s)
W20260924 09:59:34.440909 14105 negotiation.cc:337] Failed RPC negotiation. Trace:
0924 09:59:34.440296 (+     0us) reactor.cc:625] Submitting negotiation task for server connection from 127.0.0.1:57662 (local address 127.0.0.1:33609)
0924 09:59:34.440484 (+   188us) server_negotiation.cc:206] Beginning negotiation
0924 09:59:34.440488 (+     4us) server_negotiation.cc:399] Waiting for connection header
0924 09:59:34.440622 (+   134us) negotiation.cc:327] Negotiation complete: Network error: Server connection negotiation failed: server connection from 127.0.0.1:57662: BlockingRecv error: recv got EOF from 127.0.0.1:57662 (error 108)
Metrics: {"server-negotiator.queue_time_us":52}
[       OK ] Parameters/TestRpc.RpcPendingConnectionsMetric/SSL_UnixSocket (19 ms)
[ RUN      ] Parameters/TestRpc.TestRpcContextClientDeadline/SSL_UnixSocket
I20260924 09:59:34.475077 14125 acceptor_pool.cc:254] collecting diagnostics on the listening RPC socket unix:/tmp/dist-test-taskvhPfgH/test-tmp/rpc-test-2596bd9b5e8f40d8998aea21a746ab7e.sock every 8 connection(s)
I20260924 09:59:34.475302 14126 acceptor_pool.cc:254] collecting diagnostics on the listening RPC socket unix:/tmp/dist-test-taskvhPfgH/test-tmp/rpc-test-2596bd9b5e8f40d8998aea21a746ab7e.sock every 8 connection(s)
[       OK ] Parameters/TestRpc.TestRpcContextClientDeadline/SSL_UnixSocket (76 ms)
[ RUN      ] Parameters/TestRpc.TestApplicationFeatureFlagUnsupportedServer/SSL_UnixSocket
I20260924 09:59:34.552950 14150 acceptor_pool.cc:254] collecting diagnostics on the listening RPC socket unix:/tmp/dist-test-taskvhPfgH/test-tmp/rpc-test-1bd35ccea3c340e48218f63f0bcafcd0.sock every 8 connection(s)
I20260924 09:59:34.553226 14151 acceptor_pool.cc:254] collecting diagnostics on the listening RPC socket unix:/tmp/dist-test-taskvhPfgH/test-tmp/rpc-test-1bd35ccea3c340e48218f63f0bcafcd0.sock every 8 connection(s)
[       OK ] Parameters/TestRpc.TestApplicationFeatureFlagUnsupportedServer/SSL_UnixSocket (59 ms)
[ RUN      ] Parameters/TestRpc.TestCancellationAsync/SSL_UnixSocket
I20260924 09:59:34.603782 14175 acceptor_pool.cc:254] collecting diagnostics on the listening RPC socket unix:/tmp/dist-test-taskvhPfgH/test-tmp/rpc-test-e0806bc7017c42ccbeb96f529d00a55e.sock every 8 connection(s)
I20260924 09:59:34.604031 14176 acceptor_pool.cc:254] collecting diagnostics on the listening RPC socket unix:/tmp/dist-test-taskvhPfgH/test-tmp/rpc-test-e0806bc7017c42ccbeb96f529d00a55e.sock every 8 connection(s)
I20260924 09:59:34.604983 13743 rpc-test.cc:1716] Connecting to unix:/tmp/dist-test-taskvhPfgH/test-tmp/rpc-test-e0806bc7017c42ccbeb96f529d00a55e.sock
I20260924 09:59:34.617811 13743 test_util.cc:268] Using random seed: -1473570111
I20260924 09:59:34.651881 14179 rpc-test-base.h:240] got call: sleep_micros: 500 pattern: 4294967295 num_repetitions: 2097152 sidecar_idx: 0
I20260924 09:59:34.679924 14178 rpc-test-base.h:240] got call: sleep_micros: 500 pattern: 4294967295 num_repetitions: 2097152 sidecar_idx: 0
I20260924 09:59:34.711747 14179 rpc-test-base.h:240] got call: sleep_micros: 500 pattern: 4294967295 num_repetitions: 2097152 sidecar_idx: 0
I20260924 09:59:34.742944 14178 rpc-test-base.h:240] got call: sleep_micros: 500 pattern: 4294967295 num_repetitions: 2097152 sidecar_idx: 0
I20260924 09:59:34.771653 14179 rpc-test-base.h:240] got call: sleep_micros: 500 pattern: 4294967295 num_repetitions: 2097152 sidecar_idx: 0
I20260924 09:59:34.797844 14177 rpc-test-base.h:240] got call: sleep_micros: 500 pattern: 4294967295 num_repetitions: 2097152 sidecar_idx: 0
I20260924 09:59:34.828548 14179 rpc-test-base.h:240] got call: sleep_micros: 500 pattern: 4294967295 num_repetitions: 2097152 sidecar_idx: 0
W20260924 09:59:34.831007 14172 connection.cc:196] Error closing socket: Network error: TlsSocket::Close: Broken pipe
W20260924 09:59:34.850570 14172 connection.cc:441] server connection from unix:<unnamed> torn down before Call kudu.rpc.GenericCalculatorService.SleepWithSidecar from unix:<unnamed> (request call id 8) could send its response
W20260924 09:59:34.869915 14172 connection.cc:441] server connection from unix:<unnamed> torn down before Call kudu.rpc.GenericCalculatorService.SleepWithSidecar from unix:<unnamed> (request call id 9) could send its response
[       OK ] Parameters/TestRpc.TestCancellationAsync/SSL_UnixSocket (283 ms)
[ RUN      ] Parameters/TestRpc.TestPerformanceBySocketType/SSL_UnixSocket
I20260924 09:59:34.895510 14200 acceptor_pool.cc:254] collecting diagnostics on the listening RPC socket unix:/tmp/dist-test-taskvhPfgH/test-tmp/rpc-test-703789879c1c46f489eec5e3e3251dcf.sock every 8 connection(s)
I20260924 09:59:34.895745 14201 acceptor_pool.cc:254] collecting diagnostics on the listening RPC socket unix:/tmp/dist-test-taskvhPfgH/test-tmp/rpc-test-703789879c1c46f489eec5e3e3251dcf.sock every 8 connection(s)
I20260924 09:59:34.896646 13743 rpc-test.cc:1846] Connecting to unix:/tmp/dist-test-taskvhPfgH/test-tmp/rpc-test-703789879c1c46f489eec5e3e3251dcf.sock
I20260924 09:59:38.141003 13743 rpc-test.cc:1859] Sending 1024MB via ssl-enabled unix socket: real 3.235s	user 3.286s	sys 2.179s
I20260924 09:59:41.665285 13743 rpc-test.cc:1859] Sending 1024MB via ssl-enabled unix socket: real 3.524s	user 3.575s	sys 2.416s
I20260924 09:59:44.933904 13743 rpc-test.cc:1859] Sending 1024MB via ssl-enabled unix socket: real 3.268s	user 3.292s	sys 2.235s
I20260924 09:59:48.102936 13743 rpc-test.cc:1859] Sending 1024MB via ssl-enabled unix socket: real 3.169s	user 3.081s	sys 2.260s
I20260924 09:59:51.362951 13743 rpc-test.cc:1859] Sending 1024MB via ssl-enabled unix socket: real 3.260s	user 3.226s	sys 2.273s
W20260924 09:59:51.365470 14197 connection.cc:196] Error closing socket: Network error: TlsSocket::Close: Broken pipe
[       OK ] Parameters/TestRpc.TestPerformanceBySocketType/SSL_UnixSocket (16498 ms)
[----------] 20 tests from Parameters/TestRpc (52745 ms total)

[----------] 1 test from Parameters/TestRpcSocketTxRxQueue
[ RUN      ] Parameters/TestRpcSocketTxRxQueue.AcceptorRxQueueSizeMetric/0
I20260924 09:59:51.391414 14225 acceptor_pool.cc:254] collecting diagnostics on the listening RPC socket 0.0.0.0:34839 every 1 connection(s)
I20260924 09:59:51.391670 14226 acceptor_pool.cc:254] collecting diagnostics on the listening RPC socket 0.0.0.0:34839 every 1 connection(s)
W20260924 09:59:51.393507 14221 negotiation.cc:337] Failed RPC negotiation. Trace:
0924 09:59:51.393083 (+     0us) reactor.cc:625] Submitting negotiation task for server connection from 127.0.0.1:43032 (local address 127.0.0.1:34839)
0924 09:59:51.393253 (+   170us) server_negotiation.cc:206] Beginning negotiation
0924 09:59:51.393257 (+     4us) server_negotiation.cc:399] Waiting for connection header
0924 09:59:51.393387 (+   130us) negotiation.cc:327] Negotiation complete: Network error: Server connection negotiation failed: server connection from 127.0.0.1:43032: BlockingRecv error: recv got EOF from 127.0.0.1:43032 (error 108)
Metrics: {"server-negotiator.queue_time_us":53}
[       OK ] Parameters/TestRpcSocketTxRxQueue.AcceptorRxQueueSizeMetric/0 (24 ms)
[----------] 1 test from Parameters/TestRpcSocketTxRxQueue (24 ms total)

[----------] Global test environment tear-down
[==========] 21 tests from 2 test suites ran. (52771 ms total)
[  PASSED  ] 20 tests.
[  FAILED  ] 1 test, listed below:
[  FAILED  ] Parameters/TestRpc.TestCallWithChainCertAndChainCA/SSL_UnixSocket, where GetParam() = (true, true)

 1 FAILED TEST