Diagnosed failure

Parameters/TestRpc.TestCallWithChainCertAndChainCA/SSL_TCP: /data0/somelongdirectorytoavoidrpathissues/src/kudu/src/kudu/rpc/rpc-test.cc:270: Failure
Failed
Bad status: Runtime error: could not verify certificate chain (error with cert: subject=CN = localhost, ST = sadfjas, C = AS, emailAddress = sdflkdsajf, O = lskdfjlsad, OU = sldfkja, issuer=C = AS, ST = ASDfkjdhf, L = lskdjf, O = saldfja, OU = skdjf, CN = localhost, emailAddress = sadjflkadsj): : certificate has expired
Google Test trace:
/data0/somelongdirectorytoavoidrpathissues/src/kudu/src/kudu/rpc/rpc-test.cc:267: Connecting to 0.0.0.0:41753
I20260923 23:07:57.987195   383 test_util.cc:175] -----------------------------------------------
I20260923 23:07:57.987284   383 test_util.cc:176] Had fatal failures, leaving test files at /tmp/dist-test-task9aqhEi/test-tmp/rpc-test.5.Parameters_TestRpc.TestCallWithChainCertAndChainCA_SSL_TCP.1790204877931408-383-0

Full log

Note: This is test shard 6 of 8.
[==========] Running 21 tests from 2 test suites.
[----------] Global test environment set-up.
[----------] 20 tests from Parameters/TestRpc
[ RUN      ] Parameters/TestRpc.TestMessengerCreateDestroy/SSL_TCP
WARNING: Logging before InitGoogleLogging() is written to STDERR
I20260923 23:07:57.951205   383 rpc-test.cc:169] started messenger TestCreateDestroy
[       OK ] Parameters/TestRpc.TestMessengerCreateDestroy/SSL_TCP (18 ms)
[ RUN      ] Parameters/TestRpc.TestNegotiationDeadlock/SSL_TCP
I20260923 23:07:57.968168   403 acceptor_pool.cc:254] collecting diagnostics on the listening RPC socket 0.0.0.0:46497 every 8 connection(s)
I20260923 23:07:57.968183   404 acceptor_pool.cc:254] collecting diagnostics on the listening RPC socket 0.0.0.0:46497 every 8 connection(s)
[       OK ] Parameters/TestRpc.TestNegotiationDeadlock/SSL_TCP (22 ms)
[ RUN      ] Parameters/TestRpc.TestCallWithChainCertAndChainCA/SSL_TCP
I20260923 23:07:57.983301   419 acceptor_pool.cc:254] collecting diagnostics on the listening RPC socket 0.0.0.0:41753 every 8 connection(s)
I20260923 23:07:57.983346   420 acceptor_pool.cc:254] collecting diagnostics on the listening RPC socket 0.0.0.0:41753 every 8 connection(s)
/data0/somelongdirectorytoavoidrpathissues/src/kudu/src/kudu/rpc/rpc-test.cc:270: Failure
Failed
Bad status: Runtime error: could not verify certificate chain (error with cert: subject=CN = localhost, ST = sadfjas, C = AS, emailAddress = sdflkdsajf, O = lskdfjlsad, OU = sldfkja, issuer=C = AS, ST = ASDfkjdhf, L = lskdjf, O = saldfja, OU = skdjf, CN = localhost, emailAddress = sadjflkadsj): : certificate has expired
Google Test trace:
/data0/somelongdirectorytoavoidrpathissues/src/kudu/src/kudu/rpc/rpc-test.cc:267: Connecting to 0.0.0.0:41753
I20260923 23:07:57.987195   383 test_util.cc:175] -----------------------------------------------
I20260923 23:07:57.987284   383 test_util.cc:176] Had fatal failures, leaving test files at /tmp/dist-test-task9aqhEi/test-tmp/rpc-test.5.Parameters_TestRpc.TestCallWithChainCertAndChainCA_SSL_TCP.1790204877931408-383-0
[  FAILED  ] Parameters/TestRpc.TestCallWithChainCertAndChainCA/SSL_TCP, where GetParam() = (true, false) (12 ms)
[ RUN      ] Parameters/TestRpc.TestCallWithPasswordProtectedKey/SSL_TCP
I20260923 23:07:57.997362   444 acceptor_pool.cc:254] collecting diagnostics on the listening RPC socket 0.0.0.0:38685 every 8 connection(s)
I20260923 23:07:57.997411   445 acceptor_pool.cc:254] collecting diagnostics on the listening RPC socket 0.0.0.0:38685 every 8 connection(s)
[       OK ] Parameters/TestRpc.TestCallWithPasswordProtectedKey/SSL_TCP (24 ms)
[ RUN      ] Parameters/TestRpc.TestCallToBadServer/SSL_TCP
I20260923 23:07:58.032941   383 rpc-test.cc:394] Status: Network error: Client connection negotiation failed: client connection to 0.0.0.0:0: connect: Connection refused (error 111)
I20260923 23:07:58.033294   383 rpc-test.cc:394] Status: Network error: Client connection negotiation failed: client connection to 0.0.0.0:0: connect: Connection refused (error 111)
I20260923 23:07:58.033556   383 rpc-test.cc:394] Status: Network error: Client connection negotiation failed: client connection to 0.0.0.0:0: connect: Connection refused (error 111)
I20260923 23:07:58.033756   383 rpc-test.cc:394] Status: Network error: Client connection negotiation failed: client connection to 0.0.0.0:0: connect: Connection refused (error 111)
I20260923 23:07:58.033974   383 rpc-test.cc:394] Status: Network error: Client connection negotiation failed: client connection to 0.0.0.0:0: connect: Connection refused (error 111)
[       OK ] Parameters/TestRpc.TestCallToBadServer/SSL_TCP (22 ms)
[ RUN      ] Parameters/TestRpc.TestWrongService/SSL_TCP
I20260923 23:07:58.045104   480 acceptor_pool.cc:254] collecting diagnostics on the listening RPC socket 0.0.0.0:44367 every 8 connection(s)
I20260923 23:07:58.045142   479 acceptor_pool.cc:254] collecting diagnostics on the listening RPC socket 0.0.0.0:44367 every 8 connection(s)
I20260923 23:07:58.071960   476 messenger.cc:345] service WrongServiceName not registered on TestServer
[       OK ] Parameters/TestRpc.TestWrongService/SSL_TCP (39 ms)
[ RUN      ] Parameters/TestRpc.TestConnectionKeepalive/SSL_TCP
I20260923 23:07:58.084275   502 acceptor_pool.cc:254] collecting diagnostics on the listening RPC socket 0.0.0.0:33221 every 8 connection(s)
I20260923 23:07:58.084342   503 acceptor_pool.cc:254] collecting diagnostics on the listening RPC socket 0.0.0.0:33221 every 8 connection(s)
I20260923 23:07:58.084545   383 rpc-test.cc:488] Connecting to 0.0.0.0:33221
[       OK ] Parameters/TestRpc.TestConnectionKeepalive/SSL_TCP (1034 ms)
[ RUN      ] Parameters/TestRpc.TestClientConnectionMetrics/SSL_TCP
I20260923 23:07:59.115384   527 acceptor_pool.cc:254] collecting diagnostics on the listening RPC socket 0.0.0.0:38679 every 8 connection(s)
I20260923 23:07:59.115517   528 acceptor_pool.cc:254] collecting diagnostics on the listening RPC socket 0.0.0.0:38679 every 8 connection(s)
I20260923 23:07:59.115603   383 rpc-test.cc:569] Connecting to 0.0.0.0:38679
[       OK ] Parameters/TestRpc.TestClientConnectionMetrics/SSL_TCP (9148 ms)
[ RUN      ] Parameters/TestRpc.TestCredentialsPolicy/SSL_TCP
I20260923 23:08:08.267472   550 acceptor_pool.cc:254] collecting diagnostics on the listening RPC socket 0.0.0.0:46223 every 8 connection(s)
I20260923 23:08:08.267535   551 acceptor_pool.cc:254] collecting diagnostics on the listening RPC socket 0.0.0.0:46223 every 8 connection(s)
I20260923 23:08:08.267714   383 rpc-test.cc:700] Connecting to 0.0.0.0:46223
[       OK ] Parameters/TestRpc.TestCredentialsPolicy/SSL_TCP (41 ms)
[ RUN      ] Parameters/TestRpc.TestCallLongerThanKeepalive/SSL_TCP
I20260923 23:08:08.311038   575 acceptor_pool.cc:254] collecting diagnostics on the listening RPC socket 0.0.0.0:34157 every 8 connection(s)
I20260923 23:08:08.311072   576 acceptor_pool.cc:254] collecting diagnostics on the listening RPC socket 0.0.0.0:34157 every 8 connection(s)
I20260923 23:08:08.321705   579 rpc-test-base.h:222] got call: sleep_micros: 3000000 deferred: true
I20260923 23:08:11.322496   579 rpcz_store.cc:275] Call kudu.rpc.GenericCalculatorService.Sleep from 127.0.0.1:35842 (request call id 0) took 3000 ms. Trace:
I20260923 23:08:11.322642   579 rpcz_store.cc:276] 0923 23:08:08.321653 (+     0us) service_pool.cc:170] Inserting onto call queue
0923 23:08:08.321689 (+    36us) service_pool.cc:227] Handling call
0923 23:08:11.322478 (+3000789us) inbound_call.cc:173] Queueing success response
Metrics: {}
[       OK ] Parameters/TestRpc.TestCallLongerThanKeepalive/SSL_TCP (3026 ms)
[ RUN      ] Parameters/TestRpc.TestRpcSidecar/SSL_TCP
I20260923 23:08:11.363806   600 acceptor_pool.cc:254] collecting diagnostics on the listening RPC socket 0.0.0.0:37233 every 8 connection(s)
I20260923 23:08:11.363881   601 acceptor_pool.cc:254] collecting diagnostics on the listening RPC socket 0.0.0.0:37233 every 8 connection(s)
[       OK ] Parameters/TestRpc.TestRpcSidecar/SSL_TCP (73 ms)
[ RUN      ] Parameters/TestRpc.TestRpcSidecarLimits/SSL_TCP
I20260923 23:08:13.081761   625 acceptor_pool.cc:254] collecting diagnostics on the listening RPC socket 0.0.0.0:37593 every 8 connection(s)
I20260923 23:08:13.081795   626 acceptor_pool.cc:254] collecting diagnostics on the listening RPC socket 0.0.0.0:37593 every 8 connection(s)
W20260923 23:08:13.136154   383 serialization.cc:72] Serialized kudu.rpc_test.PushStringsRequestPB (2147483654 bytes) is larger than the maximum configured RPC message size (52428800 bytes). Sending anyway, but peer may reject the data.
W20260923 23:08:13.139511   622 connection.cc:535] server connection from 127.0.0.1:49710 recv error: Network error: RPC frame had a length of 2147483714, but we only support messages up to 52428800 bytes long.
W20260923 23:08:13.139575   622 connection.cc:158] shutting down server connection from 127.0.0.1:49710 with pending inbound data: 4/2147483714 bytes received; last active 0 ns ago: status Network error: RPC frame had a length of 2147483714, but we only support messages up to 52428800 bytes long.
W20260923 23:08:13.139799   638 connection.cc:196] Error closing socket: Network error: TlsSocket::Close: Connection reset by peer
I20260923 23:08:13.164649   650 acceptor_pool.cc:254] collecting diagnostics on the listening RPC socket 0.0.0.0:35513 every 8 connection(s)
I20260923 23:08:13.164692   651 acceptor_pool.cc:254] collecting diagnostics on the listening RPC socket 0.0.0.0:35513 every 8 connection(s)
W20260923 23:08:16.846558   647 connection.cc:577] server connection from 127.0.0.1:57120: received bad data: 'Corruption: Invalid packet: message had a length of 2147483710, but we only support messages up to 2147483647 bytes
'
[       OK ] Parameters/TestRpc.TestRpcSidecarLimits/SSL_TCP (5449 ms)
[ RUN      ] Parameters/TestRpc.TestCallTimeoutDoesntAffectNegotiation/SSL_TCP
I20260923 23:08:16.870900   675 acceptor_pool.cc:254] collecting diagnostics on the listening RPC socket 0.0.0.0:34519 every 8 connection(s)
I20260923 23:08:16.870936   676 acceptor_pool.cc:254] collecting diagnostics on the listening RPC socket 0.0.0.0:34519 every 8 connection(s)
W20260923 23:08:16.880764   671 negotiation.cc:266] Injecting 500ms delay in negotiation
I20260923 23:08:16.931034   383 rpc-test-base.h:595] status: Timed out: connection negotiation to 0.0.0.0:34519 for RPC Sleep timed out after 0.050s (ON_OUTBOUND_QUEUE), seconds elapsed: 0.0506141
[       OK ] Parameters/TestRpc.TestCallTimeoutDoesntAffectNegotiation/SSL_TCP (537 ms)
[ RUN      ] Parameters/TestRpc.TestRpcHandlerLatencyMetric/SSL_TCP
I20260923 23:08:17.424175   700 acceptor_pool.cc:254] collecting diagnostics on the listening RPC socket 0.0.0.0:40981 every 8 connection(s)
I20260923 23:08:17.424213   701 acceptor_pool.cc:254] collecting diagnostics on the listening RPC socket 0.0.0.0:40981 every 8 connection(s)
I20260923 23:08:17.460588   383 rpc-test.cc:1236] Sleep() min lat: 20264
I20260923 23:08:17.460657   383 rpc-test.cc:1237] Sleep() mean lat: 20264
I20260923 23:08:17.460681   383 rpc-test.cc:1238] Sleep() max lat: 20264
I20260923 23:08:17.460697   383 rpc-test.cc:1239] Sleep() #calls: 1
[       OK ] Parameters/TestRpc.TestRpcHandlerLatencyMetric/SSL_TCP (76 ms)
[ RUN      ] Parameters/TestRpc.TimedOutOnResponseMetricServiceQueue/SSL_TCP
I20260923 23:08:17.477412   726 acceptor_pool.cc:254] collecting diagnostics on the listening RPC socket 0.0.0.0:36383 every 8 connection(s)
I20260923 23:08:17.477444   727 acceptor_pool.cc:254] collecting diagnostics on the listening RPC socket 0.0.0.0:36383 every 8 connection(s)
W20260923 23:08:17.533633   728 rpcz_store.cc:267] Call kudu.rpc_test.CalculatorService.Sleep from 127.0.0.1:44014 (request call id 2) took 20 ms (client timeout 20 ms). Trace:
W20260923 23:08:17.533761   728 rpcz_store.cc:269] 0923 23:08:17.513371 (+     0us) service_pool.cc:170] Inserting onto call queue
0923 23:08:17.533609 (+ 20238us) service_pool.cc:214] Skipping call since client already timed out
0923 23:08:17.533618 (+     9us) inbound_call.cc:173] Queueing failure response
Metrics: {}
[       OK ] Parameters/TestRpc.TimedOutOnResponseMetricServiceQueue/SSL_TCP (72 ms)
[ RUN      ] Parameters/TestRpc.RpcPendingConnectionsMetric/SSL_TCP
I20260923 23:08:17.537220   749 acceptor_pool.cc:254] collecting diagnostics on the listening RPC socket 0.0.0.0:34547 every 8 connection(s)
I20260923 23:08:17.537273   750 acceptor_pool.cc:254] collecting diagnostics on the listening RPC socket 0.0.0.0:34547 every 8 connection(s)
W20260923 23:08:17.546566   745 negotiation.cc:337] Failed RPC negotiation. Trace:
0923 23:08:17.546296 (+     0us) reactor.cc:625] Submitting negotiation task for server connection from 127.0.0.1:49052 (local address 127.0.0.1:34547)
0923 23:08:17.546356 (+    60us) server_negotiation.cc:206] Beginning negotiation
0923 23:08:17.546358 (+     2us) server_negotiation.cc:399] Waiting for connection header
0923 23:08:17.546466 (+   108us) negotiation.cc:327] Negotiation complete: Network error: Server connection negotiation failed: server connection from 127.0.0.1:49052: BlockingRecv error: recv got EOF from 127.0.0.1:49052 (error 108)
Metrics: {"server-negotiator.queue_time_us":25}
[       OK ] Parameters/TestRpc.RpcPendingConnectionsMetric/SSL_TCP (21 ms)
[ RUN      ] Parameters/TestRpc.TestRpcContextClientDeadline/SSL_TCP
I20260923 23:08:17.565024   765 acceptor_pool.cc:254] collecting diagnostics on the listening RPC socket 0.0.0.0:41965 every 8 connection(s)
I20260923 23:08:17.565068   766 acceptor_pool.cc:254] collecting diagnostics on the listening RPC socket 0.0.0.0:41965 every 8 connection(s)
[       OK ] Parameters/TestRpc.TestRpcContextClientDeadline/SSL_TCP (65 ms)
[ RUN      ] Parameters/TestRpc.TestApplicationFeatureFlagUnsupportedServer/SSL_TCP
I20260923 23:08:17.637929   790 acceptor_pool.cc:254] collecting diagnostics on the listening RPC socket 0.0.0.0:41627 every 8 connection(s)
I20260923 23:08:17.637961   791 acceptor_pool.cc:254] collecting diagnostics on the listening RPC socket 0.0.0.0:41627 every 8 connection(s)
[       OK ] Parameters/TestRpc.TestApplicationFeatureFlagUnsupportedServer/SSL_TCP (42 ms)
[ RUN      ] Parameters/TestRpc.TestCancellationAsync/SSL_TCP
I20260923 23:08:17.681245   815 acceptor_pool.cc:254] collecting diagnostics on the listening RPC socket 0.0.0.0:41917 every 8 connection(s)
I20260923 23:08:17.681295   816 acceptor_pool.cc:254] collecting diagnostics on the listening RPC socket 0.0.0.0:41917 every 8 connection(s)
I20260923 23:08:17.681455   383 rpc-test.cc:1716] Connecting to 0.0.0.0:41917
I20260923 23:08:17.694772   383 test_util.cc:268] Using random seed: -1895787471
I20260923 23:08:17.709016   819 rpc-test-base.h:240] got call: sleep_micros: 500 pattern: 4294967295 num_repetitions: 2097152 sidecar_idx: 0
I20260923 23:08:17.724023   819 rpc-test-base.h:240] got call: sleep_micros: 500 pattern: 4294967295 num_repetitions: 2097152 sidecar_idx: 0
I20260923 23:08:17.735844   819 rpc-test-base.h:240] got call: sleep_micros: 500 pattern: 4294967295 num_repetitions: 2097152 sidecar_idx: 0
I20260923 23:08:17.747793   819 rpc-test-base.h:240] got call: sleep_micros: 500 pattern: 4294967295 num_repetitions: 2097152 sidecar_idx: 0
I20260923 23:08:17.759223   819 rpc-test-base.h:240] got call: sleep_micros: 500 pattern: 4294967295 num_repetitions: 2097152 sidecar_idx: 0
I20260923 23:08:17.770839   819 rpc-test-base.h:240] got call: sleep_micros: 500 pattern: 4294967295 num_repetitions: 2097152 sidecar_idx: 0
I20260923 23:08:17.782074   819 rpc-test-base.h:240] got call: sleep_micros: 500 pattern: 4294967295 num_repetitions: 2097152 sidecar_idx: 0
I20260923 23:08:17.797286   819 rpc-test-base.h:240] got call: sleep_micros: 500 pattern: 4294967295 num_repetitions: 2097152 sidecar_idx: 0
W20260923 23:08:17.800403   814 connection.cc:441] server connection from 127.0.0.1:58592 torn down before Call kudu.rpc.GenericCalculatorService.SleepWithSidecar from 127.0.0.1:58592 (request call id 9) could send its response
[       OK ] Parameters/TestRpc.TestCancellationAsync/SSL_TCP (136 ms)
[ RUN      ] Parameters/TestRpc.TestPerformanceBySocketType/SSL_TCP
I20260923 23:08:17.837846   840 acceptor_pool.cc:254] collecting diagnostics on the listening RPC socket 0.0.0.0:42685 every 8 connection(s)
I20260923 23:08:17.837881   841 acceptor_pool.cc:254] collecting diagnostics on the listening RPC socket 0.0.0.0:42685 every 8 connection(s)
I20260923 23:08:17.838021   383 rpc-test.cc:1846] Connecting to 0.0.0.0:42685
I20260923 23:08:19.518605   383 rpc-test.cc:1859] Sending 1024MB via ssl-enabled tcp socket: real 1.666s	user 1.470s	sys 1.478s
I20260923 23:08:21.110982   383 rpc-test.cc:1859] Sending 1024MB via ssl-enabled tcp socket: real 1.592s	user 1.385s	sys 1.456s
I20260923 23:08:22.758159   383 rpc-test.cc:1859] Sending 1024MB via ssl-enabled tcp socket: real 1.647s	user 1.496s	sys 1.432s
I20260923 23:08:24.332815   383 rpc-test.cc:1859] Sending 1024MB via ssl-enabled tcp socket: real 1.575s	user 1.350s	sys 1.472s
I20260923 23:08:25.861654   383 rpc-test.cc:1859] Sending 1024MB via ssl-enabled tcp socket: real 1.529s	user 1.351s	sys 1.375s
[       OK ] Parameters/TestRpc.TestPerformanceBySocketType/SSL_TCP (8061 ms)
[----------] 20 tests from Parameters/TestRpc (27929 ms total)

[----------] 1 test from Parameters/TestRpcSocketTxRxQueue
[ RUN      ] Parameters/TestRpcSocketTxRxQueue.OverCapacity/0
W20260923 23:08:26.136411   857 negotiation.cc:337] Failed RPC negotiation. Trace:
0923 23:08:25.873684 (+     0us) reactor.cc:625] Submitting negotiation task for client connection to 0.0.0.0:45689 (local address 127.0.0.1:44520)
0923 23:08:25.873724 (+    40us) negotiation.cc:107] Waiting for socket to connect
0923 23:08:25.873734 (+    10us) client_negotiation.cc:174] Beginning negotiation
0923 23:08:25.873784 (+    50us) client_negotiation.cc:252] Sending NEGOTIATE NegotiatePB request
0923 23:08:26.136277 (+262493us) negotiation.cc:327] Negotiation complete: Network error: Client connection negotiation failed: client connection to 0.0.0.0:45689: BlockingRecv error: recv error from unknown peer: Transport endpoint is not connected (error 107)
Metrics: {"client-negotiator.queue_time_us":16}
W20260923 23:08:26.136411   884 negotiation.cc:337] Failed RPC negotiation. Trace:
0923 23:08:25.876321 (+     0us) reactor.cc:625] Submitting negotiation task for client connection to 0.0.0.0:45689 (local address 127.0.0.1:44542)
0923 23:08:25.876354 (+    33us) negotiation.cc:107] Waiting for socket to connect
0923 23:08:25.876361 (+     7us) client_negotiation.cc:174] Beginning negotiation
0923 23:08:25.876423 (+    62us) client_negotiation.cc:252] Sending NEGOTIATE NegotiatePB request
0923 23:08:26.136341 (+259918us) negotiation.cc:327] Negotiation complete: Network error: Client connection negotiation failed: client connection to 0.0.0.0:45689: BlockingRecv error: recv error from unknown peer: Transport endpoint is not connected (error 107)
Metrics: {"client-negotiator.queue_time_us":16}
W20260923 23:08:26.136610   866 negotiation.cc:337] Failed RPC negotiation. Trace:
0923 23:08:25.874561 (+     0us) reactor.cc:625] Submitting negotiation task for client connection to 0.0.0.0:45689 (local address 127.0.0.1:44528)
0923 23:08:25.874596 (+    35us) negotiation.cc:107] Waiting for socket to connect
0923 23:08:25.874604 (+     8us) client_negotiation.cc:174] Beginning negotiation
0923 23:08:25.874639 (+    35us) client_negotiation.cc:252] Sending NEGOTIATE NegotiatePB request
0923 23:08:26.136404 (+261765us) negotiation.cc:327] Negotiation complete: Network error: Client connection negotiation failed: client connection to 0.0.0.0:45689: BlockingRecv error: recv error from unknown peer: Transport endpoint is not connected (error 107)
Metrics: {"client-negotiator.queue_time_us":17}
W20260923 23:08:26.136718   893 negotiation.cc:337] Failed RPC negotiation. Trace:
0923 23:08:25.877137 (+     0us) reactor.cc:625] Submitting negotiation task for client connection to 0.0.0.0:45689 (local address 127.0.0.1:44544)
0923 23:08:25.877170 (+    33us) negotiation.cc:107] Waiting for socket to connect
0923 23:08:25.877178 (+     8us) client_negotiation.cc:174] Beginning negotiation
0923 23:08:25.877212 (+    34us) client_negotiation.cc:252] Sending NEGOTIATE NegotiatePB request
0923 23:08:26.136511 (+259299us) negotiation.cc:327] Negotiation complete: Network error: Client connection negotiation failed: client connection to 0.0.0.0:45689: BlockingRecv error: recv error from unknown peer: Transport endpoint is not connected (error 107)
Metrics: {"client-negotiator.queue_time_us":17}
W20260923 23:08:26.136780   902 negotiation.cc:337] Failed RPC negotiation. Trace:
0923 23:08:25.877993 (+     0us) reactor.cc:625] Submitting negotiation task for client connection to 0.0.0.0:45689 (local address 127.0.0.1:44554)
0923 23:08:25.878027 (+    34us) negotiation.cc:107] Waiting for socket to connect
0923 23:08:25.878034 (+     7us) client_negotiation.cc:174] Beginning negotiation
0923 23:08:25.878067 (+    33us) client_negotiation.cc:252] Sending NEGOTIATE NegotiatePB request
0923 23:08:26.136512 (+258445us) negotiation.cc:327] Negotiation complete: Network error: Client connection negotiation failed: client connection to 0.0.0.0:45689: BlockingRecv error: recv error from unknown peer: Transport endpoint is not connected (error 107)
Metrics: {"client-negotiator.queue_time_us":17}
W20260923 23:08:26.136845   875 negotiation.cc:337] Failed RPC negotiation. Trace:
0923 23:08:25.875419 (+     0us) reactor.cc:625] Submitting negotiation task for client connection to 0.0.0.0:45689 (local address 127.0.0.1:44534)
0923 23:08:25.875474 (+    55us) negotiation.cc:107] Waiting for socket to connect
0923 23:08:25.875483 (+     9us) client_negotiation.cc:174] Beginning negotiation
0923 23:08:25.875544 (+    61us) client_negotiation.cc:252] Sending NEGOTIATE NegotiatePB request
0923 23:08:26.136405 (+260861us) negotiation.cc:327] Negotiation complete: Network error: Client connection negotiation failed: client connection to 0.0.0.0:45689: BlockingRecv error: recv error from unknown peer: Transport endpoint is not connected (error 107)
Metrics: {"client-negotiator.queue_time_us":34}
[       OK ] Parameters/TestRpcSocketTxRxQueue.OverCapacity/0 (1044 ms)
[----------] 1 test from Parameters/TestRpcSocketTxRxQueue (1044 ms total)

[----------] Global test environment tear-down
[==========] 21 tests from 2 test suites ran. (28974 ms total)
[  PASSED  ] 20 tests.
[  FAILED  ] 1 test, listed below:
[  FAILED  ] Parameters/TestRpc.TestCallWithChainCertAndChainCA/SSL_TCP, where GetParam() = (true, false)

 1 FAILED TEST