Diagnosed failure
Parameters/TestRpc.TestCallWithChainCertAndChainCA/SSL_UnixSocket: /data0/somelongdirectorytoavoidrpathissues/src/kudu/src/kudu/rpc/rpc-test.cc:270: Failure
Failed
Bad status: Runtime error: could not verify certificate chain (error with cert: subject=CN = localhost, ST = sadfjas, C = AS, emailAddress = sdflkdsajf, O = lskdfjlsad, OU = sldfkja, issuer=C = AS, ST = ASDfkjdhf, L = lskdjf, O = saldfja, OU = skdjf, CN = localhost, emailAddress = sadjflkadsj): : certificate has expired
Google Test trace:
/data0/somelongdirectorytoavoidrpathissues/src/kudu/src/kudu/rpc/rpc-test.cc:267: Connecting to unix:/tmp/dist-test-taskq4vHtF/test-tmp/rpc-test-7933802606284226ad9bb8b6ed22041b.sock
I20260928 02:45:04.487831 9616 test_util.cc:175] -----------------------------------------------
I20260928 02:45:04.487912 9616 test_util.cc:176] Had fatal failures, leaving test files at /tmp/dist-test-taskq4vHtF/test-tmp/rpc-test.6.Parameters_TestRpc.TestCallWithChainCertAndChainCA_SSL_UnixSocket.1790563504360130-9616-0
Full log
Note: This is test shard 7 of 8.
[==========] Running 21 tests from 2 test suites.
[----------] Global test environment set-up.
[----------] 20 tests from Parameters/TestRpc
[ RUN ] Parameters/TestRpc.TestMessengerCreateDestroy/SSL_UnixSocket
WARNING: Logging before InitGoogleLogging() is written to STDERR
I20260928 02:45:04.397606 9616 rpc-test.cc:169] started messenger TestCreateDestroy
[ OK ] Parameters/TestRpc.TestMessengerCreateDestroy/SSL_UnixSocket (32 ms)
[ RUN ] Parameters/TestRpc.TestNegotiationDeadlock/SSL_UnixSocket
I20260928 02:45:04.436668 9636 acceptor_pool.cc:254] collecting diagnostics on the listening RPC socket unix:/tmp/dist-test-taskq4vHtF/test-tmp/rpc-test-754e014d0adb420b9e8e7ffdb5b01cf6.sock every 8 connection(s)
I20260928 02:45:04.436693 9637 acceptor_pool.cc:254] collecting diagnostics on the listening RPC socket unix:/tmp/dist-test-taskq4vHtF/test-tmp/rpc-test-754e014d0adb420b9e8e7ffdb5b01cf6.sock every 8 connection(s)
[ OK ] Parameters/TestRpc.TestNegotiationDeadlock/SSL_UnixSocket (48 ms)
[ RUN ] Parameters/TestRpc.TestCallWithChainCertAndChainCA/SSL_UnixSocket
I20260928 02:45:04.482332 9652 acceptor_pool.cc:254] collecting diagnostics on the listening RPC socket unix:/tmp/dist-test-taskq4vHtF/test-tmp/rpc-test-7933802606284226ad9bb8b6ed22041b.sock every 8 connection(s)
I20260928 02:45:04.482411 9653 acceptor_pool.cc:254] collecting diagnostics on the listening RPC socket unix:/tmp/dist-test-taskq4vHtF/test-tmp/rpc-test-7933802606284226ad9bb8b6ed22041b.sock every 8 connection(s)
/data0/somelongdirectorytoavoidrpathissues/src/kudu/src/kudu/rpc/rpc-test.cc:270: Failure
Failed
Bad status: Runtime error: could not verify certificate chain (error with cert: subject=CN = localhost, ST = sadfjas, C = AS, emailAddress = sdflkdsajf, O = lskdfjlsad, OU = sldfkja, issuer=C = AS, ST = ASDfkjdhf, L = lskdjf, O = saldfja, OU = skdjf, CN = localhost, emailAddress = sadjflkadsj): : certificate has expired
Google Test trace:
/data0/somelongdirectorytoavoidrpathissues/src/kudu/src/kudu/rpc/rpc-test.cc:267: Connecting to unix:/tmp/dist-test-taskq4vHtF/test-tmp/rpc-test-7933802606284226ad9bb8b6ed22041b.sock
I20260928 02:45:04.487831 9616 test_util.cc:175] -----------------------------------------------
I20260928 02:45:04.487912 9616 test_util.cc:176] Had fatal failures, leaving test files at /tmp/dist-test-taskq4vHtF/test-tmp/rpc-test.6.Parameters_TestRpc.TestCallWithChainCertAndChainCA_SSL_UnixSocket.1790563504360130-9616-0
[ FAILED ] Parameters/TestRpc.TestCallWithChainCertAndChainCA/SSL_UnixSocket, where GetParam() = (true, true) (40 ms)
[ RUN ] Parameters/TestRpc.TestCallWithPasswordProtectedKey/SSL_UnixSocket
I20260928 02:45:04.507817 9677 acceptor_pool.cc:254] collecting diagnostics on the listening RPC socket unix:/tmp/dist-test-taskq4vHtF/test-tmp/rpc-test-421c29d2d6ac4e178fc2ae37d1c4e8d6.sock every 8 connection(s)
I20260928 02:45:04.507871 9678 acceptor_pool.cc:254] collecting diagnostics on the listening RPC socket unix:/tmp/dist-test-taskq4vHtF/test-tmp/rpc-test-421c29d2d6ac4e178fc2ae37d1c4e8d6.sock every 8 connection(s)
W20260928 02:45:04.521193 9674 connection.cc:196] Error closing socket: Network error: TlsSocket::Close: Broken pipe
[ OK ] Parameters/TestRpc.TestCallWithPasswordProtectedKey/SSL_UnixSocket (35 ms)
[ RUN ] Parameters/TestRpc.TestCallToBadServer/SSL_UnixSocket
I20260928 02:45:04.538542 9616 rpc-test.cc:394] Status: Network error: Client connection negotiation failed: client connection to 0.0.0.0:0: connect: Connection refused (error 111)
I20260928 02:45:04.539072 9616 rpc-test.cc:394] Status: Network error: Client connection negotiation failed: client connection to 0.0.0.0:0: connect: Connection refused (error 111)
I20260928 02:45:04.539494 9616 rpc-test.cc:394] Status: Network error: Client connection negotiation failed: client connection to 0.0.0.0:0: connect: Connection refused (error 111)
I20260928 02:45:04.539976 9616 rpc-test.cc:394] Status: Network error: Client connection negotiation failed: client connection to 0.0.0.0:0: connect: Connection refused (error 111)
I20260928 02:45:04.540448 9616 rpc-test.cc:394] Status: Network error: Client connection negotiation failed: client connection to 0.0.0.0:0: connect: Connection refused (error 111)
[ OK ] Parameters/TestRpc.TestCallToBadServer/SSL_UnixSocket (18 ms)
[ RUN ] Parameters/TestRpc.TestWrongService/SSL_UnixSocket
I20260928 02:45:04.551111 9712 acceptor_pool.cc:254] collecting diagnostics on the listening RPC socket unix:/tmp/dist-test-taskq4vHtF/test-tmp/rpc-test-41f28ad3bf814d2b936fef03f56ef2d8.sock every 8 connection(s)
I20260928 02:45:04.551158 9713 acceptor_pool.cc:254] collecting diagnostics on the listening RPC socket unix:/tmp/dist-test-taskq4vHtF/test-tmp/rpc-test-41f28ad3bf814d2b936fef03f56ef2d8.sock every 8 connection(s)
I20260928 02:45:04.563969 9709 messenger.cc:345] service WrongServiceName not registered on TestServer
W20260928 02:45:04.564819 9709 connection.cc:196] Error closing socket: Network error: TlsSocket::Close: Broken pipe
[ OK ] Parameters/TestRpc.TestWrongService/SSL_UnixSocket (25 ms)
[ RUN ] Parameters/TestRpc.TestConnectionKeepalive/SSL_UnixSocket
I20260928 02:45:04.580288 9735 acceptor_pool.cc:254] collecting diagnostics on the listening RPC socket unix:/tmp/dist-test-taskq4vHtF/test-tmp/rpc-test-c930815a2cf848a48e3f9f45f0335692.sock every 8 connection(s)
I20260928 02:45:04.580322 9736 acceptor_pool.cc:254] collecting diagnostics on the listening RPC socket unix:/tmp/dist-test-taskq4vHtF/test-tmp/rpc-test-c930815a2cf848a48e3f9f45f0335692.sock every 8 connection(s)
I20260928 02:45:04.580581 9616 rpc-test.cc:488] Connecting to unix:/tmp/dist-test-taskq4vHtF/test-tmp/rpc-test-c930815a2cf848a48e3f9f45f0335692.sock
W20260928 02:45:05.068382 9748 connection.cc:196] Error closing socket: Network error: TlsSocket::Close: Broken pipe
[ OK ] Parameters/TestRpc.TestConnectionKeepalive/SSL_UnixSocket (1039 ms)
[ RUN ] Parameters/TestRpc.TestClientConnectionMetrics/SSL_UnixSocket
I20260928 02:45:05.624279 9760 acceptor_pool.cc:254] collecting diagnostics on the listening RPC socket unix:/tmp/dist-test-taskq4vHtF/test-tmp/rpc-test-48f689f6ed5240aeb3d806092dafd11d.sock every 8 connection(s)
I20260928 02:45:05.624481 9761 acceptor_pool.cc:254] collecting diagnostics on the listening RPC socket unix:/tmp/dist-test-taskq4vHtF/test-tmp/rpc-test-48f689f6ed5240aeb3d806092dafd11d.sock every 8 connection(s)
I20260928 02:45:05.624845 9616 rpc-test.cc:569] Connecting to unix:/tmp/dist-test-taskq4vHtF/test-tmp/rpc-test-48f689f6ed5240aeb3d806092dafd11d.sock
W20260928 02:45:15.932997 9757 connection.cc:196] Error closing socket: Network error: TlsSocket::Close: Broken pipe
[ OK ] Parameters/TestRpc.TestClientConnectionMetrics/SSL_UnixSocket (10328 ms)
[ RUN ] Parameters/TestRpc.TestCredentialsPolicy/SSL_UnixSocket
I20260928 02:45:15.948817 9783 acceptor_pool.cc:254] collecting diagnostics on the listening RPC socket unix:/tmp/dist-test-taskq4vHtF/test-tmp/rpc-test-79e3c03aa48149049e656ace2018b436.sock every 8 connection(s)
I20260928 02:45:15.948942 9784 acceptor_pool.cc:254] collecting diagnostics on the listening RPC socket unix:/tmp/dist-test-taskq4vHtF/test-tmp/rpc-test-79e3c03aa48149049e656ace2018b436.sock every 8 connection(s)
I20260928 02:45:15.949263 9616 rpc-test.cc:700] Connecting to unix:/tmp/dist-test-taskq4vHtF/test-tmp/rpc-test-79e3c03aa48149049e656ace2018b436.sock
W20260928 02:45:15.976624 9782 connection.cc:196] Error closing socket: Network error: TlsSocket::Close: Broken pipe
W20260928 02:45:15.982064 9782 connection.cc:196] Error closing socket: Network error: TlsSocket::Close: Broken pipe
[ OK ] Parameters/TestRpc.TestCredentialsPolicy/SSL_UnixSocket (48 ms)
[ RUN ] Parameters/TestRpc.TestCallLongerThanKeepalive/SSL_UnixSocket
I20260928 02:45:16.000475 9808 acceptor_pool.cc:254] collecting diagnostics on the listening RPC socket unix:/tmp/dist-test-taskq4vHtF/test-tmp/rpc-test-e871f5ab8feb441db4c8e40f5ed09934.sock every 8 connection(s)
I20260928 02:45:16.000556 9809 acceptor_pool.cc:254] collecting diagnostics on the listening RPC socket unix:/tmp/dist-test-taskq4vHtF/test-tmp/rpc-test-e871f5ab8feb441db4c8e40f5ed09934.sock every 8 connection(s)
I20260928 02:45:16.015654 9812 rpc-test-base.h:222] got call: sleep_micros: 3000000 deferred: true
I20260928 02:45:19.016458 9812 rpcz_store.cc:275] Call kudu.rpc.GenericCalculatorService.Sleep from unix:<unnamed> (request call id 0) took 3000 ms. Trace:
I20260928 02:45:19.016559 9812 rpcz_store.cc:276] 0928 02:45:16.015586 (+ 0us) service_pool.cc:170] Inserting onto call queue
0928 02:45:16.015633 (+ 47us) service_pool.cc:227] Handling call
0928 02:45:19.016437 (+3000804us) inbound_call.cc:173] Queueing success response
Metrics: {}
W20260928 02:45:19.018375 9805 connection.cc:196] Error closing socket: Network error: TlsSocket::Close: Broken pipe
[ OK ] Parameters/TestRpc.TestCallLongerThanKeepalive/SSL_UnixSocket (3036 ms)
[ RUN ] Parameters/TestRpc.TestRpcSidecar/SSL_UnixSocket
I20260928 02:45:19.036756 9833 acceptor_pool.cc:254] collecting diagnostics on the listening RPC socket unix:/tmp/dist-test-taskq4vHtF/test-tmp/rpc-test-c85c78f4fbeb47f2bbfa32a7448efcfe.sock every 8 connection(s)
I20260928 02:45:19.036794 9834 acceptor_pool.cc:254] collecting diagnostics on the listening RPC socket unix:/tmp/dist-test-taskq4vHtF/test-tmp/rpc-test-c85c78f4fbeb47f2bbfa32a7448efcfe.sock every 8 connection(s)
W20260928 02:45:19.092207 9830 connection.cc:196] Error closing socket: Network error: TlsSocket::Close: Broken pipe
[ OK ] Parameters/TestRpc.TestRpcSidecar/SSL_UnixSocket (73 ms)
[ RUN ] Parameters/TestRpc.TestRpcSidecarLimits/SSL_UnixSocket
I20260928 02:45:20.761958 9858 acceptor_pool.cc:254] collecting diagnostics on the listening RPC socket unix:/tmp/dist-test-taskq4vHtF/test-tmp/rpc-test-0f28f8de801b446aad596a71c3ef9c05.sock every 8 connection(s)
I20260928 02:45:20.761989 9859 acceptor_pool.cc:254] collecting diagnostics on the listening RPC socket unix:/tmp/dist-test-taskq4vHtF/test-tmp/rpc-test-0f28f8de801b446aad596a71c3ef9c05.sock every 8 connection(s)
W20260928 02:45:20.785885 9616 serialization.cc:72] Serialized kudu.rpc_test.PushStringsRequestPB (2147483654 bytes) is larger than the maximum configured RPC message size (52428800 bytes). Sending anyway, but peer may reject the data.
W20260928 02:45:20.789983 9855 connection.cc:535] server connection from unix:<unnamed> recv error: Network error: RPC frame had a length of 2147483714, but we only support messages up to 52428800 bytes long.
W20260928 02:45:20.790050 9855 connection.cc:158] shutting down server connection from unix:<unnamed> with pending inbound data: 4/2147483714 bytes received; last active 0 ns ago: status Network error: RPC frame had a length of 2147483714, but we only support messages up to 52428800 bytes long.
W20260928 02:45:20.790426 9871 connection.cc:196] Error closing socket: Network error: TlsSocket::Close: Broken pipe
I20260928 02:45:20.815181 9883 acceptor_pool.cc:254] collecting diagnostics on the listening RPC socket unix:/tmp/dist-test-taskq4vHtF/test-tmp/rpc-test-0f28f8de801b446aad596a71c3ef9c05.sock every 8 connection(s)
I20260928 02:45:20.815181 9884 acceptor_pool.cc:254] collecting diagnostics on the listening RPC socket unix:/tmp/dist-test-taskq4vHtF/test-tmp/rpc-test-0f28f8de801b446aad596a71c3ef9c05.sock every 8 connection(s)
W20260928 02:45:25.679298 9880 connection.cc:577] server connection from unix:<unnamed>: received bad data: 'Corruption: Invalid packet: message had a length of 2147483710, but we only support messages up to 2147483647 bytes
'
W20260928 02:45:25.679690 9896 connection.cc:196] Error closing socket: Network error: TlsSocket::Close: Broken pipe
[ OK ] Parameters/TestRpc.TestRpcSidecarLimits/SSL_UnixSocket (6589 ms)
[ RUN ] Parameters/TestRpc.TestCallTimeoutDoesntAffectNegotiation/SSL_UnixSocket
I20260928 02:45:25.704854 9908 acceptor_pool.cc:254] collecting diagnostics on the listening RPC socket unix:/tmp/dist-test-taskq4vHtF/test-tmp/rpc-test-f03a6bb00b3043edb711c6cf2c80271a.sock every 8 connection(s)
I20260928 02:45:25.704885 9909 acceptor_pool.cc:254] collecting diagnostics on the listening RPC socket unix:/tmp/dist-test-taskq4vHtF/test-tmp/rpc-test-f03a6bb00b3043edb711c6cf2c80271a.sock every 8 connection(s)
W20260928 02:45:25.735837 9903 negotiation.cc:266] Injecting 500ms delay in negotiation
I20260928 02:45:25.786617 9616 rpc-test-base.h:595] status: Timed out: connection negotiation to unix:/tmp/dist-test-taskq4vHtF/test-tmp/rpc-test-f03a6bb00b3043edb711c6cf2c80271a.sock for RPC Sleep timed out after 0.050s (ON_OUTBOUND_QUEUE), seconds elapsed: 0.0512854
[ OK ] Parameters/TestRpc.TestCallTimeoutDoesntAffectNegotiation/SSL_UnixSocket (559 ms)
[ RUN ] Parameters/TestRpc.TestRpcHandlerLatencyMetric/SSL_UnixSocket
I20260928 02:45:26.257682 9933 acceptor_pool.cc:254] collecting diagnostics on the listening RPC socket unix:/tmp/dist-test-taskq4vHtF/test-tmp/rpc-test-6c0d652bd387419897a19f9d7268b078.sock every 8 connection(s)
I20260928 02:45:26.257745 9934 acceptor_pool.cc:254] collecting diagnostics on the listening RPC socket unix:/tmp/dist-test-taskq4vHtF/test-tmp/rpc-test-6c0d652bd387419897a19f9d7268b078.sock every 8 connection(s)
I20260928 02:45:26.302138 9616 rpc-test.cc:1236] Sleep() min lat: 20471
I20260928 02:45:26.302230 9616 rpc-test.cc:1237] Sleep() mean lat: 20471
I20260928 02:45:26.302268 9616 rpc-test.cc:1238] Sleep() max lat: 20471
I20260928 02:45:26.302282 9616 rpc-test.cc:1239] Sleep() #calls: 1
[ OK ] Parameters/TestRpc.TestRpcHandlerLatencyMetric/SSL_UnixSocket (61 ms)
[ RUN ] Parameters/TestRpc.TimedOutOnResponseMetricServiceQueue/SSL_UnixSocket
I20260928 02:45:26.316118 9959 acceptor_pool.cc:254] collecting diagnostics on the listening RPC socket unix:/tmp/dist-test-taskq4vHtF/test-tmp/rpc-test-6d86dbae4bab4fa8a3fedbcd774a9306.sock every 8 connection(s)
I20260928 02:45:26.316160 9960 acceptor_pool.cc:254] collecting diagnostics on the listening RPC socket unix:/tmp/dist-test-taskq4vHtF/test-tmp/rpc-test-6d86dbae4bab4fa8a3fedbcd774a9306.sock every 8 connection(s)
W20260928 02:45:26.371078 9961 rpcz_store.cc:267] Call kudu.rpc_test.CalculatorService.Sleep from unix:<unnamed> (request call id 2) took 20 ms (client timeout 20 ms). Trace:
W20260928 02:45:26.371191 9961 rpcz_store.cc:269] 0928 02:45:26.350720 (+ 0us) service_pool.cc:170] Inserting onto call queue
0928 02:45:26.371035 (+ 20315us) service_pool.cc:214] Skipping call since client already timed out
0928 02:45:26.371061 (+ 26us) inbound_call.cc:173] Queueing failure response
Metrics: {}
[ OK ] Parameters/TestRpc.TimedOutOnResponseMetricServiceQueue/SSL_UnixSocket (69 ms)
[ RUN ] Parameters/TestRpc.RpcPendingConnectionsMetric/SSL_UnixSocket
I20260928 02:45:26.375937 9982 acceptor_pool.cc:254] collecting diagnostics on the listening RPC socket 0.0.0.0:45167 every 8 connection(s)
I20260928 02:45:26.375993 9983 acceptor_pool.cc:254] collecting diagnostics on the listening RPC socket 0.0.0.0:45167 every 8 connection(s)
W20260928 02:45:26.377106 9978 negotiation.cc:337] Failed RPC negotiation. Trace:
0928 02:45:26.376711 (+ 0us) reactor.cc:625] Submitting negotiation task for server connection from 127.0.0.1:47674 (local address 127.0.0.1:45167)
0928 02:45:26.376812 (+ 101us) server_negotiation.cc:206] Beginning negotiation
0928 02:45:26.376815 (+ 3us) server_negotiation.cc:399] Waiting for connection header
0928 02:45:26.376913 (+ 98us) negotiation.cc:327] Negotiation complete: Network error: Server connection negotiation failed: server connection from 127.0.0.1:47674: BlockingRecv error: recv got EOF from 127.0.0.1:47674 (error 108)
Metrics: {"server-negotiator.queue_time_us":34}
[ OK ] Parameters/TestRpc.RpcPendingConnectionsMetric/SSL_UnixSocket (15 ms)
[ RUN ] Parameters/TestRpc.TestRpcContextClientDeadline/SSL_UnixSocket
I20260928 02:45:26.433688 9998 acceptor_pool.cc:254] collecting diagnostics on the listening RPC socket unix:/tmp/dist-test-taskq4vHtF/test-tmp/rpc-test-b2baa526325546b3a61e80bab9bc7b41.sock every 8 connection(s)
I20260928 02:45:26.433723 9999 acceptor_pool.cc:254] collecting diagnostics on the listening RPC socket unix:/tmp/dist-test-taskq4vHtF/test-tmp/rpc-test-b2baa526325546b3a61e80bab9bc7b41.sock every 8 connection(s)
[ OK ] Parameters/TestRpc.TestRpcContextClientDeadline/SSL_UnixSocket (99 ms)
[ RUN ] Parameters/TestRpc.TestApplicationFeatureFlagUnsupportedServer/SSL_UnixSocket
I20260928 02:45:26.502748 10023 acceptor_pool.cc:254] collecting diagnostics on the listening RPC socket unix:/tmp/dist-test-taskq4vHtF/test-tmp/rpc-test-8ea98ca2bacb4bd9adc16589fb76ec19.sock every 8 connection(s)
I20260928 02:45:26.502775 10024 acceptor_pool.cc:254] collecting diagnostics on the listening RPC socket unix:/tmp/dist-test-taskq4vHtF/test-tmp/rpc-test-8ea98ca2bacb4bd9adc16589fb76ec19.sock every 8 connection(s)
[ OK ] Parameters/TestRpc.TestApplicationFeatureFlagUnsupportedServer/SSL_UnixSocket (35 ms)
[ RUN ] Parameters/TestRpc.TestCancellationAsync/SSL_UnixSocket
I20260928 02:45:26.533353 10048 acceptor_pool.cc:254] collecting diagnostics on the listening RPC socket unix:/tmp/dist-test-taskq4vHtF/test-tmp/rpc-test-120c1cdef01747febb6952a19cb51b72.sock every 8 connection(s)
I20260928 02:45:26.533432 10049 acceptor_pool.cc:254] collecting diagnostics on the listening RPC socket unix:/tmp/dist-test-taskq4vHtF/test-tmp/rpc-test-120c1cdef01747febb6952a19cb51b72.sock every 8 connection(s)
I20260928 02:45:26.533759 9616 rpc-test.cc:1716] Connecting to unix:/tmp/dist-test-taskq4vHtF/test-tmp/rpc-test-120c1cdef01747febb6952a19cb51b72.sock
I20260928 02:45:26.551280 9616 test_util.cc:268] Using random seed: 250783470
I20260928 02:45:26.567554 10052 rpc-test-base.h:240] got call: sleep_micros: 500 pattern: 4294967295 num_repetitions: 2097152 sidecar_idx: 0
I20260928 02:45:26.585904 10051 rpc-test-base.h:240] got call: sleep_micros: 500 pattern: 4294967295 num_repetitions: 2097152 sidecar_idx: 0
I20260928 02:45:26.602098 10052 rpc-test-base.h:240] got call: sleep_micros: 500 pattern: 4294967295 num_repetitions: 2097152 sidecar_idx: 0
I20260928 02:45:26.617734 10051 rpc-test-base.h:240] got call: sleep_micros: 500 pattern: 4294967295 num_repetitions: 2097152 sidecar_idx: 0
I20260928 02:45:26.633659 10052 rpc-test-base.h:240] got call: sleep_micros: 500 pattern: 4294967295 num_repetitions: 2097152 sidecar_idx: 0
I20260928 02:45:26.649753 10051 rpc-test-base.h:240] got call: sleep_micros: 500 pattern: 4294967295 num_repetitions: 2097152 sidecar_idx: 0
I20260928 02:45:26.665093 10052 rpc-test-base.h:240] got call: sleep_micros: 500 pattern: 4294967295 num_repetitions: 2097152 sidecar_idx: 0
I20260928 02:45:26.680347 10051 rpc-test-base.h:240] got call: sleep_micros: 500 pattern: 4294967295 num_repetitions: 2097152 sidecar_idx: 0
W20260928 02:45:26.681903 10045 connection.cc:196] Error closing socket: Network error: TlsSocket::Close: Broken pipe
W20260928 02:45:26.688679 10045 connection.cc:441] server connection from unix:<unnamed> torn down before Call kudu.rpc.GenericCalculatorService.SleepWithSidecar from unix:<unnamed> (request call id 8) could send its response
W20260928 02:45:26.698879 10045 connection.cc:441] server connection from unix:<unnamed> torn down before Call kudu.rpc.GenericCalculatorService.SleepWithSidecar from unix:<unnamed> (request call id 9) could send its response
[ OK ] Parameters/TestRpc.TestCancellationAsync/SSL_UnixSocket (176 ms)
[ RUN ] Parameters/TestRpc.TestPerformanceBySocketType/SSL_UnixSocket
I20260928 02:45:26.715036 10073 acceptor_pool.cc:254] collecting diagnostics on the listening RPC socket unix:/tmp/dist-test-taskq4vHtF/test-tmp/rpc-test-bf6b530b805444b285c889193d09b27c.sock every 8 connection(s)
I20260928 02:45:26.715052 10074 acceptor_pool.cc:254] collecting diagnostics on the listening RPC socket unix:/tmp/dist-test-taskq4vHtF/test-tmp/rpc-test-bf6b530b805444b285c889193d09b27c.sock every 8 connection(s)
I20260928 02:45:26.715369 9616 rpc-test.cc:1846] Connecting to unix:/tmp/dist-test-taskq4vHtF/test-tmp/rpc-test-bf6b530b805444b285c889193d09b27c.sock
I20260928 02:45:28.394064 9616 rpc-test.cc:1859] Sending 1024MB via ssl-enabled unix socket: real 1.671s user 2.098s sys 0.920s
I20260928 02:45:30.087064 9616 rpc-test.cc:1859] Sending 1024MB via ssl-enabled unix socket: real 1.693s user 2.106s sys 0.942s
I20260928 02:45:31.714394 9616 rpc-test.cc:1859] Sending 1024MB via ssl-enabled unix socket: real 1.627s user 1.899s sys 1.025s
I20260928 02:45:33.319605 9616 rpc-test.cc:1859] Sending 1024MB via ssl-enabled unix socket: real 1.605s user 2.008s sys 0.899s
I20260928 02:45:34.917126 9616 rpc-test.cc:1859] Sending 1024MB via ssl-enabled unix socket: real 1.597s user 1.963s sys 0.917s
W20260928 02:45:34.918159 10070 connection.cc:196] Error closing socket: Network error: TlsSocket::Close: Broken pipe
[ OK ] Parameters/TestRpc.TestPerformanceBySocketType/SSL_UnixSocket (8219 ms)
[----------] 20 tests from Parameters/TestRpc (30553 ms total)
[----------] 1 test from Parameters/TestRpcSocketTxRxQueue
[ RUN ] Parameters/TestRpcSocketTxRxQueue.AcceptorRxQueueSizeMetric/0
I20260928 02:45:34.928337 10098 acceptor_pool.cc:254] collecting diagnostics on the listening RPC socket 0.0.0.0:40331 every 1 connection(s)
I20260928 02:45:34.928390 10099 acceptor_pool.cc:254] collecting diagnostics on the listening RPC socket 0.0.0.0:40331 every 1 connection(s)
W20260928 02:45:34.929314 10094 negotiation.cc:337] Failed RPC negotiation. Trace:
0928 02:45:34.929010 (+ 0us) reactor.cc:625] Submitting negotiation task for server connection from 127.0.0.1:57024 (local address 127.0.0.1:40331)
0928 02:45:34.929106 (+ 96us) server_negotiation.cc:206] Beginning negotiation
0928 02:45:34.929109 (+ 3us) server_negotiation.cc:399] Waiting for connection header
0928 02:45:34.929196 (+ 87us) negotiation.cc:327] Negotiation complete: Network error: Server connection negotiation failed: server connection from 127.0.0.1:57024: BlockingRecv error: recv got EOF from 127.0.0.1:57024 (error 108)
Metrics: {"server-negotiator.queue_time_us":26}
[ OK ] Parameters/TestRpcSocketTxRxQueue.AcceptorRxQueueSizeMetric/0 (11 ms)
[----------] 1 test from Parameters/TestRpcSocketTxRxQueue (12 ms total)
[----------] Global test environment tear-down
[==========] 21 tests from 2 test suites ran. (30565 ms total)
[ PASSED ] 20 tests.
[ FAILED ] 1 test, listed below:
[ FAILED ] Parameters/TestRpc.TestCallWithChainCertAndChainCA/SSL_UnixSocket, where GetParam() = (true, true)
1 FAILED TEST