Diagnosed failure

Parameters/TestRpc.TestCallWithChainCertAndChainCA/SSL_UnixSocket: /data0/somelongdirectorytoavoidrpathissues/src/kudu/src/kudu/rpc/rpc-test.cc:270: Failure
Failed
Bad status: Runtime error: could not verify certificate chain (error with cert: subject=CN = localhost, ST = sadfjas, C = AS, emailAddress = sdflkdsajf, O = lskdfjlsad, OU = sldfkja, issuer=C = AS, ST = ASDfkjdhf, L = lskdjf, O = saldfja, OU = skdjf, CN = localhost, emailAddress = sadjflkadsj): : certificate has expired
Google Test trace:
/data0/somelongdirectorytoavoidrpathissues/src/kudu/src/kudu/rpc/rpc-test.cc:267: Connecting to unix:/tmp/dist-test-task96AG_4/test-tmp/rpc-test-85cd40723d0f4aefb4b433e1817964f4.sock
I20260926 06:58:02.575080   774 test_util.cc:175] -----------------------------------------------
I20260926 06:58:02.575132   774 test_util.cc:176] Had fatal failures, leaving test files at /tmp/dist-test-task96AG_4/test-tmp/rpc-test.6.Parameters_TestRpc.TestCallWithChainCertAndChainCA_SSL_UnixSocket.1790405882514094-774-0

Full log

Note: This is test shard 7 of 8.
[==========] Running 21 tests from 2 test suites.
[----------] Global test environment set-up.
[----------] 20 tests from Parameters/TestRpc
[ RUN      ] Parameters/TestRpc.TestMessengerCreateDestroy/SSL_UnixSocket
WARNING: Logging before InitGoogleLogging() is written to STDERR
I20260926 06:58:02.538183   774 rpc-test.cc:169] started messenger TestCreateDestroy
[       OK ] Parameters/TestRpc.TestMessengerCreateDestroy/SSL_UnixSocket (22 ms)
[ RUN      ] Parameters/TestRpc.TestNegotiationDeadlock/SSL_UnixSocket
I20260926 06:58:02.559105   795 acceptor_pool.cc:254] collecting diagnostics on the listening RPC socket unix:/tmp/dist-test-task96AG_4/test-tmp/rpc-test-cfc190afb00a43bfbf4ab1292207dcd3.sock every 8 connection(s)
I20260926 06:58:02.559108   794 acceptor_pool.cc:254] collecting diagnostics on the listening RPC socket unix:/tmp/dist-test-task96AG_4/test-tmp/rpc-test-cfc190afb00a43bfbf4ab1292207dcd3.sock every 8 connection(s)
[       OK ] Parameters/TestRpc.TestNegotiationDeadlock/SSL_UnixSocket (26 ms)
[ RUN      ] Parameters/TestRpc.TestCallWithChainCertAndChainCA/SSL_UnixSocket
I20260926 06:58:02.571199   810 acceptor_pool.cc:254] collecting diagnostics on the listening RPC socket unix:/tmp/dist-test-task96AG_4/test-tmp/rpc-test-85cd40723d0f4aefb4b433e1817964f4.sock every 8 connection(s)
I20260926 06:58:02.571244   811 acceptor_pool.cc:254] collecting diagnostics on the listening RPC socket unix:/tmp/dist-test-task96AG_4/test-tmp/rpc-test-85cd40723d0f4aefb4b433e1817964f4.sock every 8 connection(s)
/data0/somelongdirectorytoavoidrpathissues/src/kudu/src/kudu/rpc/rpc-test.cc:270: Failure
Failed
Bad status: Runtime error: could not verify certificate chain (error with cert: subject=CN = localhost, ST = sadfjas, C = AS, emailAddress = sdflkdsajf, O = lskdfjlsad, OU = sldfkja, issuer=C = AS, ST = ASDfkjdhf, L = lskdjf, O = saldfja, OU = skdjf, CN = localhost, emailAddress = sadjflkadsj): : certificate has expired
Google Test trace:
/data0/somelongdirectorytoavoidrpathissues/src/kudu/src/kudu/rpc/rpc-test.cc:267: Connecting to unix:/tmp/dist-test-task96AG_4/test-tmp/rpc-test-85cd40723d0f4aefb4b433e1817964f4.sock
I20260926 06:58:02.575080   774 test_util.cc:175] -----------------------------------------------
I20260926 06:58:02.575132   774 test_util.cc:176] Had fatal failures, leaving test files at /tmp/dist-test-task96AG_4/test-tmp/rpc-test.6.Parameters_TestRpc.TestCallWithChainCertAndChainCA_SSL_UnixSocket.1790405882514094-774-0
[  FAILED  ] Parameters/TestRpc.TestCallWithChainCertAndChainCA/SSL_UnixSocket, where GetParam() = (true, true) (8 ms)
[ RUN      ] Parameters/TestRpc.TestCallWithPasswordProtectedKey/SSL_UnixSocket
I20260926 06:58:02.581103   835 acceptor_pool.cc:254] collecting diagnostics on the listening RPC socket unix:/tmp/dist-test-task96AG_4/test-tmp/rpc-test-c0a082817e7a431d98d29d5f21f96ffd.sock every 8 connection(s)
I20260926 06:58:02.581105   836 acceptor_pool.cc:254] collecting diagnostics on the listening RPC socket unix:/tmp/dist-test-task96AG_4/test-tmp/rpc-test-c0a082817e7a431d98d29d5f21f96ffd.sock every 8 connection(s)
W20260926 06:58:02.593075   832 connection.cc:196] Error closing socket: Network error: TlsSocket::Close: Broken pipe
[       OK ] Parameters/TestRpc.TestCallWithPasswordProtectedKey/SSL_UnixSocket (19 ms)
[ RUN      ] Parameters/TestRpc.TestCallToBadServer/SSL_UnixSocket
I20260926 06:58:02.619023   774 rpc-test.cc:394] Status: Network error: Client connection negotiation failed: client connection to 0.0.0.0:0: connect: Connection refused (error 111)
I20260926 06:58:02.619361   774 rpc-test.cc:394] Status: Network error: Client connection negotiation failed: client connection to 0.0.0.0:0: connect: Connection refused (error 111)
I20260926 06:58:02.619571   774 rpc-test.cc:394] Status: Network error: Client connection negotiation failed: client connection to 0.0.0.0:0: connect: Connection refused (error 111)
I20260926 06:58:02.619736   774 rpc-test.cc:394] Status: Network error: Client connection negotiation failed: client connection to 0.0.0.0:0: connect: Connection refused (error 111)
I20260926 06:58:02.620098   774 rpc-test.cc:394] Status: Network error: Client connection negotiation failed: client connection to 0.0.0.0:0: connect: Connection refused (error 111)
[       OK ] Parameters/TestRpc.TestCallToBadServer/SSL_UnixSocket (26 ms)
[ RUN      ] Parameters/TestRpc.TestWrongService/SSL_UnixSocket
I20260926 06:58:02.633226   870 acceptor_pool.cc:254] collecting diagnostics on the listening RPC socket unix:/tmp/dist-test-task96AG_4/test-tmp/rpc-test-11db063ed09646d5a59b25f62208cfdc.sock every 8 connection(s)
I20260926 06:58:02.633276   871 acceptor_pool.cc:254] collecting diagnostics on the listening RPC socket unix:/tmp/dist-test-task96AG_4/test-tmp/rpc-test-11db063ed09646d5a59b25f62208cfdc.sock every 8 connection(s)
I20260926 06:58:02.661432   867 messenger.cc:345] service WrongServiceName not registered on TestServer
[       OK ] Parameters/TestRpc.TestWrongService/SSL_UnixSocket (42 ms)
[ RUN      ] Parameters/TestRpc.TestConnectionKeepalive/SSL_UnixSocket
I20260926 06:58:02.676460   893 acceptor_pool.cc:254] collecting diagnostics on the listening RPC socket unix:/tmp/dist-test-task96AG_4/test-tmp/rpc-test-e1e68e2958a44a6b9b056ad5efa2e874.sock every 8 connection(s)
I20260926 06:58:02.676501   894 acceptor_pool.cc:254] collecting diagnostics on the listening RPC socket unix:/tmp/dist-test-task96AG_4/test-tmp/rpc-test-e1e68e2958a44a6b9b056ad5efa2e874.sock every 8 connection(s)
I20260926 06:58:02.676666   774 rpc-test.cc:488] Connecting to unix:/tmp/dist-test-task96AG_4/test-tmp/rpc-test-e1e68e2958a44a6b9b056ad5efa2e874.sock
W20260926 06:58:03.164655   906 connection.cc:196] Error closing socket: Network error: TlsSocket::Close: Broken pipe
[       OK ] Parameters/TestRpc.TestConnectionKeepalive/SSL_UnixSocket (1038 ms)
[ RUN      ] Parameters/TestRpc.TestClientConnectionMetrics/SSL_UnixSocket
I20260926 06:58:03.712641   918 acceptor_pool.cc:254] collecting diagnostics on the listening RPC socket unix:/tmp/dist-test-task96AG_4/test-tmp/rpc-test-b40a093c8e6a4ce187e41a07c14b0ae1.sock every 8 connection(s)
I20260926 06:58:03.712671   919 acceptor_pool.cc:254] collecting diagnostics on the listening RPC socket unix:/tmp/dist-test-task96AG_4/test-tmp/rpc-test-b40a093c8e6a4ce187e41a07c14b0ae1.sock every 8 connection(s)
I20260926 06:58:03.712836   774 rpc-test.cc:569] Connecting to unix:/tmp/dist-test-task96AG_4/test-tmp/rpc-test-b40a093c8e6a4ce187e41a07c14b0ae1.sock
[       OK ] Parameters/TestRpc.TestClientConnectionMetrics/SSL_UnixSocket (8611 ms)
[ RUN      ] Parameters/TestRpc.TestCredentialsPolicy/SSL_UnixSocket
I20260926 06:58:12.343103   941 acceptor_pool.cc:254] collecting diagnostics on the listening RPC socket unix:/tmp/dist-test-task96AG_4/test-tmp/rpc-test-0df76cdf9d2349f38352175d61fab073.sock every 8 connection(s)
I20260926 06:58:12.343142   942 acceptor_pool.cc:254] collecting diagnostics on the listening RPC socket unix:/tmp/dist-test-task96AG_4/test-tmp/rpc-test-0df76cdf9d2349f38352175d61fab073.sock every 8 connection(s)
I20260926 06:58:12.343343   774 rpc-test.cc:700] Connecting to unix:/tmp/dist-test-task96AG_4/test-tmp/rpc-test-0df76cdf9d2349f38352175d61fab073.sock
W20260926 06:58:12.360991   940 connection.cc:196] Error closing socket: Network error: TlsSocket::Close: Broken pipe
[       OK ] Parameters/TestRpc.TestCredentialsPolicy/SSL_UnixSocket (51 ms)
[ RUN      ] Parameters/TestRpc.TestCallLongerThanKeepalive/SSL_UnixSocket
I20260926 06:58:12.396441   966 acceptor_pool.cc:254] collecting diagnostics on the listening RPC socket unix:/tmp/dist-test-task96AG_4/test-tmp/rpc-test-b26f0bc907f1422ca57c3b352e16a171.sock every 8 connection(s)
I20260926 06:58:12.396531   967 acceptor_pool.cc:254] collecting diagnostics on the listening RPC socket unix:/tmp/dist-test-task96AG_4/test-tmp/rpc-test-b26f0bc907f1422ca57c3b352e16a171.sock every 8 connection(s)
I20260926 06:58:12.416648   970 rpc-test-base.h:222] got call: sleep_micros: 3000000 deferred: true
I20260926 06:58:15.417362   970 rpcz_store.cc:275] Call kudu.rpc.GenericCalculatorService.Sleep from unix:<unnamed> (request call id 0) took 3000 ms. Trace:
I20260926 06:58:15.417469   970 rpcz_store.cc:276] 0926 06:58:12.416592 (+     0us) service_pool.cc:170] Inserting onto call queue
0926 06:58:12.416630 (+    38us) service_pool.cc:227] Handling call
0926 06:58:15.417345 (+3000715us) inbound_call.cc:173] Queueing success response
Metrics: {}
W20260926 06:58:15.418613   963 connection.cc:196] Error closing socket: Network error: TlsSocket::Close: Broken pipe
[       OK ] Parameters/TestRpc.TestCallLongerThanKeepalive/SSL_UnixSocket (3054 ms)
[ RUN      ] Parameters/TestRpc.TestRpcSidecar/SSL_UnixSocket
I20260926 06:58:15.426997   991 acceptor_pool.cc:254] collecting diagnostics on the listening RPC socket unix:/tmp/dist-test-task96AG_4/test-tmp/rpc-test-15d808500624447aacfd0287fc91908e.sock every 8 connection(s)
I20260926 06:58:15.427088   992 acceptor_pool.cc:254] collecting diagnostics on the listening RPC socket unix:/tmp/dist-test-task96AG_4/test-tmp/rpc-test-15d808500624447aacfd0287fc91908e.sock every 8 connection(s)
W20260926 06:58:15.474066   988 connection.cc:196] Error closing socket: Network error: TlsSocket::Close: Broken pipe
[       OK ] Parameters/TestRpc.TestRpcSidecar/SSL_UnixSocket (55 ms)
[ RUN      ] Parameters/TestRpc.TestRpcSidecarLimits/SSL_UnixSocket
I20260926 06:58:17.173971  1016 acceptor_pool.cc:254] collecting diagnostics on the listening RPC socket unix:/tmp/dist-test-task96AG_4/test-tmp/rpc-test-53a24e921ebd4b56b3dd4a015b41c2ab.sock every 8 connection(s)
I20260926 06:58:17.174033  1017 acceptor_pool.cc:254] collecting diagnostics on the listening RPC socket unix:/tmp/dist-test-task96AG_4/test-tmp/rpc-test-53a24e921ebd4b56b3dd4a015b41c2ab.sock every 8 connection(s)
W20260926 06:58:17.178810   774 serialization.cc:72] Serialized kudu.rpc_test.PushStringsRequestPB (2147483654 bytes) is larger than the maximum configured RPC message size (52428800 bytes). Sending anyway, but peer may reject the data.
W20260926 06:58:17.182044  1013 connection.cc:535] server connection from unix:<unnamed> recv error: Network error: RPC frame had a length of 2147483714, but we only support messages up to 52428800 bytes long.
W20260926 06:58:17.182098  1013 connection.cc:158] shutting down server connection from unix:<unnamed> with pending inbound data: 4/2147483714 bytes received; last active 0 ns ago: status Network error: RPC frame had a length of 2147483714, but we only support messages up to 52428800 bytes long.
W20260926 06:58:17.182215  1029 connection.cc:698] client connection to unix:/tmp/dist-test-task96AG_4/test-tmp/rpc-test-53a24e921ebd4b56b3dd4a015b41c2ab.sock send error: Network error: failed to write to TLS socket: Broken pipe
W20260926 06:58:17.182358  1029 connection.cc:196] Error closing socket: Network error: TlsSocket::Close: Success
I20260926 06:58:17.198128  1042 acceptor_pool.cc:254] collecting diagnostics on the listening RPC socket unix:/tmp/dist-test-task96AG_4/test-tmp/rpc-test-53a24e921ebd4b56b3dd4a015b41c2ab.sock every 8 connection(s)
I20260926 06:58:17.198227  1041 acceptor_pool.cc:254] collecting diagnostics on the listening RPC socket unix:/tmp/dist-test-task96AG_4/test-tmp/rpc-test-53a24e921ebd4b56b3dd4a015b41c2ab.sock every 8 connection(s)
W20260926 06:58:21.632964  1038 connection.cc:577] server connection from unix:<unnamed>: received bad data: 'Corruption: Invalid packet: message had a length of 2147483710, but we only support messages up to 2147483647 bytes
'
W20260926 06:58:21.633349  1054 connection.cc:196] Error closing socket: Network error: TlsSocket::Close: Broken pipe
[       OK ] Parameters/TestRpc.TestRpcSidecarLimits/SSL_UnixSocket (6160 ms)
[ RUN      ] Parameters/TestRpc.TestCallTimeoutDoesntAffectNegotiation/SSL_UnixSocket
I20260926 06:58:21.652249  1066 acceptor_pool.cc:254] collecting diagnostics on the listening RPC socket unix:/tmp/dist-test-task96AG_4/test-tmp/rpc-test-39d5f62f78d34ac1b92c8bec96eaca07.sock every 8 connection(s)
I20260926 06:58:21.652293  1067 acceptor_pool.cc:254] collecting diagnostics on the listening RPC socket unix:/tmp/dist-test-task96AG_4/test-tmp/rpc-test-39d5f62f78d34ac1b92c8bec96eaca07.sock every 8 connection(s)
W20260926 06:58:21.663671  1062 negotiation.cc:266] Injecting 500ms delay in negotiation
I20260926 06:58:21.713980   774 rpc-test-base.h:595] status: Timed out: connection negotiation to unix:/tmp/dist-test-task96AG_4/test-tmp/rpc-test-39d5f62f78d34ac1b92c8bec96eaca07.sock for RPC Sleep timed out after 0.050s (ON_OUTBOUND_QUEUE), seconds elapsed: 0.0506572
[       OK ] Parameters/TestRpc.TestCallTimeoutDoesntAffectNegotiation/SSL_UnixSocket (540 ms)
[ RUN      ] Parameters/TestRpc.TestRpcHandlerLatencyMetric/SSL_UnixSocket
I20260926 06:58:22.189805  1091 acceptor_pool.cc:254] collecting diagnostics on the listening RPC socket unix:/tmp/dist-test-task96AG_4/test-tmp/rpc-test-2defc8218f094bf08907403644266be0.sock every 8 connection(s)
I20260926 06:58:22.189857  1092 acceptor_pool.cc:254] collecting diagnostics on the listening RPC socket unix:/tmp/dist-test-task96AG_4/test-tmp/rpc-test-2defc8218f094bf08907403644266be0.sock every 8 connection(s)
I20260926 06:58:22.239806   774 rpc-test.cc:1236] Sleep() min lat: 20305
I20260926 06:58:22.239883   774 rpc-test.cc:1237] Sleep() mean lat: 20305
I20260926 06:58:22.239910   774 rpc-test.cc:1238] Sleep() max lat: 20305
I20260926 06:58:22.239925   774 rpc-test.cc:1239] Sleep() #calls: 1
W20260926 06:58:22.240579  1088 connection.cc:196] Error closing socket: Network error: TlsSocket::Close: Broken pipe
[       OK ] Parameters/TestRpc.TestRpcHandlerLatencyMetric/SSL_UnixSocket (64 ms)
[ RUN      ] Parameters/TestRpc.TimedOutOnResponseMetricServiceQueue/SSL_UnixSocket
I20260926 06:58:22.252519  1117 acceptor_pool.cc:254] collecting diagnostics on the listening RPC socket unix:/tmp/dist-test-task96AG_4/test-tmp/rpc-test-28f9bfc9efd34bcab6963e1f69d1d874.sock every 8 connection(s)
I20260926 06:58:22.252566  1118 acceptor_pool.cc:254] collecting diagnostics on the listening RPC socket unix:/tmp/dist-test-task96AG_4/test-tmp/rpc-test-28f9bfc9efd34bcab6963e1f69d1d874.sock every 8 connection(s)
W20260926 06:58:22.312130  1119 rpcz_store.cc:267] Call kudu.rpc_test.CalculatorService.Sleep from unix:<unnamed> (request call id 2) took 20 ms (client timeout 20 ms). Trace:
W20260926 06:58:22.312261  1119 rpcz_store.cc:269] 0926 06:58:22.291825 (+     0us) service_pool.cc:170] Inserting onto call queue
0926 06:58:22.312108 (+ 20283us) service_pool.cc:214] Skipping call since client already timed out
0926 06:58:22.312117 (+     9us) inbound_call.cc:173] Queueing failure response
Metrics: {}
W20260926 06:58:22.312958  1114 connection.cc:196] Error closing socket: Network error: TlsSocket::Close: Broken pipe
[       OK ] Parameters/TestRpc.TimedOutOnResponseMetricServiceQueue/SSL_UnixSocket (72 ms)
[ RUN      ] Parameters/TestRpc.RpcPendingConnectionsMetric/SSL_UnixSocket
I20260926 06:58:22.315841  1140 acceptor_pool.cc:254] collecting diagnostics on the listening RPC socket 0.0.0.0:40843 every 8 connection(s)
I20260926 06:58:22.315902  1141 acceptor_pool.cc:254] collecting diagnostics on the listening RPC socket 0.0.0.0:40843 every 8 connection(s)
W20260926 06:58:22.324690  1136 negotiation.cc:337] Failed RPC negotiation. Trace:
0926 06:58:22.324392 (+     0us) reactor.cc:625] Submitting negotiation task for server connection from 127.0.0.1:55218 (local address 127.0.0.1:40843)
0926 06:58:22.324484 (+    92us) server_negotiation.cc:206] Beginning negotiation
0926 06:58:22.324488 (+     4us) server_negotiation.cc:399] Waiting for connection header
0926 06:58:22.324596 (+   108us) negotiation.cc:327] Negotiation complete: Network error: Server connection negotiation failed: server connection from 127.0.0.1:55218: BlockingRecv error: recv got EOF from 127.0.0.1:55218 (error 108)
Metrics: {"server-negotiator.queue_time_us":26}
[       OK ] Parameters/TestRpc.RpcPendingConnectionsMetric/SSL_UnixSocket (21 ms)
[ RUN      ] Parameters/TestRpc.TestRpcContextClientDeadline/SSL_UnixSocket
I20260926 06:58:22.345842  1156 acceptor_pool.cc:254] collecting diagnostics on the listening RPC socket unix:/tmp/dist-test-task96AG_4/test-tmp/rpc-test-799ca94df7b54ef5939e6661df0e841a.sock every 8 connection(s)
I20260926 06:58:22.345882  1157 acceptor_pool.cc:254] collecting diagnostics on the listening RPC socket unix:/tmp/dist-test-task96AG_4/test-tmp/rpc-test-799ca94df7b54ef5939e6661df0e841a.sock every 8 connection(s)
W20260926 06:58:22.379007  1153 connection.cc:196] Error closing socket: Network error: TlsSocket::Close: Broken pipe
[       OK ] Parameters/TestRpc.TestRpcContextClientDeadline/SSL_UnixSocket (44 ms)
[ RUN      ] Parameters/TestRpc.TestApplicationFeatureFlagUnsupportedServer/SSL_UnixSocket
I20260926 06:58:22.386221  1181 acceptor_pool.cc:254] collecting diagnostics on the listening RPC socket unix:/tmp/dist-test-task96AG_4/test-tmp/rpc-test-0729164171ed4036b947732533640c2d.sock every 8 connection(s)
I20260926 06:58:22.386255  1182 acceptor_pool.cc:254] collecting diagnostics on the listening RPC socket unix:/tmp/dist-test-task96AG_4/test-tmp/rpc-test-0729164171ed4036b947732533640c2d.sock every 8 connection(s)
W20260926 06:58:22.400236  1178 connection.cc:196] Error closing socket: Network error: TlsSocket::Close: Broken pipe
[       OK ] Parameters/TestRpc.TestApplicationFeatureFlagUnsupportedServer/SSL_UnixSocket (21 ms)
[ RUN      ] Parameters/TestRpc.TestCancellationAsync/SSL_UnixSocket
I20260926 06:58:22.413975  1206 acceptor_pool.cc:254] collecting diagnostics on the listening RPC socket unix:/tmp/dist-test-task96AG_4/test-tmp/rpc-test-7f614a4b739946c88236c30d8913ddd1.sock every 8 connection(s)
I20260926 06:58:22.414022  1207 acceptor_pool.cc:254] collecting diagnostics on the listening RPC socket unix:/tmp/dist-test-task96AG_4/test-tmp/rpc-test-7f614a4b739946c88236c30d8913ddd1.sock every 8 connection(s)
I20260926 06:58:22.414192   774 rpc-test.cc:1716] Connecting to unix:/tmp/dist-test-task96AG_4/test-tmp/rpc-test-7f614a4b739946c88236c30d8913ddd1.sock
I20260926 06:58:22.426159   774 test_util.cc:268] Using random seed: 1540448301
I20260926 06:58:22.440011  1210 rpc-test-base.h:240] got call: sleep_micros: 500 pattern: 4294967295 num_repetitions: 2097152 sidecar_idx: 0
I20260926 06:58:22.450819  1210 rpc-test-base.h:240] got call: sleep_micros: 500 pattern: 4294967295 num_repetitions: 2097152 sidecar_idx: 0
I20260926 06:58:22.461047  1210 rpc-test-base.h:240] got call: sleep_micros: 500 pattern: 4294967295 num_repetitions: 2097152 sidecar_idx: 0
I20260926 06:58:22.471175  1210 rpc-test-base.h:240] got call: sleep_micros: 500 pattern: 4294967295 num_repetitions: 2097152 sidecar_idx: 0
I20260926 06:58:22.481179  1210 rpc-test-base.h:240] got call: sleep_micros: 500 pattern: 4294967295 num_repetitions: 2097152 sidecar_idx: 0
I20260926 06:58:22.491183  1210 rpc-test-base.h:240] got call: sleep_micros: 500 pattern: 4294967295 num_repetitions: 2097152 sidecar_idx: 0
I20260926 06:58:22.501180  1210 rpc-test-base.h:240] got call: sleep_micros: 500 pattern: 4294967295 num_repetitions: 2097152 sidecar_idx: 0
I20260926 06:58:22.511360  1210 rpc-test-base.h:240] got call: sleep_micros: 500 pattern: 4294967295 num_repetitions: 2097152 sidecar_idx: 0
W20260926 06:58:22.512674  1203 connection.cc:196] Error closing socket: Network error: TlsSocket::Close: Broken pipe
W20260926 06:58:22.514350  1203 connection.cc:441] server connection from unix:<unnamed> torn down before Call kudu.rpc.GenericCalculatorService.SleepWithSidecar from unix:<unnamed> (request call id 9) could send its response
[       OK ] Parameters/TestRpc.TestCancellationAsync/SSL_UnixSocket (114 ms)
[ RUN      ] Parameters/TestRpc.TestPerformanceBySocketType/SSL_UnixSocket
I20260926 06:58:22.532033  1231 acceptor_pool.cc:254] collecting diagnostics on the listening RPC socket unix:/tmp/dist-test-task96AG_4/test-tmp/rpc-test-ce868e1677e7474ca65f99a8a167963b.sock every 8 connection(s)
I20260926 06:58:22.532225   774 rpc-test.cc:1846] Connecting to unix:/tmp/dist-test-task96AG_4/test-tmp/rpc-test-ce868e1677e7474ca65f99a8a167963b.sock
I20260926 06:58:22.532061  1232 acceptor_pool.cc:254] collecting diagnostics on the listening RPC socket unix:/tmp/dist-test-task96AG_4/test-tmp/rpc-test-ce868e1677e7474ca65f99a8a167963b.sock every 8 connection(s)
I20260926 06:58:23.810962   774 rpc-test.cc:1859] Sending 1024MB via ssl-enabled unix socket: real 1.257s	user 1.326s	sys 0.940s
I20260926 06:58:25.091756   774 rpc-test.cc:1859] Sending 1024MB via ssl-enabled unix socket: real 1.281s	user 1.416s	sys 0.875s
I20260926 06:58:26.432502   774 rpc-test.cc:1859] Sending 1024MB via ssl-enabled unix socket: real 1.341s	user 1.424s	sys 0.968s
I20260926 06:58:27.825403   774 rpc-test.cc:1859] Sending 1024MB via ssl-enabled unix socket: real 1.393s	user 1.513s	sys 0.967s
I20260926 06:58:29.091950   774 rpc-test.cc:1859] Sending 1024MB via ssl-enabled unix socket: real 1.266s	user 1.318s	sys 0.943s
W20260926 06:58:29.092844  1228 connection.cc:196] Error closing socket: Network error: TlsSocket::Close: Broken pipe
[       OK ] Parameters/TestRpc.TestPerformanceBySocketType/SSL_UnixSocket (6578 ms)
[----------] 20 tests from Parameters/TestRpc (26577 ms total)

[----------] 1 test from Parameters/TestRpcSocketTxRxQueue
[ RUN      ] Parameters/TestRpcSocketTxRxQueue.AcceptorRxQueueSizeMetric/0
I20260926 06:58:29.102557  1256 acceptor_pool.cc:254] collecting diagnostics on the listening RPC socket 0.0.0.0:35917 every 1 connection(s)
I20260926 06:58:29.102599  1257 acceptor_pool.cc:254] collecting diagnostics on the listening RPC socket 0.0.0.0:35917 every 1 connection(s)
W20260926 06:58:29.103230  1252 negotiation.cc:337] Failed RPC negotiation. Trace:
0926 06:58:29.103065 (+     0us) reactor.cc:625] Submitting negotiation task for server connection from 127.0.0.1:48154 (local address 127.0.0.1:35917)
0926 06:58:29.103133 (+    68us) server_negotiation.cc:206] Beginning negotiation
0926 06:58:29.103135 (+     2us) server_negotiation.cc:399] Waiting for connection header
0926 06:58:29.103202 (+    67us) negotiation.cc:327] Negotiation complete: Network error: Server connection negotiation failed: server connection from 127.0.0.1:48154: BlockingRecv error: recv got EOF from 127.0.0.1:48154 (error 108)
Metrics: {"server-negotiator.queue_time_us":36}
[       OK ] Parameters/TestRpcSocketTxRxQueue.AcceptorRxQueueSizeMetric/0 (11 ms)
[----------] 1 test from Parameters/TestRpcSocketTxRxQueue (11 ms total)

[----------] Global test environment tear-down
[==========] 21 tests from 2 test suites ran. (26588 ms total)
[  PASSED  ] 20 tests.
[  FAILED  ] 1 test, listed below:
[  FAILED  ] Parameters/TestRpc.TestCallWithChainCertAndChainCA/SSL_UnixSocket, where GetParam() = (true, true)

 1 FAILED TEST