Diagnosed failure
Parameters/TestRpc.TestCallWithChainCertAndChainCA/SSL_UnixSocket: /data0/somelongdirectorytoavoidrpathissues/src/kudu/src/kudu/rpc/rpc-test.cc:270: Failure
Failed
Bad status: Runtime error: could not verify certificate chain (error with cert: subject=CN = localhost, ST = sadfjas, C = AS, emailAddress = sdflkdsajf, O = lskdfjlsad, OU = sldfkja, issuer=C = AS, ST = ASDfkjdhf, L = lskdjf, O = saldfja, OU = skdjf, CN = localhost, emailAddress = sadjflkadsj): : certificate has expired
Google Test trace:
/data0/somelongdirectorytoavoidrpathissues/src/kudu/src/kudu/rpc/rpc-test.cc:267: Connecting to unix:/tmp/dist-test-taskrxSKmq/test-tmp/rpc-test-55bfcd3293144d6dad46dc1f01df73f9.sock
I20260926 13:38:31.925269 379 test_util.cc:175] -----------------------------------------------
I20260926 13:38:31.925359 379 test_util.cc:176] Had fatal failures, leaving test files at /tmp/dist-test-taskrxSKmq/test-tmp/rpc-test.6.Parameters_TestRpc.TestCallWithChainCertAndChainCA_SSL_UnixSocket.1790429911817636-379-0
Full log
Note: This is test shard 7 of 8.
[==========] Running 21 tests from 2 test suites.
[----------] Global test environment set-up.
[----------] 20 tests from Parameters/TestRpc
[ RUN ] Parameters/TestRpc.TestMessengerCreateDestroy/SSL_UnixSocket
WARNING: Logging before InitGoogleLogging() is written to STDERR
I20260926 13:38:31.858968 379 rpc-test.cc:169] started messenger TestCreateDestroy
[ OK ] Parameters/TestRpc.TestMessengerCreateDestroy/SSL_UnixSocket (24 ms)
[ RUN ] Parameters/TestRpc.TestNegotiationDeadlock/SSL_UnixSocket
I20260926 13:38:31.875638 399 acceptor_pool.cc:254] collecting diagnostics on the listening RPC socket unix:/tmp/dist-test-taskrxSKmq/test-tmp/rpc-test-0b96710b42844d2191dcc2b2c0ebe1dc.sock every 8 connection(s)
I20260926 13:38:31.875936 400 acceptor_pool.cc:254] collecting diagnostics on the listening RPC socket unix:/tmp/dist-test-taskrxSKmq/test-tmp/rpc-test-0b96710b42844d2191dcc2b2c0ebe1dc.sock every 8 connection(s)
[ OK ] Parameters/TestRpc.TestNegotiationDeadlock/SSL_UnixSocket (32 ms)
[ RUN ] Parameters/TestRpc.TestCallWithChainCertAndChainCA/SSL_UnixSocket
I20260926 13:38:31.914803 415 acceptor_pool.cc:254] collecting diagnostics on the listening RPC socket unix:/tmp/dist-test-taskrxSKmq/test-tmp/rpc-test-55bfcd3293144d6dad46dc1f01df73f9.sock every 8 connection(s)
I20260926 13:38:31.915122 416 acceptor_pool.cc:254] collecting diagnostics on the listening RPC socket unix:/tmp/dist-test-taskrxSKmq/test-tmp/rpc-test-55bfcd3293144d6dad46dc1f01df73f9.sock every 8 connection(s)
/data0/somelongdirectorytoavoidrpathissues/src/kudu/src/kudu/rpc/rpc-test.cc:270: Failure
Failed
Bad status: Runtime error: could not verify certificate chain (error with cert: subject=CN = localhost, ST = sadfjas, C = AS, emailAddress = sdflkdsajf, O = lskdfjlsad, OU = sldfkja, issuer=C = AS, ST = ASDfkjdhf, L = lskdjf, O = saldfja, OU = skdjf, CN = localhost, emailAddress = sadjflkadsj): : certificate has expired
Google Test trace:
/data0/somelongdirectorytoavoidrpathissues/src/kudu/src/kudu/rpc/rpc-test.cc:267: Connecting to unix:/tmp/dist-test-taskrxSKmq/test-tmp/rpc-test-55bfcd3293144d6dad46dc1f01df73f9.sock
I20260926 13:38:31.925269 379 test_util.cc:175] -----------------------------------------------
I20260926 13:38:31.925359 379 test_util.cc:176] Had fatal failures, leaving test files at /tmp/dist-test-taskrxSKmq/test-tmp/rpc-test.6.Parameters_TestRpc.TestCallWithChainCertAndChainCA_SSL_UnixSocket.1790429911817636-379-0
[ FAILED ] Parameters/TestRpc.TestCallWithChainCertAndChainCA/SSL_UnixSocket, where GetParam() = (true, true) (31 ms)
[ RUN ] Parameters/TestRpc.TestCallWithPasswordProtectedKey/SSL_UnixSocket
I20260926 13:38:31.943641 440 acceptor_pool.cc:254] collecting diagnostics on the listening RPC socket unix:/tmp/dist-test-taskrxSKmq/test-tmp/rpc-test-9d6cb1062153493fb071432997b7cf05.sock every 8 connection(s)
I20260926 13:38:31.943856 441 acceptor_pool.cc:254] collecting diagnostics on the listening RPC socket unix:/tmp/dist-test-taskrxSKmq/test-tmp/rpc-test-9d6cb1062153493fb071432997b7cf05.sock every 8 connection(s)
W20260926 13:38:31.971758 437 connection.cc:196] Error closing socket: Network error: TlsSocket::Close: Broken pipe
[ OK ] Parameters/TestRpc.TestCallWithPasswordProtectedKey/SSL_UnixSocket (49 ms)
[ RUN ] Parameters/TestRpc.TestCallToBadServer/SSL_UnixSocket
I20260926 13:38:31.985111 379 rpc-test.cc:394] Status: Network error: Client connection negotiation failed: client connection to 0.0.0.0:0: connect: Connection refused (error 111)
I20260926 13:38:31.985721 379 rpc-test.cc:394] Status: Network error: Client connection negotiation failed: client connection to 0.0.0.0:0: connect: Connection refused (error 111)
I20260926 13:38:31.986238 379 rpc-test.cc:394] Status: Network error: Client connection negotiation failed: client connection to 0.0.0.0:0: connect: Connection refused (error 111)
I20260926 13:38:31.986708 379 rpc-test.cc:394] Status: Network error: Client connection negotiation failed: client connection to 0.0.0.0:0: connect: Connection refused (error 111)
I20260926 13:38:31.987186 379 rpc-test.cc:394] Status: Network error: Client connection negotiation failed: client connection to 0.0.0.0:0: connect: Connection refused (error 111)
[ OK ] Parameters/TestRpc.TestCallToBadServer/SSL_UnixSocket (13 ms)
[ RUN ] Parameters/TestRpc.TestWrongService/SSL_UnixSocket
I20260926 13:38:31.999959 475 acceptor_pool.cc:254] collecting diagnostics on the listening RPC socket unix:/tmp/dist-test-taskrxSKmq/test-tmp/rpc-test-b9cf1444e4c745b9909596b183ccd714.sock every 8 connection(s)
I20260926 13:38:32.000183 476 acceptor_pool.cc:254] collecting diagnostics on the listening RPC socket unix:/tmp/dist-test-taskrxSKmq/test-tmp/rpc-test-b9cf1444e4c745b9909596b183ccd714.sock every 8 connection(s)
I20260926 13:38:32.023010 472 messenger.cc:345] service WrongServiceName not registered on TestServer
W20260926 13:38:32.024734 472 connection.cc:196] Error closing socket: Network error: TlsSocket::Close: Broken pipe
[ OK ] Parameters/TestRpc.TestWrongService/SSL_UnixSocket (39 ms)
[ RUN ] Parameters/TestRpc.TestConnectionKeepalive/SSL_UnixSocket
I20260926 13:38:32.049235 498 acceptor_pool.cc:254] collecting diagnostics on the listening RPC socket unix:/tmp/dist-test-taskrxSKmq/test-tmp/rpc-test-2183854b76ac4bc599722cb1eee1ee13.sock every 8 connection(s)
I20260926 13:38:32.049479 499 acceptor_pool.cc:254] collecting diagnostics on the listening RPC socket unix:/tmp/dist-test-taskrxSKmq/test-tmp/rpc-test-2183854b76ac4bc599722cb1eee1ee13.sock every 8 connection(s)
I20260926 13:38:32.050369 379 rpc-test.cc:488] Connecting to unix:/tmp/dist-test-taskrxSKmq/test-tmp/rpc-test-2183854b76ac4bc599722cb1eee1ee13.sock
W20260926 13:38:32.530057 511 connection.cc:196] Error closing socket: Network error: TlsSocket::Close: Broken pipe
[ OK ] Parameters/TestRpc.TestConnectionKeepalive/SSL_UnixSocket (1065 ms)
[ RUN ] Parameters/TestRpc.TestClientConnectionMetrics/SSL_UnixSocket
I20260926 13:38:33.114961 523 acceptor_pool.cc:254] collecting diagnostics on the listening RPC socket unix:/tmp/dist-test-taskrxSKmq/test-tmp/rpc-test-ca838aa9b5d34b8ea68c3206501abcc4.sock every 8 connection(s)
I20260926 13:38:33.115181 524 acceptor_pool.cc:254] collecting diagnostics on the listening RPC socket unix:/tmp/dist-test-taskrxSKmq/test-tmp/rpc-test-ca838aa9b5d34b8ea68c3206501abcc4.sock every 8 connection(s)
I20260926 13:38:33.116017 379 rpc-test.cc:569] Connecting to unix:/tmp/dist-test-taskrxSKmq/test-tmp/rpc-test-ca838aa9b5d34b8ea68c3206501abcc4.sock
W20260926 13:38:53.571101 520 connection.cc:196] Error closing socket: Network error: TlsSocket::Close: Broken pipe
[ OK ] Parameters/TestRpc.TestClientConnectionMetrics/SSL_UnixSocket (20483 ms)
[ RUN ] Parameters/TestRpc.TestCredentialsPolicy/SSL_UnixSocket
I20260926 13:38:53.606794 546 acceptor_pool.cc:254] collecting diagnostics on the listening RPC socket unix:/tmp/dist-test-taskrxSKmq/test-tmp/rpc-test-82e05e41340c4efbab490666415e602a.sock every 8 connection(s)
I20260926 13:38:53.607028 547 acceptor_pool.cc:254] collecting diagnostics on the listening RPC socket unix:/tmp/dist-test-taskrxSKmq/test-tmp/rpc-test-82e05e41340c4efbab490666415e602a.sock every 8 connection(s)
I20260926 13:38:53.607857 379 rpc-test.cc:700] Connecting to unix:/tmp/dist-test-taskrxSKmq/test-tmp/rpc-test-82e05e41340c4efbab490666415e602a.sock
W20260926 13:38:53.645269 545 connection.cc:196] Error closing socket: Network error: TlsSocket::Close: Broken pipe
[ OK ] Parameters/TestRpc.TestCredentialsPolicy/SSL_UnixSocket (77 ms)
[ RUN ] Parameters/TestRpc.TestCallLongerThanKeepalive/SSL_UnixSocket
I20260926 13:38:53.664425 571 acceptor_pool.cc:254] collecting diagnostics on the listening RPC socket unix:/tmp/dist-test-taskrxSKmq/test-tmp/rpc-test-aaa2d40a48ec466cb6e83aba0ec2badb.sock every 8 connection(s)
I20260926 13:38:53.664638 572 acceptor_pool.cc:254] collecting diagnostics on the listening RPC socket unix:/tmp/dist-test-taskrxSKmq/test-tmp/rpc-test-aaa2d40a48ec466cb6e83aba0ec2badb.sock every 8 connection(s)
I20260926 13:38:53.683254 575 rpc-test-base.h:222] got call: sleep_micros: 3000000 deferred: true
I20260926 13:38:56.684912 575 rpcz_store.cc:275] Call kudu.rpc.GenericCalculatorService.Sleep from unix:<unnamed> (request call id 0) took 3001 ms. Trace:
I20260926 13:38:56.685068 575 rpcz_store.cc:276] 0926 13:38:53.683154 (+ 0us) service_pool.cc:170] Inserting onto call queue
0926 13:38:53.683206 (+ 52us) service_pool.cc:227] Handling call
0926 13:38:56.684860 (+3001654us) inbound_call.cc:173] Queueing success response
Metrics: {}
W20260926 13:38:56.687724 568 connection.cc:196] Error closing socket: Network error: TlsSocket::Close: Broken pipe
[ OK ] Parameters/TestRpc.TestCallLongerThanKeepalive/SSL_UnixSocket (3035 ms)
[ RUN ] Parameters/TestRpc.TestRpcSidecar/SSL_UnixSocket
I20260926 13:38:56.712986 596 acceptor_pool.cc:254] collecting diagnostics on the listening RPC socket unix:/tmp/dist-test-taskrxSKmq/test-tmp/rpc-test-3ae94aead1e64cabb77ac0ad3a0be5d6.sock every 8 connection(s)
I20260926 13:38:56.713205 597 acceptor_pool.cc:254] collecting diagnostics on the listening RPC socket unix:/tmp/dist-test-taskrxSKmq/test-tmp/rpc-test-3ae94aead1e64cabb77ac0ad3a0be5d6.sock every 8 connection(s)
W20260926 13:38:56.811026 593 connection.cc:196] Error closing socket: Network error: TlsSocket::Close: Broken pipe
[ OK ] Parameters/TestRpc.TestRpcSidecar/SSL_UnixSocket (123 ms)
[ RUN ] Parameters/TestRpc.TestRpcSidecarLimits/SSL_UnixSocket
I20260926 13:38:58.884372 621 acceptor_pool.cc:254] collecting diagnostics on the listening RPC socket unix:/tmp/dist-test-taskrxSKmq/test-tmp/rpc-test-9b8d6a7cbfe84bc493438bcbac978b1d.sock every 8 connection(s)
I20260926 13:38:58.884578 622 acceptor_pool.cc:254] collecting diagnostics on the listening RPC socket unix:/tmp/dist-test-taskrxSKmq/test-tmp/rpc-test-9b8d6a7cbfe84bc493438bcbac978b1d.sock every 8 connection(s)
W20260926 13:38:58.893381 379 serialization.cc:72] Serialized kudu.rpc_test.PushStringsRequestPB (2147483654 bytes) is larger than the maximum configured RPC message size (52428800 bytes). Sending anyway, but peer may reject the data.
W20260926 13:38:58.898699 618 connection.cc:535] server connection from unix:<unnamed> recv error: Network error: RPC frame had a length of 2147483714, but we only support messages up to 52428800 bytes long.
W20260926 13:38:58.898811 618 connection.cc:158] shutting down server connection from unix:<unnamed> with pending inbound data: 4/2147483714 bytes received; last active 0 ns ago: status Network error: RPC frame had a length of 2147483714, but we only support messages up to 52428800 bytes long.
W20260926 13:38:58.899189 634 connection.cc:196] Error closing socket: Network error: TlsSocket::Close: Broken pipe
I20260926 13:38:58.920141 646 acceptor_pool.cc:254] collecting diagnostics on the listening RPC socket unix:/tmp/dist-test-taskrxSKmq/test-tmp/rpc-test-9b8d6a7cbfe84bc493438bcbac978b1d.sock every 8 connection(s)
I20260926 13:38:58.920295 647 acceptor_pool.cc:254] collecting diagnostics on the listening RPC socket unix:/tmp/dist-test-taskrxSKmq/test-tmp/rpc-test-9b8d6a7cbfe84bc493438bcbac978b1d.sock every 8 connection(s)
W20260926 13:39:04.446074 643 connection.cc:577] server connection from unix:<unnamed>: received bad data: 'Corruption: Invalid packet: message had a length of 2147483710, but we only support messages up to 2147483647 bytes
'
W20260926 13:39:04.446702 659 connection.cc:196] Error closing socket: Network error: TlsSocket::Close: Broken pipe
[ OK ] Parameters/TestRpc.TestRpcSidecarLimits/SSL_UnixSocket (8044 ms)
[ RUN ] Parameters/TestRpc.TestCallTimeoutDoesntAffectNegotiation/SSL_UnixSocket
I20260926 13:39:04.875512 671 acceptor_pool.cc:254] collecting diagnostics on the listening RPC socket unix:/tmp/dist-test-taskrxSKmq/test-tmp/rpc-test-c21e16a41881467881124147fd07a0ff.sock every 8 connection(s)
I20260926 13:39:04.875758 672 acceptor_pool.cc:254] collecting diagnostics on the listening RPC socket unix:/tmp/dist-test-taskrxSKmq/test-tmp/rpc-test-c21e16a41881467881124147fd07a0ff.sock every 8 connection(s)
W20260926 13:39:04.898874 667 negotiation.cc:266] Injecting 500ms delay in negotiation
I20260926 13:39:04.949299 379 rpc-test-base.h:595] status: Timed out: connection negotiation to unix:/tmp/dist-test-taskrxSKmq/test-tmp/rpc-test-c21e16a41881467881124147fd07a0ff.sock for RPC Sleep timed out after 0.050s (ON_OUTBOUND_QUEUE), seconds elapsed: 0.0509626
[ OK ] Parameters/TestRpc.TestCallTimeoutDoesntAffectNegotiation/SSL_UnixSocket (550 ms)
[ RUN ] Parameters/TestRpc.TestRpcHandlerLatencyMetric/SSL_UnixSocket
I20260926 13:39:05.417421 696 acceptor_pool.cc:254] collecting diagnostics on the listening RPC socket unix:/tmp/dist-test-taskrxSKmq/test-tmp/rpc-test-4ec0ce1782774720b24114f481228efd.sock every 8 connection(s)
I20260926 13:39:05.417707 697 acceptor_pool.cc:254] collecting diagnostics on the listening RPC socket unix:/tmp/dist-test-taskrxSKmq/test-tmp/rpc-test-4ec0ce1782774720b24114f481228efd.sock every 8 connection(s)
I20260926 13:39:05.452521 379 rpc-test.cc:1236] Sleep() min lat: 20585
I20260926 13:39:05.452613 379 rpc-test.cc:1237] Sleep() mean lat: 20585
I20260926 13:39:05.452653 379 rpc-test.cc:1238] Sleep() max lat: 20585
I20260926 13:39:05.452685 379 rpc-test.cc:1239] Sleep() #calls: 1
[ OK ] Parameters/TestRpc.TestRpcHandlerLatencyMetric/SSL_UnixSocket (48 ms)
[ RUN ] Parameters/TestRpc.TimedOutOnResponseMetricServiceQueue/SSL_UnixSocket
I20260926 13:39:05.492208 722 acceptor_pool.cc:254] collecting diagnostics on the listening RPC socket unix:/tmp/dist-test-taskrxSKmq/test-tmp/rpc-test-c66a334b779d40bcb32950734c23c39d.sock every 8 connection(s)
I20260926 13:39:05.492365 723 acceptor_pool.cc:254] collecting diagnostics on the listening RPC socket unix:/tmp/dist-test-taskrxSKmq/test-tmp/rpc-test-c66a334b779d40bcb32950734c23c39d.sock every 8 connection(s)
W20260926 13:39:05.546993 724 rpcz_store.cc:267] Call kudu.rpc_test.CalculatorService.Sleep from unix:<unnamed> (request call id 2) took 20 ms (client timeout 20 ms). Trace:
W20260926 13:39:05.547116 724 rpcz_store.cc:269] 0926 13:39:05.526629 (+ 0us) service_pool.cc:170] Inserting onto call queue
0926 13:39:05.546937 (+ 20308us) service_pool.cc:214] Skipping call since client already timed out
0926 13:39:05.546976 (+ 39us) inbound_call.cc:173] Queueing failure response
Metrics: {}
[ OK ] Parameters/TestRpc.TimedOutOnResponseMetricServiceQueue/SSL_UnixSocket (94 ms)
[ RUN ] Parameters/TestRpc.RpcPendingConnectionsMetric/SSL_UnixSocket
I20260926 13:39:05.555342 745 acceptor_pool.cc:254] collecting diagnostics on the listening RPC socket 0.0.0.0:40073 every 8 connection(s)
I20260926 13:39:05.555533 746 acceptor_pool.cc:254] collecting diagnostics on the listening RPC socket 0.0.0.0:40073 every 8 connection(s)
W20260926 13:39:05.565519 741 negotiation.cc:337] Failed RPC negotiation. Trace:
0926 13:39:05.564822 (+ 0us) reactor.cc:625] Submitting negotiation task for server connection from 127.0.0.1:37716 (local address 127.0.0.1:40073)
0926 13:39:05.565008 (+ 186us) server_negotiation.cc:206] Beginning negotiation
0926 13:39:05.565012 (+ 4us) server_negotiation.cc:399] Waiting for connection header
0926 13:39:05.565148 (+ 136us) negotiation.cc:327] Negotiation complete: Network error: Server connection negotiation failed: server connection from 127.0.0.1:37716: BlockingRecv error: recv got EOF from 127.0.0.1:37716 (error 108)
Metrics: {"server-negotiator.queue_time_us":52}
[ OK ] Parameters/TestRpc.RpcPendingConnectionsMetric/SSL_UnixSocket (26 ms)
[ RUN ] Parameters/TestRpc.TestRpcContextClientDeadline/SSL_UnixSocket
I20260926 13:39:05.594640 761 acceptor_pool.cc:254] collecting diagnostics on the listening RPC socket unix:/tmp/dist-test-taskrxSKmq/test-tmp/rpc-test-0afbc7510fb348dfbca5323e00e6a65b.sock every 8 connection(s)
I20260926 13:39:05.594800 762 acceptor_pool.cc:254] collecting diagnostics on the listening RPC socket unix:/tmp/dist-test-taskrxSKmq/test-tmp/rpc-test-0afbc7510fb348dfbca5323e00e6a65b.sock every 8 connection(s)
[ OK ] Parameters/TestRpc.TestRpcContextClientDeadline/SSL_UnixSocket (58 ms)
[ RUN ] Parameters/TestRpc.TestApplicationFeatureFlagUnsupportedServer/SSL_UnixSocket
I20260926 13:39:05.663930 786 acceptor_pool.cc:254] collecting diagnostics on the listening RPC socket unix:/tmp/dist-test-taskrxSKmq/test-tmp/rpc-test-4c472c033398427a8555e56b54744f7f.sock every 8 connection(s)
I20260926 13:39:05.664137 787 acceptor_pool.cc:254] collecting diagnostics on the listening RPC socket unix:/tmp/dist-test-taskrxSKmq/test-tmp/rpc-test-4c472c033398427a8555e56b54744f7f.sock every 8 connection(s)
[ OK ] Parameters/TestRpc.TestApplicationFeatureFlagUnsupportedServer/SSL_UnixSocket (49 ms)
[ RUN ] Parameters/TestRpc.TestCancellationAsync/SSL_UnixSocket
I20260926 13:39:05.705808 811 acceptor_pool.cc:254] collecting diagnostics on the listening RPC socket unix:/tmp/dist-test-taskrxSKmq/test-tmp/rpc-test-053f3e93d0be4d7684609794c2363d51.sock every 8 connection(s)
I20260926 13:39:05.706070 812 acceptor_pool.cc:254] collecting diagnostics on the listening RPC socket unix:/tmp/dist-test-taskrxSKmq/test-tmp/rpc-test-053f3e93d0be4d7684609794c2363d51.sock every 8 connection(s)
I20260926 13:39:05.706897 379 rpc-test.cc:1716] Connecting to unix:/tmp/dist-test-taskrxSKmq/test-tmp/rpc-test-053f3e93d0be4d7684609794c2363d51.sock
I20260926 13:39:05.717103 379 test_util.cc:268] Using random seed: -186064548
I20260926 13:39:05.749672 815 rpc-test-base.h:240] got call: sleep_micros: 500 pattern: 4294967295 num_repetitions: 2097152 sidecar_idx: 0
I20260926 13:39:05.776995 814 rpc-test-base.h:240] got call: sleep_micros: 500 pattern: 4294967295 num_repetitions: 2097152 sidecar_idx: 0
I20260926 13:39:05.805461 813 rpc-test-base.h:240] got call: sleep_micros: 500 pattern: 4294967295 num_repetitions: 2097152 sidecar_idx: 0
I20260926 13:39:05.833776 815 rpc-test-base.h:240] got call: sleep_micros: 500 pattern: 4294967295 num_repetitions: 2097152 sidecar_idx: 0
I20260926 13:39:05.868350 813 rpc-test-base.h:240] got call: sleep_micros: 500 pattern: 4294967295 num_repetitions: 2097152 sidecar_idx: 0
I20260926 13:39:05.893913 815 rpc-test-base.h:240] got call: sleep_micros: 500 pattern: 4294967295 num_repetitions: 2097152 sidecar_idx: 0
I20260926 13:39:05.921720 813 rpc-test-base.h:240] got call: sleep_micros: 500 pattern: 4294967295 num_repetitions: 2097152 sidecar_idx: 0
W20260926 13:39:05.923787 808 connection.cc:196] Error closing socket: Network error: TlsSocket::Close: Broken pipe
W20260926 13:39:05.951778 808 connection.cc:441] server connection from unix:<unnamed> torn down before Call kudu.rpc.GenericCalculatorService.SleepWithSidecar from unix:<unnamed> (request call id 8) could send its response
W20260926 13:39:05.968564 808 connection.cc:441] server connection from unix:<unnamed> torn down before Call kudu.rpc.GenericCalculatorService.SleepWithSidecar from unix:<unnamed> (request call id 9) could send its response
[ OK ] Parameters/TestRpc.TestCancellationAsync/SSL_UnixSocket (285 ms)
[ RUN ] Parameters/TestRpc.TestPerformanceBySocketType/SSL_UnixSocket
I20260926 13:39:06.005744 836 acceptor_pool.cc:254] collecting diagnostics on the listening RPC socket unix:/tmp/dist-test-taskrxSKmq/test-tmp/rpc-test-0a45ef968b144da295b8bf26c149f89b.sock every 8 connection(s)
I20260926 13:39:06.006031 837 acceptor_pool.cc:254] collecting diagnostics on the listening RPC socket unix:/tmp/dist-test-taskrxSKmq/test-tmp/rpc-test-0a45ef968b144da295b8bf26c149f89b.sock every 8 connection(s)
I20260926 13:39:06.006919 379 rpc-test.cc:1846] Connecting to unix:/tmp/dist-test-taskrxSKmq/test-tmp/rpc-test-0a45ef968b144da295b8bf26c149f89b.sock
I20260926 13:39:08.940932 379 rpc-test.cc:1859] Sending 1024MB via ssl-enabled unix socket: real 2.902s user 2.919s sys 2.021s
I20260926 13:39:11.798316 379 rpc-test.cc:1859] Sending 1024MB via ssl-enabled unix socket: real 2.857s user 2.869s sys 2.003s
I20260926 13:39:14.687086 379 rpc-test.cc:1859] Sending 1024MB via ssl-enabled unix socket: real 2.889s user 2.926s sys 1.967s
I20260926 13:39:17.593183 379 rpc-test.cc:1859] Sending 1024MB via ssl-enabled unix socket: real 2.906s user 2.829s sys 2.126s
I20260926 13:39:20.450568 379 rpc-test.cc:1859] Sending 1024MB via ssl-enabled unix socket: real 2.857s user 2.872s sys 1.976s
W20260926 13:39:20.451694 833 connection.cc:196] Error closing socket: Network error: TlsSocket::Close: Broken pipe
[ OK ] Parameters/TestRpc.TestPerformanceBySocketType/SSL_UnixSocket (14485 ms)
[----------] 20 tests from Parameters/TestRpc (48619 ms total)
[----------] 1 test from Parameters/TestRpcSocketTxRxQueue
[ RUN ] Parameters/TestRpcSocketTxRxQueue.AcceptorRxQueueSizeMetric/0
I20260926 13:39:20.464676 861 acceptor_pool.cc:254] collecting diagnostics on the listening RPC socket 0.0.0.0:43599 every 1 connection(s)
I20260926 13:39:20.464897 862 acceptor_pool.cc:254] collecting diagnostics on the listening RPC socket 0.0.0.0:43599 every 1 connection(s)
W20260926 13:39:20.466321 857 negotiation.cc:337] Failed RPC negotiation. Trace:
0926 13:39:20.465975 (+ 0us) reactor.cc:625] Submitting negotiation task for server connection from 127.0.0.1:47472 (local address 127.0.0.1:43599)
0926 13:39:20.466101 (+ 126us) server_negotiation.cc:206] Beginning negotiation
0926 13:39:20.466106 (+ 5us) server_negotiation.cc:399] Waiting for connection header
0926 13:39:20.466213 (+ 107us) negotiation.cc:327] Negotiation complete: Network error: Server connection negotiation failed: server connection from 127.0.0.1:47472: BlockingRecv error: recv got EOF from 127.0.0.1:47472 (error 108)
Metrics: {"server-negotiator.queue_time_us":36}
[ OK ] Parameters/TestRpcSocketTxRxQueue.AcceptorRxQueueSizeMetric/0 (12 ms)
[----------] 1 test from Parameters/TestRpcSocketTxRxQueue (12 ms total)
[----------] Global test environment tear-down
[==========] 21 tests from 2 test suites ran. (48632 ms total)
[ PASSED ] 20 tests.
[ FAILED ] 1 test, listed below:
[ FAILED ] Parameters/TestRpc.TestCallWithChainCertAndChainCA/SSL_UnixSocket, where GetParam() = (true, true)
1 FAILED TEST