Diagnosed failure

Parameters/TestRpc.TestCallWithChainCertAndChainCA/SSL_TCP: /data0/somelongdirectorytoavoidrpathissues/src/kudu/src/kudu/rpc/rpc-test.cc:270: Failure
Failed
Bad status: Runtime error: could not verify certificate chain (error with cert: subject=CN = localhost, ST = sadfjas, C = AS, emailAddress = sdflkdsajf, O = lskdfjlsad, OU = sldfkja, issuer=C = AS, ST = ASDfkjdhf, L = lskdjf, O = saldfja, OU = skdjf, CN = localhost, emailAddress = sadjflkadsj): : certificate has expired
Google Test trace:
/data0/somelongdirectorytoavoidrpathissues/src/kudu/src/kudu/rpc/rpc-test.cc:267: Connecting to 0.0.0.0:42681
I20260927 09:48:34.086187   816 test_util.cc:175] -----------------------------------------------
I20260927 09:48:34.086256   816 test_util.cc:176] Had fatal failures, leaving test files at /tmp/dist-test-taskks3p4B/test-tmp/rpc-test.5.Parameters_TestRpc.TestCallWithChainCertAndChainCA_SSL_TCP.1790502514006192-816-0

Full log

Note: This is test shard 6 of 8.
[==========] Running 21 tests from 2 test suites.
[----------] Global test environment set-up.
[----------] 20 tests from Parameters/TestRpc
[ RUN      ] Parameters/TestRpc.TestMessengerCreateDestroy/SSL_TCP
WARNING: Logging before InitGoogleLogging() is written to STDERR
I20260927 09:48:34.034597   816 rpc-test.cc:169] started messenger TestCreateDestroy
[       OK ] Parameters/TestRpc.TestMessengerCreateDestroy/SSL_TCP (27 ms)
[ RUN      ] Parameters/TestRpc.TestNegotiationDeadlock/SSL_TCP
I20260927 09:48:34.042986   837 acceptor_pool.cc:254] collecting diagnostics on the listening RPC socket 0.0.0.0:37173 every 8 connection(s)
I20260927 09:48:34.043020   836 acceptor_pool.cc:254] collecting diagnostics on the listening RPC socket 0.0.0.0:37173 every 8 connection(s)
[       OK ] Parameters/TestRpc.TestNegotiationDeadlock/SSL_TCP (13 ms)
[ RUN      ] Parameters/TestRpc.TestCallWithChainCertAndChainCA/SSL_TCP
I20260927 09:48:34.082209   852 acceptor_pool.cc:254] collecting diagnostics on the listening RPC socket 0.0.0.0:42681 every 8 connection(s)
I20260927 09:48:34.082244   853 acceptor_pool.cc:254] collecting diagnostics on the listening RPC socket 0.0.0.0:42681 every 8 connection(s)
/data0/somelongdirectorytoavoidrpathissues/src/kudu/src/kudu/rpc/rpc-test.cc:270: Failure
Failed
Bad status: Runtime error: could not verify certificate chain (error with cert: subject=CN = localhost, ST = sadfjas, C = AS, emailAddress = sdflkdsajf, O = lskdfjlsad, OU = sldfkja, issuer=C = AS, ST = ASDfkjdhf, L = lskdjf, O = saldfja, OU = skdjf, CN = localhost, emailAddress = sadjflkadsj): : certificate has expired
Google Test trace:
/data0/somelongdirectorytoavoidrpathissues/src/kudu/src/kudu/rpc/rpc-test.cc:267: Connecting to 0.0.0.0:42681
I20260927 09:48:34.086187   816 test_util.cc:175] -----------------------------------------------
I20260927 09:48:34.086256   816 test_util.cc:176] Had fatal failures, leaving test files at /tmp/dist-test-taskks3p4B/test-tmp/rpc-test.5.Parameters_TestRpc.TestCallWithChainCertAndChainCA_SSL_TCP.1790502514006192-816-0
[  FAILED  ] Parameters/TestRpc.TestCallWithChainCertAndChainCA/SSL_TCP, where GetParam() = (true, false) (36 ms)
[ RUN      ] Parameters/TestRpc.TestCallWithPasswordProtectedKey/SSL_TCP
I20260927 09:48:34.108655   877 acceptor_pool.cc:254] collecting diagnostics on the listening RPC socket 0.0.0.0:42363 every 8 connection(s)
I20260927 09:48:34.108716   878 acceptor_pool.cc:254] collecting diagnostics on the listening RPC socket 0.0.0.0:42363 every 8 connection(s)
[       OK ] Parameters/TestRpc.TestCallWithPasswordProtectedKey/SSL_TCP (34 ms)
[ RUN      ] Parameters/TestRpc.TestCallToBadServer/SSL_TCP
I20260927 09:48:34.131882   816 rpc-test.cc:394] Status: Network error: Client connection negotiation failed: client connection to 0.0.0.0:0: connect: Connection refused (error 111)
I20260927 09:48:34.132211   816 rpc-test.cc:394] Status: Network error: Client connection negotiation failed: client connection to 0.0.0.0:0: connect: Connection refused (error 111)
I20260927 09:48:34.132550   816 rpc-test.cc:394] Status: Network error: Client connection negotiation failed: client connection to 0.0.0.0:0: connect: Connection refused (error 111)
I20260927 09:48:34.132797   816 rpc-test.cc:394] Status: Network error: Client connection negotiation failed: client connection to 0.0.0.0:0: connect: Connection refused (error 111)
I20260927 09:48:34.133037   816 rpc-test.cc:394] Status: Network error: Client connection negotiation failed: client connection to 0.0.0.0:0: connect: Connection refused (error 111)
[       OK ] Parameters/TestRpc.TestCallToBadServer/SSL_TCP (12 ms)
[ RUN      ] Parameters/TestRpc.TestWrongService/SSL_TCP
I20260927 09:48:34.172072   912 acceptor_pool.cc:254] collecting diagnostics on the listening RPC socket 0.0.0.0:42423 every 8 connection(s)
I20260927 09:48:34.172104   913 acceptor_pool.cc:254] collecting diagnostics on the listening RPC socket 0.0.0.0:42423 every 8 connection(s)
I20260927 09:48:34.195763   910 messenger.cc:345] service WrongServiceName not registered on TestServer
[       OK ] Parameters/TestRpc.TestWrongService/SSL_TCP (63 ms)
[ RUN      ] Parameters/TestRpc.TestConnectionKeepalive/SSL_TCP
I20260927 09:48:34.205209   935 acceptor_pool.cc:254] collecting diagnostics on the listening RPC socket 0.0.0.0:42507 every 8 connection(s)
I20260927 09:48:34.205257   936 acceptor_pool.cc:254] collecting diagnostics on the listening RPC socket 0.0.0.0:42507 every 8 connection(s)
I20260927 09:48:34.205406   816 rpc-test.cc:488] Connecting to 0.0.0.0:42507
[       OK ] Parameters/TestRpc.TestConnectionKeepalive/SSL_TCP (1023 ms)
[ RUN      ] Parameters/TestRpc.TestClientConnectionMetrics/SSL_TCP
I20260927 09:48:35.227960   960 acceptor_pool.cc:254] collecting diagnostics on the listening RPC socket 0.0.0.0:42573 every 8 connection(s)
I20260927 09:48:35.227998   961 acceptor_pool.cc:254] collecting diagnostics on the listening RPC socket 0.0.0.0:42573 every 8 connection(s)
I20260927 09:48:35.228161   816 rpc-test.cc:569] Connecting to 0.0.0.0:42573
[       OK ] Parameters/TestRpc.TestClientConnectionMetrics/SSL_TCP (10275 ms)
[ RUN      ] Parameters/TestRpc.TestCredentialsPolicy/SSL_TCP
I20260927 09:48:45.517122   983 acceptor_pool.cc:254] collecting diagnostics on the listening RPC socket 0.0.0.0:40187 every 8 connection(s)
I20260927 09:48:45.517167   984 acceptor_pool.cc:254] collecting diagnostics on the listening RPC socket 0.0.0.0:40187 every 8 connection(s)
I20260927 09:48:45.517350   816 rpc-test.cc:700] Connecting to 0.0.0.0:40187
[       OK ] Parameters/TestRpc.TestCredentialsPolicy/SSL_TCP (44 ms)
[ RUN      ] Parameters/TestRpc.TestCallLongerThanKeepalive/SSL_TCP
I20260927 09:48:45.552464  1008 acceptor_pool.cc:254] collecting diagnostics on the listening RPC socket 0.0.0.0:42011 every 8 connection(s)
I20260927 09:48:45.552523  1009 acceptor_pool.cc:254] collecting diagnostics on the listening RPC socket 0.0.0.0:42011 every 8 connection(s)
I20260927 09:48:45.570955  1012 rpc-test-base.h:222] got call: sleep_micros: 3000000 deferred: true
I20260927 09:48:48.571640  1012 rpcz_store.cc:275] Call kudu.rpc.GenericCalculatorService.Sleep from 127.0.0.1:56478 (request call id 0) took 3000 ms. Trace:
I20260927 09:48:48.571750  1012 rpcz_store.cc:276] 0927 09:48:45.570901 (+     0us) service_pool.cc:170] Inserting onto call queue
0927 09:48:45.570934 (+    33us) service_pool.cc:227] Handling call
0927 09:48:48.571623 (+3000689us) inbound_call.cc:173] Queueing success response
Metrics: {}
[       OK ] Parameters/TestRpc.TestCallLongerThanKeepalive/SSL_TCP (3032 ms)
[ RUN      ] Parameters/TestRpc.TestRpcSidecar/SSL_TCP
I20260927 09:48:48.591547  1033 acceptor_pool.cc:254] collecting diagnostics on the listening RPC socket 0.0.0.0:42263 every 8 connection(s)
I20260927 09:48:48.591607  1034 acceptor_pool.cc:254] collecting diagnostics on the listening RPC socket 0.0.0.0:42263 every 8 connection(s)
[       OK ] Parameters/TestRpc.TestRpcSidecar/SSL_TCP (63 ms)
[ RUN      ] Parameters/TestRpc.TestRpcSidecarLimits/SSL_TCP
I20260927 09:48:50.371342  1058 acceptor_pool.cc:254] collecting diagnostics on the listening RPC socket 0.0.0.0:33553 every 8 connection(s)
I20260927 09:48:50.371454  1059 acceptor_pool.cc:254] collecting diagnostics on the listening RPC socket 0.0.0.0:33553 every 8 connection(s)
W20260927 09:48:50.385241   816 serialization.cc:72] Serialized kudu.rpc_test.PushStringsRequestPB (2147483654 bytes) is larger than the maximum configured RPC message size (52428800 bytes). Sending anyway, but peer may reject the data.
W20260927 09:48:50.388512  1056 connection.cc:535] server connection from 127.0.0.1:56352 recv error: Network error: RPC frame had a length of 2147483714, but we only support messages up to 52428800 bytes long.
W20260927 09:48:50.388577  1056 connection.cc:158] shutting down server connection from 127.0.0.1:56352 with pending inbound data: 4/2147483714 bytes received; last active 0 ns ago: status Network error: RPC frame had a length of 2147483714, but we only support messages up to 52428800 bytes long.
W20260927 09:48:50.388813  1071 connection.cc:196] Error closing socket: Network error: TlsSocket::Close: Connection reset by peer
I20260927 09:48:50.398307  1083 acceptor_pool.cc:254] collecting diagnostics on the listening RPC socket 0.0.0.0:42777 every 8 connection(s)
I20260927 09:48:50.398376  1084 acceptor_pool.cc:254] collecting diagnostics on the listening RPC socket 0.0.0.0:42777 every 8 connection(s)
W20260927 09:48:54.224218  1081 connection.cc:577] server connection from 127.0.0.1:41442: received bad data: 'Corruption: Invalid packet: message had a length of 2147483710, but we only support messages up to 2147483647 bytes
'
[       OK ] Parameters/TestRpc.TestRpcSidecarLimits/SSL_TCP (5588 ms)
[ RUN      ] Parameters/TestRpc.TestCallTimeoutDoesntAffectNegotiation/SSL_TCP
I20260927 09:48:54.245712  1108 acceptor_pool.cc:254] collecting diagnostics on the listening RPC socket 0.0.0.0:44785 every 8 connection(s)
I20260927 09:48:54.245723  1109 acceptor_pool.cc:254] collecting diagnostics on the listening RPC socket 0.0.0.0:44785 every 8 connection(s)
W20260927 09:48:54.264734  1104 negotiation.cc:266] Injecting 500ms delay in negotiation
I20260927 09:48:54.314981   816 rpc-test-base.h:595] status: Timed out: connection negotiation to 0.0.0.0:44785 for RPC Sleep timed out after 0.050s (ON_OUTBOUND_QUEUE), seconds elapsed: 0.0506195
[       OK ] Parameters/TestRpc.TestCallTimeoutDoesntAffectNegotiation/SSL_TCP (543 ms)
[ RUN      ] Parameters/TestRpc.TestRpcHandlerLatencyMetric/SSL_TCP
I20260927 09:48:54.791546  1133 acceptor_pool.cc:254] collecting diagnostics on the listening RPC socket 0.0.0.0:41821 every 8 connection(s)
I20260927 09:48:54.791580  1134 acceptor_pool.cc:254] collecting diagnostics on the listening RPC socket 0.0.0.0:41821 every 8 connection(s)
I20260927 09:48:54.833233   816 rpc-test.cc:1236] Sleep() min lat: 20257
I20260927 09:48:54.833300   816 rpc-test.cc:1237] Sleep() mean lat: 20257
I20260927 09:48:54.833328   816 rpc-test.cc:1238] Sleep() max lat: 20257
I20260927 09:48:54.833341   816 rpc-test.cc:1239] Sleep() #calls: 1
[       OK ] Parameters/TestRpc.TestRpcHandlerLatencyMetric/SSL_TCP (65 ms)
[ RUN      ] Parameters/TestRpc.TimedOutOnResponseMetricServiceQueue/SSL_TCP
I20260927 09:48:54.854498  1159 acceptor_pool.cc:254] collecting diagnostics on the listening RPC socket 0.0.0.0:44679 every 8 connection(s)
I20260927 09:48:54.854524  1160 acceptor_pool.cc:254] collecting diagnostics on the listening RPC socket 0.0.0.0:44679 every 8 connection(s)
W20260927 09:48:54.911316  1161 rpcz_store.cc:267] Call kudu.rpc_test.CalculatorService.Sleep from 127.0.0.1:55872 (request call id 2) took 20 ms (client timeout 20 ms). Trace:
W20260927 09:48:54.911451  1161 rpcz_store.cc:269] 0927 09:48:54.891071 (+     0us) service_pool.cc:170] Inserting onto call queue
0927 09:48:54.911288 (+ 20217us) service_pool.cc:214] Skipping call since client already timed out
0927 09:48:54.911300 (+    12us) inbound_call.cc:173] Queueing failure response
Metrics: {}
[       OK ] Parameters/TestRpc.TimedOutOnResponseMetricServiceQueue/SSL_TCP (78 ms)
[ RUN      ] Parameters/TestRpc.RpcPendingConnectionsMetric/SSL_TCP
I20260927 09:48:54.914604  1182 acceptor_pool.cc:254] collecting diagnostics on the listening RPC socket 0.0.0.0:38841 every 8 connection(s)
I20260927 09:48:54.914677  1183 acceptor_pool.cc:254] collecting diagnostics on the listening RPC socket 0.0.0.0:38841 every 8 connection(s)
W20260927 09:48:54.923440  1178 negotiation.cc:337] Failed RPC negotiation. Trace:
0927 09:48:54.923144 (+     0us) reactor.cc:625] Submitting negotiation task for server connection from 127.0.0.1:42988 (local address 127.0.0.1:38841)
0927 09:48:54.923227 (+    83us) server_negotiation.cc:206] Beginning negotiation
0927 09:48:54.923229 (+     2us) server_negotiation.cc:399] Waiting for connection header
0927 09:48:54.923332 (+   103us) negotiation.cc:327] Negotiation complete: Network error: Server connection negotiation failed: server connection from 127.0.0.1:42988: BlockingRecv error: recv got EOF from 127.0.0.1:42988 (error 108)
Metrics: {"server-negotiator.queue_time_us":22}
[       OK ] Parameters/TestRpc.RpcPendingConnectionsMetric/SSL_TCP (21 ms)
[ RUN      ] Parameters/TestRpc.TestRpcContextClientDeadline/SSL_TCP
I20260927 09:48:54.962163  1198 acceptor_pool.cc:254] collecting diagnostics on the listening RPC socket 0.0.0.0:38619 every 8 connection(s)
I20260927 09:48:54.962203  1199 acceptor_pool.cc:254] collecting diagnostics on the listening RPC socket 0.0.0.0:38619 every 8 connection(s)
[       OK ] Parameters/TestRpc.TestRpcContextClientDeadline/SSL_TCP (68 ms)
[ RUN      ] Parameters/TestRpc.TestApplicationFeatureFlagUnsupportedServer/SSL_TCP
I20260927 09:48:55.020550  1224 acceptor_pool.cc:254] collecting diagnostics on the listening RPC socket 0.0.0.0:44747 every 8 connection(s)
I20260927 09:48:55.020514  1223 acceptor_pool.cc:254] collecting diagnostics on the listening RPC socket 0.0.0.0:44747 every 8 connection(s)
[       OK ] Parameters/TestRpc.TestApplicationFeatureFlagUnsupportedServer/SSL_TCP (36 ms)
[ RUN      ] Parameters/TestRpc.TestCancellationAsync/SSL_TCP
I20260927 09:48:55.048513  1248 acceptor_pool.cc:254] collecting diagnostics on the listening RPC socket 0.0.0.0:41819 every 8 connection(s)
I20260927 09:48:55.048565  1249 acceptor_pool.cc:254] collecting diagnostics on the listening RPC socket 0.0.0.0:41819 every 8 connection(s)
I20260927 09:48:55.048729   816 rpc-test.cc:1716] Connecting to 0.0.0.0:41819
I20260927 09:48:55.084901   816 test_util.cc:268] Using random seed: -611140766
I20260927 09:48:55.104386  1252 rpc-test-base.h:240] got call: sleep_micros: 500 pattern: 4294967295 num_repetitions: 2097152 sidecar_idx: 0
I20260927 09:48:55.120529  1252 rpc-test-base.h:240] got call: sleep_micros: 500 pattern: 4294967295 num_repetitions: 2097152 sidecar_idx: 0
I20260927 09:48:55.136041  1252 rpc-test-base.h:240] got call: sleep_micros: 500 pattern: 4294967295 num_repetitions: 2097152 sidecar_idx: 0
I20260927 09:48:55.150245  1252 rpc-test-base.h:240] got call: sleep_micros: 500 pattern: 4294967295 num_repetitions: 2097152 sidecar_idx: 0
I20260927 09:48:55.167809  1252 rpc-test-base.h:240] got call: sleep_micros: 500 pattern: 4294967295 num_repetitions: 2097152 sidecar_idx: 0
I20260927 09:48:55.184417  1252 rpc-test-base.h:240] got call: sleep_micros: 500 pattern: 4294967295 num_repetitions: 2097152 sidecar_idx: 0
I20260927 09:48:55.196280  1252 rpc-test-base.h:240] got call: sleep_micros: 500 pattern: 4294967295 num_repetitions: 2097152 sidecar_idx: 0
I20260927 09:48:55.207525  1252 rpc-test-base.h:240] got call: sleep_micros: 500 pattern: 4294967295 num_repetitions: 2097152 sidecar_idx: 0
W20260927 09:48:55.210613  1245 connection.cc:441] server connection from 127.0.0.1:45998 torn down before Call kudu.rpc.GenericCalculatorService.SleepWithSidecar from 127.0.0.1:45998 (request call id 9) could send its response
[       OK ] Parameters/TestRpc.TestCancellationAsync/SSL_TCP (171 ms)
[ RUN      ] Parameters/TestRpc.TestPerformanceBySocketType/SSL_TCP
I20260927 09:48:55.224002  1273 acceptor_pool.cc:254] collecting diagnostics on the listening RPC socket 0.0.0.0:40549 every 8 connection(s)
I20260927 09:48:55.224068  1274 acceptor_pool.cc:254] collecting diagnostics on the listening RPC socket 0.0.0.0:40549 every 8 connection(s)
I20260927 09:48:55.224207   816 rpc-test.cc:1846] Connecting to 0.0.0.0:40549
I20260927 09:48:56.883031   816 rpc-test.cc:1859] Sending 1024MB via ssl-enabled tcp socket: real 1.633s	user 1.359s	sys 1.553s
I20260927 09:48:58.443449   816 rpc-test.cc:1859] Sending 1024MB via ssl-enabled tcp socket: real 1.560s	user 1.410s	sys 1.363s
I20260927 09:49:00.080911   816 rpc-test.cc:1859] Sending 1024MB via ssl-enabled tcp socket: real 1.637s	user 1.451s	sys 1.464s
I20260927 09:49:01.642522   816 rpc-test.cc:1859] Sending 1024MB via ssl-enabled tcp socket: real 1.562s	user 1.412s	sys 1.387s
I20260927 09:49:03.301252   816 rpc-test.cc:1859] Sending 1024MB via ssl-enabled tcp socket: real 1.659s	user 1.397s	sys 1.559s
[       OK ] Parameters/TestRpc.TestPerformanceBySocketType/SSL_TCP (8091 ms)
[----------] 20 tests from Parameters/TestRpc (29294 ms total)

[----------] 1 test from Parameters/TestRpcSocketTxRxQueue
[ RUN      ] Parameters/TestRpcSocketTxRxQueue.OverCapacity/0
W20260927 09:49:03.577135  1290 negotiation.cc:337] Failed RPC negotiation. Trace:
0927 09:49:03.313103 (+     0us) reactor.cc:625] Submitting negotiation task for client connection to 0.0.0.0:43605 (local address 127.0.0.1:45732)
0927 09:49:03.313141 (+    38us) negotiation.cc:107] Waiting for socket to connect
0927 09:49:03.313151 (+    10us) client_negotiation.cc:174] Beginning negotiation
0927 09:49:03.313200 (+    49us) client_negotiation.cc:252] Sending NEGOTIATE NegotiatePB request
0927 09:49:03.577003 (+263803us) negotiation.cc:327] Negotiation complete: Network error: Client connection negotiation failed: client connection to 0.0.0.0:43605: BlockingRecv error: recv error from unknown peer: Transport endpoint is not connected (error 107)
Metrics: {"client-negotiator.queue_time_us":18}
W20260927 09:49:03.577157  1326 negotiation.cc:337] Failed RPC negotiation. Trace:
0927 09:49:03.316762 (+     0us) reactor.cc:625] Submitting negotiation task for client connection to 0.0.0.0:43605 (local address 127.0.0.1:45792)
0927 09:49:03.316814 (+    52us) negotiation.cc:107] Waiting for socket to connect
0927 09:49:03.316823 (+     9us) client_negotiation.cc:174] Beginning negotiation
0927 09:49:03.316862 (+    39us) client_negotiation.cc:252] Sending NEGOTIATE NegotiatePB request
0927 09:49:03.577037 (+260175us) negotiation.cc:327] Negotiation complete: Network error: Client connection negotiation failed: client connection to 0.0.0.0:43605: BlockingRecv error: recv error from unknown peer: Transport endpoint is not connected (error 107)
Metrics: {"client-negotiator.queue_time_us":32}
W20260927 09:49:03.577343  1335 negotiation.cc:337] Failed RPC negotiation. Trace:
0927 09:49:03.317654 (+     0us) reactor.cc:625] Submitting negotiation task for client connection to 0.0.0.0:43605 (local address 127.0.0.1:45798)
0927 09:49:03.317706 (+    52us) negotiation.cc:107] Waiting for socket to connect
0927 09:49:03.317714 (+     8us) client_negotiation.cc:174] Beginning negotiation
0927 09:49:03.317752 (+    38us) client_negotiation.cc:252] Sending NEGOTIATE NegotiatePB request
0927 09:49:03.577030 (+259278us) negotiation.cc:327] Negotiation complete: Network error: Client connection negotiation failed: client connection to 0.0.0.0:43605: BlockingRecv error: recv error from unknown peer: Transport endpoint is not connected (error 107)
Metrics: {"client-negotiator.queue_time_us":33}
W20260927 09:49:03.577441  1299 negotiation.cc:337] Failed RPC negotiation. Trace:
0927 09:49:03.313993 (+     0us) reactor.cc:625] Submitting negotiation task for client connection to 0.0.0.0:43605 (local address 127.0.0.1:45748)
0927 09:49:03.314052 (+    59us) negotiation.cc:107] Waiting for socket to connect
0927 09:49:03.314061 (+     9us) client_negotiation.cc:174] Beginning negotiation
0927 09:49:03.314104 (+    43us) client_negotiation.cc:252] Sending NEGOTIATE NegotiatePB request
0927 09:49:03.577323 (+263219us) negotiation.cc:327] Negotiation complete: Network error: Client connection negotiation failed: client connection to 0.0.0.0:43605: BlockingRecv error: recv error from unknown peer: Transport endpoint is not connected (error 107)
Metrics: {"client-negotiator.queue_time_us":35}
W20260927 09:49:03.577515  1308 negotiation.cc:337] Failed RPC negotiation. Trace:
0927 09:49:03.314884 (+     0us) reactor.cc:625] Submitting negotiation task for client connection to 0.0.0.0:43605 (local address 127.0.0.1:45764)
0927 09:49:03.314936 (+    52us) negotiation.cc:107] Waiting for socket to connect
0927 09:49:03.314945 (+     9us) client_negotiation.cc:174] Beginning negotiation
0927 09:49:03.314983 (+    38us) client_negotiation.cc:252] Sending NEGOTIATE NegotiatePB request
0927 09:49:03.577475 (+262492us) negotiation.cc:327] Negotiation complete: Network error: Client connection negotiation failed: client connection to 0.0.0.0:43605: BlockingRecv error: recv error from unknown peer: Transport endpoint is not connected (error 107)
Metrics: {"client-negotiator.queue_time_us":32}
W20260927 09:49:03.577620  1317 negotiation.cc:337] Failed RPC negotiation. Trace:
0927 09:49:03.315886 (+     0us) reactor.cc:625] Submitting negotiation task for client connection to 0.0.0.0:43605 (local address 127.0.0.1:45776)
0927 09:49:03.315936 (+    50us) negotiation.cc:107] Waiting for socket to connect
0927 09:49:03.315945 (+     9us) client_negotiation.cc:174] Beginning negotiation
0927 09:49:03.315988 (+    43us) client_negotiation.cc:252] Sending NEGOTIATE NegotiatePB request
0927 09:49:03.577571 (+261583us) negotiation.cc:327] Negotiation complete: Network error: Client connection negotiation failed: client connection to 0.0.0.0:43605: BlockingRecv error: recv error from unknown peer: Transport endpoint is not connected (error 107)
Metrics: {"client-negotiator.queue_time_us":31}
[       OK ] Parameters/TestRpcSocketTxRxQueue.OverCapacity/0 (1054 ms)
[----------] 1 test from Parameters/TestRpcSocketTxRxQueue (1054 ms total)

[----------] Global test environment tear-down
[==========] 21 tests from 2 test suites ran. (30348 ms total)
[  PASSED  ] 20 tests.
[  FAILED  ] 1 test, listed below:
[  FAILED  ] Parameters/TestRpc.TestCallWithChainCertAndChainCA/SSL_TCP, where GetParam() = (true, false)

 1 FAILED TEST