Diagnosed failure

Parameters/TestRpc.TestCallWithChainCertAndChainCA/SSL_UnixSocket: /data0/somelongdirectorytoavoidrpathissues/src/kudu/src/kudu/rpc/rpc-test.cc:270: Failure
Failed
Bad status: Runtime error: could not verify certificate chain (error with cert: subject=CN = localhost, ST = sadfjas, C = AS, emailAddress = sdflkdsajf, O = lskdfjlsad, OU = sldfkja, issuer=C = AS, ST = ASDfkjdhf, L = lskdjf, O = saldfja, OU = skdjf, CN = localhost, emailAddress = sadjflkadsj): : certificate has expired
Google Test trace:
/data0/somelongdirectorytoavoidrpathissues/src/kudu/src/kudu/rpc/rpc-test.cc:267: Connecting to unix:/tmp/dist-test-tasksRwAfX/test-tmp/rpc-test-3dbbad0822ee412598650782611644b5.sock
I20260929 03:05:19.662077 13183 test_util.cc:175] -----------------------------------------------
I20260929 03:05:19.662129 13183 test_util.cc:176] Had fatal failures, leaving test files at /tmp/dist-test-tasksRwAfX/test-tmp/rpc-test.6.Parameters_TestRpc.TestCallWithChainCertAndChainCA_SSL_UnixSocket.1790651119587119-13183-0

Full log

Note: This is test shard 7 of 8.
[==========] Running 21 tests from 2 test suites.
[----------] Global test environment set-up.
[----------] 20 tests from Parameters/TestRpc
[ RUN      ] Parameters/TestRpc.TestMessengerCreateDestroy/SSL_UnixSocket
WARNING: Logging before InitGoogleLogging() is written to STDERR
I20260929 03:05:19.617076 13183 rpc-test.cc:169] started messenger TestCreateDestroy
[       OK ] Parameters/TestRpc.TestMessengerCreateDestroy/SSL_UnixSocket (25 ms)
[ RUN      ] Parameters/TestRpc.TestNegotiationDeadlock/SSL_UnixSocket
I20260929 03:05:19.631503 13203 acceptor_pool.cc:254] collecting diagnostics on the listening RPC socket unix:/tmp/dist-test-tasksRwAfX/test-tmp/rpc-test-4c73ee302aa64a52b389da519cd5ee51.sock every 8 connection(s)
I20260929 03:05:19.631547 13204 acceptor_pool.cc:254] collecting diagnostics on the listening RPC socket unix:/tmp/dist-test-tasksRwAfX/test-tmp/rpc-test-4c73ee302aa64a52b389da519cd5ee51.sock every 8 connection(s)
[       OK ] Parameters/TestRpc.TestNegotiationDeadlock/SSL_UnixSocket (23 ms)
[ RUN      ] Parameters/TestRpc.TestCallWithChainCertAndChainCA/SSL_UnixSocket
I20260929 03:05:19.657168 13219 acceptor_pool.cc:254] collecting diagnostics on the listening RPC socket unix:/tmp/dist-test-tasksRwAfX/test-tmp/rpc-test-3dbbad0822ee412598650782611644b5.sock every 8 connection(s)
I20260929 03:05:19.657215 13220 acceptor_pool.cc:254] collecting diagnostics on the listening RPC socket unix:/tmp/dist-test-tasksRwAfX/test-tmp/rpc-test-3dbbad0822ee412598650782611644b5.sock every 8 connection(s)
/data0/somelongdirectorytoavoidrpathissues/src/kudu/src/kudu/rpc/rpc-test.cc:270: Failure
Failed
Bad status: Runtime error: could not verify certificate chain (error with cert: subject=CN = localhost, ST = sadfjas, C = AS, emailAddress = sdflkdsajf, O = lskdfjlsad, OU = sldfkja, issuer=C = AS, ST = ASDfkjdhf, L = lskdjf, O = saldfja, OU = skdjf, CN = localhost, emailAddress = sadjflkadsj): : certificate has expired
Google Test trace:
/data0/somelongdirectorytoavoidrpathissues/src/kudu/src/kudu/rpc/rpc-test.cc:267: Connecting to unix:/tmp/dist-test-tasksRwAfX/test-tmp/rpc-test-3dbbad0822ee412598650782611644b5.sock
I20260929 03:05:19.662077 13183 test_util.cc:175] -----------------------------------------------
I20260929 03:05:19.662129 13183 test_util.cc:176] Had fatal failures, leaving test files at /tmp/dist-test-tasksRwAfX/test-tmp/rpc-test.6.Parameters_TestRpc.TestCallWithChainCertAndChainCA_SSL_UnixSocket.1790651119587119-13183-0
[  FAILED  ] Parameters/TestRpc.TestCallWithChainCertAndChainCA/SSL_UnixSocket, where GetParam() = (true, true) (20 ms)
[ RUN      ] Parameters/TestRpc.TestCallWithPasswordProtectedKey/SSL_UnixSocket
I20260929 03:05:19.668145 13244 acceptor_pool.cc:254] collecting diagnostics on the listening RPC socket unix:/tmp/dist-test-tasksRwAfX/test-tmp/rpc-test-0ee5294fb9a64acfa0223ed7854c26d3.sock every 8 connection(s)
I20260929 03:05:19.668193 13245 acceptor_pool.cc:254] collecting diagnostics on the listening RPC socket unix:/tmp/dist-test-tasksRwAfX/test-tmp/rpc-test-0ee5294fb9a64acfa0223ed7854c26d3.sock every 8 connection(s)
W20260929 03:05:19.681102 13241 connection.cc:196] Error closing socket: Network error: TlsSocket::Close: Broken pipe
[       OK ] Parameters/TestRpc.TestCallWithPasswordProtectedKey/SSL_UnixSocket (20 ms)
[ RUN      ] Parameters/TestRpc.TestCallToBadServer/SSL_UnixSocket
I20260929 03:05:19.709533 13183 rpc-test.cc:394] Status: Network error: Client connection negotiation failed: client connection to 0.0.0.0:0: connect: Connection refused (error 111)
I20260929 03:05:19.710009 13183 rpc-test.cc:394] Status: Network error: Client connection negotiation failed: client connection to 0.0.0.0:0: connect: Connection refused (error 111)
I20260929 03:05:19.710413 13183 rpc-test.cc:394] Status: Network error: Client connection negotiation failed: client connection to 0.0.0.0:0: connect: Connection refused (error 111)
I20260929 03:05:19.710767 13183 rpc-test.cc:394] Status: Network error: Client connection negotiation failed: client connection to 0.0.0.0:0: connect: Connection refused (error 111)
I20260929 03:05:19.711225 13183 rpc-test.cc:394] Status: Network error: Client connection negotiation failed: client connection to 0.0.0.0:0: connect: Connection refused (error 111)
[       OK ] Parameters/TestRpc.TestCallToBadServer/SSL_UnixSocket (29 ms)
[ RUN      ] Parameters/TestRpc.TestWrongService/SSL_UnixSocket
I20260929 03:05:19.721549 13279 acceptor_pool.cc:254] collecting diagnostics on the listening RPC socket unix:/tmp/dist-test-tasksRwAfX/test-tmp/rpc-test-95d32aed7e0d47daba0197f6525bb658.sock every 8 connection(s)
I20260929 03:05:19.721601 13280 acceptor_pool.cc:254] collecting diagnostics on the listening RPC socket unix:/tmp/dist-test-tasksRwAfX/test-tmp/rpc-test-95d32aed7e0d47daba0197f6525bb658.sock every 8 connection(s)
I20260929 03:05:19.737311 13276 messenger.cc:345] service WrongServiceName not registered on TestServer
[       OK ] Parameters/TestRpc.TestWrongService/SSL_UnixSocket (27 ms)
[ RUN      ] Parameters/TestRpc.TestConnectionKeepalive/SSL_UnixSocket
I20260929 03:05:19.773739 13302 acceptor_pool.cc:254] collecting diagnostics on the listening RPC socket unix:/tmp/dist-test-tasksRwAfX/test-tmp/rpc-test-449fe19e0e78430ebd22af743dc2537d.sock every 8 connection(s)
I20260929 03:05:19.773800 13303 acceptor_pool.cc:254] collecting diagnostics on the listening RPC socket unix:/tmp/dist-test-tasksRwAfX/test-tmp/rpc-test-449fe19e0e78430ebd22af743dc2537d.sock every 8 connection(s)
I20260929 03:05:19.774102 13183 rpc-test.cc:488] Connecting to unix:/tmp/dist-test-tasksRwAfX/test-tmp/rpc-test-449fe19e0e78430ebd22af743dc2537d.sock
W20260929 03:05:20.241601 13315 connection.cc:196] Error closing socket: Network error: TlsSocket::Close: Broken pipe
[       OK ] Parameters/TestRpc.TestConnectionKeepalive/SSL_UnixSocket (1051 ms)
[ RUN      ] Parameters/TestRpc.TestClientConnectionMetrics/SSL_UnixSocket
I20260929 03:05:20.809861 13327 acceptor_pool.cc:254] collecting diagnostics on the listening RPC socket unix:/tmp/dist-test-tasksRwAfX/test-tmp/rpc-test-471151b755414856b5db50a5ad688876.sock every 8 connection(s)
I20260929 03:05:20.809896 13328 acceptor_pool.cc:254] collecting diagnostics on the listening RPC socket unix:/tmp/dist-test-tasksRwAfX/test-tmp/rpc-test-471151b755414856b5db50a5ad688876.sock every 8 connection(s)
I20260929 03:05:20.810170 13183 rpc-test.cc:569] Connecting to unix:/tmp/dist-test-tasksRwAfX/test-tmp/rpc-test-471151b755414856b5db50a5ad688876.sock
W20260929 03:05:30.796015 13324 connection.cc:196] Error closing socket: Network error: TlsSocket::Close: Broken pipe
[       OK ] Parameters/TestRpc.TestClientConnectionMetrics/SSL_UnixSocket (10006 ms)
[ RUN      ] Parameters/TestRpc.TestCredentialsPolicy/SSL_UnixSocket
I20260929 03:05:30.811604 13350 acceptor_pool.cc:254] collecting diagnostics on the listening RPC socket unix:/tmp/dist-test-tasksRwAfX/test-tmp/rpc-test-f5128cf3ed284ffaa77faebb3f451bd8.sock every 8 connection(s)
I20260929 03:05:30.811730 13351 acceptor_pool.cc:254] collecting diagnostics on the listening RPC socket unix:/tmp/dist-test-tasksRwAfX/test-tmp/rpc-test-f5128cf3ed284ffaa77faebb3f451bd8.sock every 8 connection(s)
I20260929 03:05:30.811996 13183 rpc-test.cc:700] Connecting to unix:/tmp/dist-test-tasksRwAfX/test-tmp/rpc-test-f5128cf3ed284ffaa77faebb3f451bd8.sock
W20260929 03:05:30.846120 13349 connection.cc:196] Error closing socket: Network error: TlsSocket::Close: Broken pipe
W20260929 03:05:30.851003 13349 connection.cc:196] Error closing socket: Network error: TlsSocket::Close: Broken pipe
[       OK ] Parameters/TestRpc.TestCredentialsPolicy/SSL_UnixSocket (54 ms)
[ RUN      ] Parameters/TestRpc.TestCallLongerThanKeepalive/SSL_UnixSocket
I20260929 03:05:30.865197 13375 acceptor_pool.cc:254] collecting diagnostics on the listening RPC socket unix:/tmp/dist-test-tasksRwAfX/test-tmp/rpc-test-0c10f654e7e348689ef90ffd12b4d50e.sock every 8 connection(s)
I20260929 03:05:30.865238 13376 acceptor_pool.cc:254] collecting diagnostics on the listening RPC socket unix:/tmp/dist-test-tasksRwAfX/test-tmp/rpc-test-0c10f654e7e348689ef90ffd12b4d50e.sock every 8 connection(s)
I20260929 03:05:30.879129 13379 rpc-test-base.h:222] got call: sleep_micros: 3000000 deferred: true
I20260929 03:05:33.879969 13379 rpcz_store.cc:275] Call kudu.rpc.GenericCalculatorService.Sleep from unix:<unnamed> (request call id 0) took 3000 ms. Trace:
I20260929 03:05:33.880076 13379 rpcz_store.cc:276] 0929 03:05:30.879048 (+     0us) service_pool.cc:170] Inserting onto call queue
0929 03:05:30.879099 (+    51us) service_pool.cc:227] Handling call
0929 03:05:33.879948 (+3000849us) inbound_call.cc:173] Queueing success response
Metrics: {}
W20260929 03:05:33.881633 13372 connection.cc:196] Error closing socket: Network error: TlsSocket::Close: Broken pipe
[       OK ] Parameters/TestRpc.TestCallLongerThanKeepalive/SSL_UnixSocket (3031 ms)
[ RUN      ] Parameters/TestRpc.TestRpcSidecar/SSL_UnixSocket
I20260929 03:05:33.891543 13400 acceptor_pool.cc:254] collecting diagnostics on the listening RPC socket unix:/tmp/dist-test-tasksRwAfX/test-tmp/rpc-test-0a75a4e6227c41c0a98e028debb63e07.sock every 8 connection(s)
I20260929 03:05:33.891700 13401 acceptor_pool.cc:254] collecting diagnostics on the listening RPC socket unix:/tmp/dist-test-tasksRwAfX/test-tmp/rpc-test-0a75a4e6227c41c0a98e028debb63e07.sock every 8 connection(s)
W20260929 03:05:33.945950 13397 connection.cc:196] Error closing socket: Network error: TlsSocket::Close: Broken pipe
[       OK ] Parameters/TestRpc.TestRpcSidecar/SSL_UnixSocket (63 ms)
[ RUN      ] Parameters/TestRpc.TestRpcSidecarLimits/SSL_UnixSocket
I20260929 03:05:35.675820 13425 acceptor_pool.cc:254] collecting diagnostics on the listening RPC socket unix:/tmp/dist-test-tasksRwAfX/test-tmp/rpc-test-8f87ff9027a2444cae2691eef2f643ea.sock every 8 connection(s)
I20260929 03:05:35.675868 13426 acceptor_pool.cc:254] collecting diagnostics on the listening RPC socket unix:/tmp/dist-test-tasksRwAfX/test-tmp/rpc-test-8f87ff9027a2444cae2691eef2f643ea.sock every 8 connection(s)
W20260929 03:05:35.697384 13183 serialization.cc:72] Serialized kudu.rpc_test.PushStringsRequestPB (2147483654 bytes) is larger than the maximum configured RPC message size (52428800 bytes). Sending anyway, but peer may reject the data.
W20260929 03:05:35.701503 13422 connection.cc:535] server connection from unix:<unnamed> recv error: Network error: RPC frame had a length of 2147483714, but we only support messages up to 52428800 bytes long.
W20260929 03:05:35.701592 13422 connection.cc:158] shutting down server connection from unix:<unnamed> with pending inbound data: 4/2147483714 bytes received; last active 0 ns ago: status Network error: RPC frame had a length of 2147483714, but we only support messages up to 52428800 bytes long.
W20260929 03:05:35.701849 13438 connection.cc:196] Error closing socket: Network error: TlsSocket::Close: Broken pipe
I20260929 03:05:35.723568 13450 acceptor_pool.cc:254] collecting diagnostics on the listening RPC socket unix:/tmp/dist-test-tasksRwAfX/test-tmp/rpc-test-8f87ff9027a2444cae2691eef2f643ea.sock every 8 connection(s)
I20260929 03:05:35.723702 13451 acceptor_pool.cc:254] collecting diagnostics on the listening RPC socket unix:/tmp/dist-test-tasksRwAfX/test-tmp/rpc-test-8f87ff9027a2444cae2691eef2f643ea.sock every 8 connection(s)
W20260929 03:05:40.621026 13447 connection.cc:577] server connection from unix:<unnamed>: received bad data: 'Corruption: Invalid packet: message had a length of 2147483710, but we only support messages up to 2147483647 bytes
'
W20260929 03:05:40.621337 13463 connection.cc:196] Error closing socket: Network error: TlsSocket::Close: Broken pipe
[       OK ] Parameters/TestRpc.TestRpcSidecarLimits/SSL_UnixSocket (6676 ms)
[ RUN      ] Parameters/TestRpc.TestCallTimeoutDoesntAffectNegotiation/SSL_UnixSocket
I20260929 03:05:40.641518 13475 acceptor_pool.cc:254] collecting diagnostics on the listening RPC socket unix:/tmp/dist-test-tasksRwAfX/test-tmp/rpc-test-454261abc4ee4ae4a43617a89c1ffe84.sock every 8 connection(s)
I20260929 03:05:40.641645 13476 acceptor_pool.cc:254] collecting diagnostics on the listening RPC socket unix:/tmp/dist-test-tasksRwAfX/test-tmp/rpc-test-454261abc4ee4ae4a43617a89c1ffe84.sock every 8 connection(s)
W20260929 03:05:40.654450 13471 negotiation.cc:266] Injecting 500ms delay in negotiation
I20260929 03:05:40.704815 13183 rpc-test-base.h:595] status: Timed out: connection negotiation to unix:/tmp/dist-test-tasksRwAfX/test-tmp/rpc-test-454261abc4ee4ae4a43617a89c1ffe84.sock for RPC Sleep timed out after 0.050s (ON_OUTBOUND_QUEUE), seconds elapsed: 0.0508347
W20260929 03:05:41.159752 13472 connection.cc:196] Error closing socket: Network error: TlsSocket::Close: Broken pipe
[       OK ] Parameters/TestRpc.TestCallTimeoutDoesntAffectNegotiation/SSL_UnixSocket (538 ms)
[ RUN      ] Parameters/TestRpc.TestRpcHandlerLatencyMetric/SSL_UnixSocket
I20260929 03:05:41.173708 13500 acceptor_pool.cc:254] collecting diagnostics on the listening RPC socket unix:/tmp/dist-test-tasksRwAfX/test-tmp/rpc-test-c634f9088e8e4e2da6ea1c2fd45893a5.sock every 8 connection(s)
I20260929 03:05:41.173743 13501 acceptor_pool.cc:254] collecting diagnostics on the listening RPC socket unix:/tmp/dist-test-tasksRwAfX/test-tmp/rpc-test-c634f9088e8e4e2da6ea1c2fd45893a5.sock every 8 connection(s)
I20260929 03:05:41.220853 13183 rpc-test.cc:1236] Sleep() min lat: 20381
I20260929 03:05:41.220985 13183 rpc-test.cc:1237] Sleep() mean lat: 20381
I20260929 03:05:41.221040 13183 rpc-test.cc:1238] Sleep() max lat: 20381
I20260929 03:05:41.221071 13183 rpc-test.cc:1239] Sleep() #calls: 1
W20260929 03:05:41.221923 13497 connection.cc:196] Error closing socket: Network error: TlsSocket::Close: Broken pipe
[       OK ] Parameters/TestRpc.TestRpcHandlerLatencyMetric/SSL_UnixSocket (61 ms)
[ RUN      ] Parameters/TestRpc.TimedOutOnResponseMetricServiceQueue/SSL_UnixSocket
I20260929 03:05:41.236248 13526 acceptor_pool.cc:254] collecting diagnostics on the listening RPC socket unix:/tmp/dist-test-tasksRwAfX/test-tmp/rpc-test-9ca461bb3693489b86e3c6f4b61f17a5.sock every 8 connection(s)
I20260929 03:05:41.236280 13527 acceptor_pool.cc:254] collecting diagnostics on the listening RPC socket unix:/tmp/dist-test-tasksRwAfX/test-tmp/rpc-test-9ca461bb3693489b86e3c6f4b61f17a5.sock every 8 connection(s)
W20260929 03:05:41.294798 13528 rpcz_store.cc:267] Call kudu.rpc_test.CalculatorService.Sleep from unix:<unnamed> (request call id 2) took 20 ms (client timeout 20 ms). Trace:
W20260929 03:05:41.294886 13528 rpcz_store.cc:269] 0929 03:05:41.274437 (+     0us) service_pool.cc:170] Inserting onto call queue
0929 03:05:41.294750 (+ 20313us) service_pool.cc:214] Skipping call since client already timed out
0929 03:05:41.294780 (+    30us) inbound_call.cc:173] Queueing failure response
Metrics: {}
[       OK ] Parameters/TestRpc.TimedOutOnResponseMetricServiceQueue/SSL_UnixSocket (73 ms)
[ RUN      ] Parameters/TestRpc.RpcPendingConnectionsMetric/SSL_UnixSocket
I20260929 03:05:41.299068 13549 acceptor_pool.cc:254] collecting diagnostics on the listening RPC socket 0.0.0.0:37457 every 8 connection(s)
I20260929 03:05:41.299125 13550 acceptor_pool.cc:254] collecting diagnostics on the listening RPC socket 0.0.0.0:37457 every 8 connection(s)
W20260929 03:05:41.300240 13545 negotiation.cc:337] Failed RPC negotiation. Trace:
0929 03:05:41.299851 (+     0us) reactor.cc:625] Submitting negotiation task for server connection from 127.0.0.1:53670 (local address 127.0.0.1:37457)
0929 03:05:41.299950 (+    99us) server_negotiation.cc:206] Beginning negotiation
0929 03:05:41.299954 (+     4us) server_negotiation.cc:399] Waiting for connection header
0929 03:05:41.300048 (+    94us) negotiation.cc:327] Negotiation complete: Network error: Server connection negotiation failed: server connection from 127.0.0.1:53670: BlockingRecv error: recv got EOF from 127.0.0.1:53670 (error 108)
Metrics: {"server-negotiator.queue_time_us":39}
[       OK ] Parameters/TestRpc.RpcPendingConnectionsMetric/SSL_UnixSocket (14 ms)
[ RUN      ] Parameters/TestRpc.TestRpcContextClientDeadline/SSL_UnixSocket
I20260929 03:05:41.329046 13565 acceptor_pool.cc:254] collecting diagnostics on the listening RPC socket unix:/tmp/dist-test-tasksRwAfX/test-tmp/rpc-test-f9325f64a2724f3289d6334e4c4c5382.sock every 8 connection(s)
I20260929 03:05:41.329082 13566 acceptor_pool.cc:254] collecting diagnostics on the listening RPC socket unix:/tmp/dist-test-tasksRwAfX/test-tmp/rpc-test-f9325f64a2724f3289d6334e4c4c5382.sock every 8 connection(s)
[       OK ] Parameters/TestRpc.TestRpcContextClientDeadline/SSL_UnixSocket (56 ms)
[ RUN      ] Parameters/TestRpc.TestApplicationFeatureFlagUnsupportedServer/SSL_UnixSocket
I20260929 03:05:41.377388 13590 acceptor_pool.cc:254] collecting diagnostics on the listening RPC socket unix:/tmp/dist-test-tasksRwAfX/test-tmp/rpc-test-cb6d2f8503aa47fda67330abd8eef5a3.sock every 8 connection(s)
I20260929 03:05:41.377462 13591 acceptor_pool.cc:254] collecting diagnostics on the listening RPC socket unix:/tmp/dist-test-tasksRwAfX/test-tmp/rpc-test-cb6d2f8503aa47fda67330abd8eef5a3.sock every 8 connection(s)
[       OK ] Parameters/TestRpc.TestApplicationFeatureFlagUnsupportedServer/SSL_UnixSocket (29 ms)
[ RUN      ] Parameters/TestRpc.TestCancellationAsync/SSL_UnixSocket
I20260929 03:05:41.409312 13615 acceptor_pool.cc:254] collecting diagnostics on the listening RPC socket unix:/tmp/dist-test-tasksRwAfX/test-tmp/rpc-test-7931f7b7fb334b0faab9becccf57a380.sock every 8 connection(s)
I20260929 03:05:41.409345 13616 acceptor_pool.cc:254] collecting diagnostics on the listening RPC socket unix:/tmp/dist-test-tasksRwAfX/test-tmp/rpc-test-7931f7b7fb334b0faab9becccf57a380.sock every 8 connection(s)
I20260929 03:05:41.409667 13183 rpc-test.cc:1716] Connecting to unix:/tmp/dist-test-tasksRwAfX/test-tmp/rpc-test-7931f7b7fb334b0faab9becccf57a380.sock
I20260929 03:05:41.423197 13183 test_util.cc:268] Using random seed: 1966309466
I20260929 03:05:41.441123 13619 rpc-test-base.h:240] got call: sleep_micros: 500 pattern: 4294967295 num_repetitions: 2097152 sidecar_idx: 0
I20260929 03:05:41.458138 13618 rpc-test-base.h:240] got call: sleep_micros: 500 pattern: 4294967295 num_repetitions: 2097152 sidecar_idx: 0
I20260929 03:05:41.474709 13619 rpc-test-base.h:240] got call: sleep_micros: 500 pattern: 4294967295 num_repetitions: 2097152 sidecar_idx: 0
I20260929 03:05:41.490052 13618 rpc-test-base.h:240] got call: sleep_micros: 500 pattern: 4294967295 num_repetitions: 2097152 sidecar_idx: 0
I20260929 03:05:41.507234 13619 rpc-test-base.h:240] got call: sleep_micros: 500 pattern: 4294967295 num_repetitions: 2097152 sidecar_idx: 0
I20260929 03:05:41.524233 13618 rpc-test-base.h:240] got call: sleep_micros: 500 pattern: 4294967295 num_repetitions: 2097152 sidecar_idx: 0
I20260929 03:05:41.541138 13619 rpc-test-base.h:240] got call: sleep_micros: 500 pattern: 4294967295 num_repetitions: 2097152 sidecar_idx: 0
W20260929 03:05:41.542940 13612 connection.cc:196] Error closing socket: Network error: TlsSocket::Close: Broken pipe
W20260929 03:05:41.548942 13612 connection.cc:441] server connection from unix:<unnamed> torn down before Call kudu.rpc.GenericCalculatorService.SleepWithSidecar from unix:<unnamed> (request call id 8) could send its response
W20260929 03:05:41.563117 13612 connection.cc:441] server connection from unix:<unnamed> torn down before Call kudu.rpc.GenericCalculatorService.SleepWithSidecar from unix:<unnamed> (request call id 9) could send its response
[       OK ] Parameters/TestRpc.TestCancellationAsync/SSL_UnixSocket (167 ms)
[ RUN      ] Parameters/TestRpc.TestPerformanceBySocketType/SSL_UnixSocket
I20260929 03:05:41.584110 13640 acceptor_pool.cc:254] collecting diagnostics on the listening RPC socket unix:/tmp/dist-test-tasksRwAfX/test-tmp/rpc-test-b0b76628dbb843b8927283d9916b76e3.sock every 8 connection(s)
I20260929 03:05:41.584160 13641 acceptor_pool.cc:254] collecting diagnostics on the listening RPC socket unix:/tmp/dist-test-tasksRwAfX/test-tmp/rpc-test-b0b76628dbb843b8927283d9916b76e3.sock every 8 connection(s)
I20260929 03:05:41.584491 13183 rpc-test.cc:1846] Connecting to unix:/tmp/dist-test-tasksRwAfX/test-tmp/rpc-test-b0b76628dbb843b8927283d9916b76e3.sock
I20260929 03:05:43.160926 13183 rpc-test.cc:1859] Sending 1024MB via ssl-enabled unix socket: real 1.564s	user 2.001s	sys 0.842s
I20260929 03:05:44.712311 13183 rpc-test.cc:1859] Sending 1024MB via ssl-enabled unix socket: real 1.551s	user 1.929s	sys 0.903s
I20260929 03:05:46.229177 13183 rpc-test.cc:1859] Sending 1024MB via ssl-enabled unix socket: real 1.517s	user 1.903s	sys 0.852s
I20260929 03:05:47.764153 13183 rpc-test.cc:1859] Sending 1024MB via ssl-enabled unix socket: real 1.535s	user 1.828s	sys 0.955s
I20260929 03:05:49.276103 13183 rpc-test.cc:1859] Sending 1024MB via ssl-enabled unix socket: real 1.512s	user 1.803s	sys 0.944s
W20260929 03:05:49.277050 13637 connection.cc:196] Error closing socket: Network error: TlsSocket::Close: Broken pipe
[       OK ] Parameters/TestRpc.TestPerformanceBySocketType/SSL_UnixSocket (7713 ms)
[----------] 20 tests from Parameters/TestRpc (29684 ms total)

[----------] 1 test from Parameters/TestRpcSocketTxRxQueue
[ RUN      ] Parameters/TestRpcSocketTxRxQueue.AcceptorRxQueueSizeMetric/0
I20260929 03:05:49.286311 13665 acceptor_pool.cc:254] collecting diagnostics on the listening RPC socket 0.0.0.0:41717 every 1 connection(s)
I20260929 03:05:49.286427 13666 acceptor_pool.cc:254] collecting diagnostics on the listening RPC socket 0.0.0.0:41717 every 1 connection(s)
W20260929 03:05:49.287195 13661 negotiation.cc:337] Failed RPC negotiation. Trace:
0929 03:05:49.286951 (+     0us) reactor.cc:625] Submitting negotiation task for server connection from 127.0.0.1:59738 (local address 127.0.0.1:41717)
0929 03:05:49.287043 (+    92us) server_negotiation.cc:206] Beginning negotiation
0929 03:05:49.287046 (+     3us) server_negotiation.cc:399] Waiting for connection header
0929 03:05:49.287123 (+    77us) negotiation.cc:327] Negotiation complete: Network error: Server connection negotiation failed: server connection from 127.0.0.1:59738: BlockingRecv error: recv got EOF from 127.0.0.1:59738 (error 108)
Metrics: {"server-negotiator.queue_time_us":31}
[       OK ] Parameters/TestRpcSocketTxRxQueue.AcceptorRxQueueSizeMetric/0 (11 ms)
[----------] 1 test from Parameters/TestRpcSocketTxRxQueue (11 ms total)

[----------] Global test environment tear-down
[==========] 21 tests from 2 test suites ran. (29695 ms total)
[  PASSED  ] 20 tests.
[  FAILED  ] 1 test, listed below:
[  FAILED  ] Parameters/TestRpc.TestCallWithChainCertAndChainCA/SSL_UnixSocket, where GetParam() = (true, true)

 1 FAILED TEST