Diagnosed failure

Parameters/TestRpc.TestCallWithChainCertAndChainCA/SSL_UnixSocket: /data0/somelongdirectorytoavoidrpathissues/src/kudu/src/kudu/rpc/rpc-test.cc:270: Failure
Failed
Bad status: Runtime error: could not verify certificate chain (error with cert: subject=CN = localhost, ST = sadfjas, C = AS, emailAddress = sdflkdsajf, O = lskdfjlsad, OU = sldfkja, issuer=C = AS, ST = ASDfkjdhf, L = lskdjf, O = saldfja, OU = skdjf, CN = localhost, emailAddress = sadjflkadsj): : certificate has expired
Google Test trace:
/data0/somelongdirectorytoavoidrpathissues/src/kudu/src/kudu/rpc/rpc-test.cc:267: Connecting to unix:/tmp/dist-test-taskmDnEWG/test-tmp/rpc-test-508b856082044bb1a99a2313257c46e0.sock
I20260927 09:48:37.136969   816 test_util.cc:175] -----------------------------------------------
I20260927 09:48:37.137018   816 test_util.cc:176] Had fatal failures, leaving test files at /tmp/dist-test-taskmDnEWG/test-tmp/rpc-test.6.Parameters_TestRpc.TestCallWithChainCertAndChainCA_SSL_UnixSocket.1790502517032748-816-0

Full log

Note: This is test shard 7 of 8.
[==========] Running 21 tests from 2 test suites.
[----------] Global test environment set-up.
[----------] 20 tests from Parameters/TestRpc
[ RUN      ] Parameters/TestRpc.TestMessengerCreateDestroy/SSL_UnixSocket
WARNING: Logging before InitGoogleLogging() is written to STDERR
I20260927 09:48:37.054698   816 rpc-test.cc:169] started messenger TestCreateDestroy
[       OK ] Parameters/TestRpc.TestMessengerCreateDestroy/SSL_UnixSocket (20 ms)
[ RUN      ] Parameters/TestRpc.TestNegotiationDeadlock/SSL_UnixSocket
I20260927 09:48:37.093125   836 acceptor_pool.cc:254] collecting diagnostics on the listening RPC socket unix:/tmp/dist-test-taskmDnEWG/test-tmp/rpc-test-7e298923b55148e7827cf4513cbe223a.sock every 8 connection(s)
I20260927 09:48:37.093200   837 acceptor_pool.cc:254] collecting diagnostics on the listening RPC socket unix:/tmp/dist-test-taskmDnEWG/test-tmp/rpc-test-7e298923b55148e7827cf4513cbe223a.sock every 8 connection(s)
[       OK ] Parameters/TestRpc.TestNegotiationDeadlock/SSL_UnixSocket (43 ms)
[ RUN      ] Parameters/TestRpc.TestCallWithChainCertAndChainCA/SSL_UnixSocket
I20260927 09:48:37.133139   852 acceptor_pool.cc:254] collecting diagnostics on the listening RPC socket unix:/tmp/dist-test-taskmDnEWG/test-tmp/rpc-test-508b856082044bb1a99a2313257c46e0.sock every 8 connection(s)
I20260927 09:48:37.133162   853 acceptor_pool.cc:254] collecting diagnostics on the listening RPC socket unix:/tmp/dist-test-taskmDnEWG/test-tmp/rpc-test-508b856082044bb1a99a2313257c46e0.sock every 8 connection(s)
/data0/somelongdirectorytoavoidrpathissues/src/kudu/src/kudu/rpc/rpc-test.cc:270: Failure
Failed
Bad status: Runtime error: could not verify certificate chain (error with cert: subject=CN = localhost, ST = sadfjas, C = AS, emailAddress = sdflkdsajf, O = lskdfjlsad, OU = sldfkja, issuer=C = AS, ST = ASDfkjdhf, L = lskdjf, O = saldfja, OU = skdjf, CN = localhost, emailAddress = sadjflkadsj): : certificate has expired
Google Test trace:
/data0/somelongdirectorytoavoidrpathissues/src/kudu/src/kudu/rpc/rpc-test.cc:267: Connecting to unix:/tmp/dist-test-taskmDnEWG/test-tmp/rpc-test-508b856082044bb1a99a2313257c46e0.sock
I20260927 09:48:37.136969   816 test_util.cc:175] -----------------------------------------------
I20260927 09:48:37.137018   816 test_util.cc:176] Had fatal failures, leaving test files at /tmp/dist-test-taskmDnEWG/test-tmp/rpc-test.6.Parameters_TestRpc.TestCallWithChainCertAndChainCA_SSL_UnixSocket.1790502517032748-816-0
[  FAILED  ] Parameters/TestRpc.TestCallWithChainCertAndChainCA/SSL_UnixSocket, where GetParam() = (true, true) (37 ms)
[ RUN      ] Parameters/TestRpc.TestCallWithPasswordProtectedKey/SSL_UnixSocket
I20260927 09:48:37.147585   878 acceptor_pool.cc:254] collecting diagnostics on the listening RPC socket unix:/tmp/dist-test-taskmDnEWG/test-tmp/rpc-test-f9ba022e8dff4f8a898644e92d913650.sock every 8 connection(s)
I20260927 09:48:37.147575   877 acceptor_pool.cc:254] collecting diagnostics on the listening RPC socket unix:/tmp/dist-test-taskmDnEWG/test-tmp/rpc-test-f9ba022e8dff4f8a898644e92d913650.sock every 8 connection(s)
W20260927 09:48:37.158586   874 connection.cc:196] Error closing socket: Network error: TlsSocket::Close: Broken pipe
[       OK ] Parameters/TestRpc.TestCallWithPasswordProtectedKey/SSL_UnixSocket (23 ms)
[ RUN      ] Parameters/TestRpc.TestCallToBadServer/SSL_UnixSocket
I20260927 09:48:37.186252   816 rpc-test.cc:394] Status: Network error: Client connection negotiation failed: client connection to 0.0.0.0:0: connect: Connection refused (error 111)
I20260927 09:48:37.186540   816 rpc-test.cc:394] Status: Network error: Client connection negotiation failed: client connection to 0.0.0.0:0: connect: Connection refused (error 111)
I20260927 09:48:37.186750   816 rpc-test.cc:394] Status: Network error: Client connection negotiation failed: client connection to 0.0.0.0:0: connect: Connection refused (error 111)
I20260927 09:48:37.186930   816 rpc-test.cc:394] Status: Network error: Client connection negotiation failed: client connection to 0.0.0.0:0: connect: Connection refused (error 111)
I20260927 09:48:37.187106   816 rpc-test.cc:394] Status: Network error: Client connection negotiation failed: client connection to 0.0.0.0:0: connect: Connection refused (error 111)
[       OK ] Parameters/TestRpc.TestCallToBadServer/SSL_UnixSocket (27 ms)
[ RUN      ] Parameters/TestRpc.TestWrongService/SSL_UnixSocket
I20260927 09:48:37.201356   912 acceptor_pool.cc:254] collecting diagnostics on the listening RPC socket unix:/tmp/dist-test-taskmDnEWG/test-tmp/rpc-test-58d08147a3d44cedbcbd457e9dd240d4.sock every 8 connection(s)
I20260927 09:48:37.201392   913 acceptor_pool.cc:254] collecting diagnostics on the listening RPC socket unix:/tmp/dist-test-taskmDnEWG/test-tmp/rpc-test-58d08147a3d44cedbcbd457e9dd240d4.sock every 8 connection(s)
I20260927 09:48:37.211915   909 messenger.cc:345] service WrongServiceName not registered on TestServer
[       OK ] Parameters/TestRpc.TestWrongService/SSL_UnixSocket (25 ms)
[ RUN      ] Parameters/TestRpc.TestConnectionKeepalive/SSL_UnixSocket
I20260927 09:48:37.224159   935 acceptor_pool.cc:254] collecting diagnostics on the listening RPC socket unix:/tmp/dist-test-taskmDnEWG/test-tmp/rpc-test-d4cff666f3b44806a6b550196bcd03c6.sock every 8 connection(s)
I20260927 09:48:37.224186   936 acceptor_pool.cc:254] collecting diagnostics on the listening RPC socket unix:/tmp/dist-test-taskmDnEWG/test-tmp/rpc-test-d4cff666f3b44806a6b550196bcd03c6.sock every 8 connection(s)
I20260927 09:48:37.224378   816 rpc-test.cc:488] Connecting to unix:/tmp/dist-test-taskmDnEWG/test-tmp/rpc-test-d4cff666f3b44806a6b550196bcd03c6.sock
W20260927 09:48:37.715342   948 connection.cc:196] Error closing socket: Network error: TlsSocket::Close: Broken pipe
[       OK ] Parameters/TestRpc.TestConnectionKeepalive/SSL_UnixSocket (1026 ms)
[ RUN      ] Parameters/TestRpc.TestClientConnectionMetrics/SSL_UnixSocket
I20260927 09:48:38.265223   960 acceptor_pool.cc:254] collecting diagnostics on the listening RPC socket unix:/tmp/dist-test-taskmDnEWG/test-tmp/rpc-test-7ceb702f638941b9bb8ba6ddc4919708.sock every 8 connection(s)
I20260927 09:48:38.265283   961 acceptor_pool.cc:254] collecting diagnostics on the listening RPC socket unix:/tmp/dist-test-taskmDnEWG/test-tmp/rpc-test-7ceb702f638941b9bb8ba6ddc4919708.sock every 8 connection(s)
I20260927 09:48:38.265446   816 rpc-test.cc:569] Connecting to unix:/tmp/dist-test-taskmDnEWG/test-tmp/rpc-test-7ceb702f638941b9bb8ba6ddc4919708.sock
W20260927 09:48:46.586527   957 connection.cc:196] Error closing socket: Network error: TlsSocket::Close: Broken pipe
[       OK ] Parameters/TestRpc.TestClientConnectionMetrics/SSL_UnixSocket (8347 ms)
[ RUN      ] Parameters/TestRpc.TestCredentialsPolicy/SSL_UnixSocket
I20260927 09:48:46.598374   983 acceptor_pool.cc:254] collecting diagnostics on the listening RPC socket unix:/tmp/dist-test-taskmDnEWG/test-tmp/rpc-test-b9f713c9ec3c48ed993a84c3c0a5c3cd.sock every 8 connection(s)
I20260927 09:48:46.598497   984 acceptor_pool.cc:254] collecting diagnostics on the listening RPC socket unix:/tmp/dist-test-taskmDnEWG/test-tmp/rpc-test-b9f713c9ec3c48ed993a84c3c0a5c3cd.sock every 8 connection(s)
I20260927 09:48:46.598625   816 rpc-test.cc:700] Connecting to unix:/tmp/dist-test-taskmDnEWG/test-tmp/rpc-test-b9f713c9ec3c48ed993a84c3c0a5c3cd.sock
W20260927 09:48:46.618513   982 connection.cc:196] Error closing socket: Network error: TlsSocket::Close: Broken pipe
W20260927 09:48:46.622120   982 connection.cc:196] Error closing socket: Network error: TlsSocket::Close: Broken pipe
[       OK ] Parameters/TestRpc.TestCredentialsPolicy/SSL_UnixSocket (35 ms)
[ RUN      ] Parameters/TestRpc.TestCallLongerThanKeepalive/SSL_UnixSocket
I20260927 09:48:46.634104  1008 acceptor_pool.cc:254] collecting diagnostics on the listening RPC socket unix:/tmp/dist-test-taskmDnEWG/test-tmp/rpc-test-e989c744805b4fbead9560c65b7be56a.sock every 8 connection(s)
I20260927 09:48:46.634164  1009 acceptor_pool.cc:254] collecting diagnostics on the listening RPC socket unix:/tmp/dist-test-taskmDnEWG/test-tmp/rpc-test-e989c744805b4fbead9560c65b7be56a.sock every 8 connection(s)
I20260927 09:48:46.653486  1012 rpc-test-base.h:222] got call: sleep_micros: 3000000 deferred: true
I20260927 09:48:49.654198  1012 rpcz_store.cc:275] Call kudu.rpc.GenericCalculatorService.Sleep from unix:<unnamed> (request call id 0) took 3000 ms. Trace:
I20260927 09:48:49.654387  1012 rpcz_store.cc:276] 0927 09:48:46.653403 (+     0us) service_pool.cc:170] Inserting onto call queue
0927 09:48:46.653440 (+    37us) service_pool.cc:227] Handling call
0927 09:48:49.654183 (+3000743us) inbound_call.cc:173] Queueing success response
Metrics: {}
W20260927 09:48:49.655598  1005 connection.cc:196] Error closing socket: Network error: TlsSocket::Close: Broken pipe
[       OK ] Parameters/TestRpc.TestCallLongerThanKeepalive/SSL_UnixSocket (3033 ms)
[ RUN      ] Parameters/TestRpc.TestRpcSidecar/SSL_UnixSocket
I20260927 09:48:49.662026  1033 acceptor_pool.cc:254] collecting diagnostics on the listening RPC socket unix:/tmp/dist-test-taskmDnEWG/test-tmp/rpc-test-eeebd8cebc654bd4b624c2a1caadc720.sock every 8 connection(s)
I20260927 09:48:49.662125  1034 acceptor_pool.cc:254] collecting diagnostics on the listening RPC socket unix:/tmp/dist-test-taskmDnEWG/test-tmp/rpc-test-eeebd8cebc654bd4b624c2a1caadc720.sock every 8 connection(s)
W20260927 09:48:49.708472  1030 connection.cc:196] Error closing socket: Network error: TlsSocket::Close: Broken pipe
[       OK ] Parameters/TestRpc.TestRpcSidecar/SSL_UnixSocket (52 ms)
[ RUN      ] Parameters/TestRpc.TestRpcSidecarLimits/SSL_UnixSocket
I20260927 09:48:51.527892  1058 acceptor_pool.cc:254] collecting diagnostics on the listening RPC socket unix:/tmp/dist-test-taskmDnEWG/test-tmp/rpc-test-3b178eac20e843da8923528ce1e9803f.sock every 8 connection(s)
I20260927 09:48:51.527930  1059 acceptor_pool.cc:254] collecting diagnostics on the listening RPC socket unix:/tmp/dist-test-taskmDnEWG/test-tmp/rpc-test-3b178eac20e843da8923528ce1e9803f.sock every 8 connection(s)
W20260927 09:48:51.541363   816 serialization.cc:72] Serialized kudu.rpc_test.PushStringsRequestPB (2147483654 bytes) is larger than the maximum configured RPC message size (52428800 bytes). Sending anyway, but peer may reject the data.
W20260927 09:48:51.544370  1055 connection.cc:535] server connection from unix:<unnamed> recv error: Network error: RPC frame had a length of 2147483714, but we only support messages up to 52428800 bytes long.
W20260927 09:48:51.544418  1055 connection.cc:158] shutting down server connection from unix:<unnamed> with pending inbound data: 4/2147483714 bytes received; last active 0 ns ago: status Network error: RPC frame had a length of 2147483714, but we only support messages up to 52428800 bytes long.
W20260927 09:48:51.544543  1071 connection.cc:698] client connection to unix:/tmp/dist-test-taskmDnEWG/test-tmp/rpc-test-3b178eac20e843da8923528ce1e9803f.sock send error: Network error: failed to write to TLS socket: Broken pipe
W20260927 09:48:51.544672  1071 connection.cc:196] Error closing socket: Network error: TlsSocket::Close: Success
I20260927 09:48:51.557140  1083 acceptor_pool.cc:254] collecting diagnostics on the listening RPC socket unix:/tmp/dist-test-taskmDnEWG/test-tmp/rpc-test-3b178eac20e843da8923528ce1e9803f.sock every 8 connection(s)
I20260927 09:48:51.557284  1084 acceptor_pool.cc:254] collecting diagnostics on the listening RPC socket unix:/tmp/dist-test-taskmDnEWG/test-tmp/rpc-test-3b178eac20e843da8923528ce1e9803f.sock every 8 connection(s)
W20260927 09:48:55.815434  1080 connection.cc:577] server connection from unix:<unnamed>: received bad data: 'Corruption: Invalid packet: message had a length of 2147483710, but we only support messages up to 2147483647 bytes
'
W20260927 09:48:55.815789  1096 connection.cc:196] Error closing socket: Network error: TlsSocket::Close: Broken pipe
[       OK ] Parameters/TestRpc.TestRpcSidecarLimits/SSL_UnixSocket (6107 ms)
[ RUN      ] Parameters/TestRpc.TestCallTimeoutDoesntAffectNegotiation/SSL_UnixSocket
I20260927 09:48:55.837893  1108 acceptor_pool.cc:254] collecting diagnostics on the listening RPC socket unix:/tmp/dist-test-taskmDnEWG/test-tmp/rpc-test-993666a32ece46ba9c893d5c56bbeeee.sock every 8 connection(s)
I20260927 09:48:55.837934  1109 acceptor_pool.cc:254] collecting diagnostics on the listening RPC socket unix:/tmp/dist-test-taskmDnEWG/test-tmp/rpc-test-993666a32ece46ba9c893d5c56bbeeee.sock every 8 connection(s)
W20260927 09:48:55.846197  1104 negotiation.cc:266] Injecting 500ms delay in negotiation
I20260927 09:48:55.896555   816 rpc-test-base.h:595] status: Timed out: connection negotiation to unix:/tmp/dist-test-taskmDnEWG/test-tmp/rpc-test-993666a32ece46ba9c893d5c56bbeeee.sock for RPC Sleep timed out after 0.050s (ON_OUTBOUND_QUEUE), seconds elapsed: 0.0506252
[       OK ] Parameters/TestRpc.TestCallTimeoutDoesntAffectNegotiation/SSL_UnixSocket (533 ms)
[ RUN      ] Parameters/TestRpc.TestRpcHandlerLatencyMetric/SSL_UnixSocket
I20260927 09:48:56.356916  1133 acceptor_pool.cc:254] collecting diagnostics on the listening RPC socket unix:/tmp/dist-test-taskmDnEWG/test-tmp/rpc-test-7d84d56bc71d4fea820c76db4cd66b07.sock every 8 connection(s)
I20260927 09:48:56.357023  1134 acceptor_pool.cc:254] collecting diagnostics on the listening RPC socket unix:/tmp/dist-test-taskmDnEWG/test-tmp/rpc-test-7d84d56bc71d4fea820c76db4cd66b07.sock every 8 connection(s)
I20260927 09:48:56.403113   816 rpc-test.cc:1236] Sleep() min lat: 20313
I20260927 09:48:56.403187   816 rpc-test.cc:1237] Sleep() mean lat: 20313
I20260927 09:48:56.403211   816 rpc-test.cc:1238] Sleep() max lat: 20313
I20260927 09:48:56.403224   816 rpc-test.cc:1239] Sleep() #calls: 1
[       OK ] Parameters/TestRpc.TestRpcHandlerLatencyMetric/SSL_UnixSocket (53 ms)
[ RUN      ] Parameters/TestRpc.TimedOutOnResponseMetricServiceQueue/SSL_UnixSocket
I20260927 09:48:56.433284  1159 acceptor_pool.cc:254] collecting diagnostics on the listening RPC socket unix:/tmp/dist-test-taskmDnEWG/test-tmp/rpc-test-542d3708ba494beaad616960321e96d5.sock every 8 connection(s)
I20260927 09:48:56.433307  1160 acceptor_pool.cc:254] collecting diagnostics on the listening RPC socket unix:/tmp/dist-test-taskmDnEWG/test-tmp/rpc-test-542d3708ba494beaad616960321e96d5.sock every 8 connection(s)
W20260927 09:48:56.498404  1161 rpcz_store.cc:267] Call kudu.rpc_test.CalculatorService.Sleep from unix:<unnamed> (request call id 2) took 20 ms (client timeout 20 ms). Trace:
W20260927 09:48:56.498517  1161 rpcz_store.cc:269] 0927 09:48:56.478145 (+     0us) service_pool.cc:170] Inserting onto call queue
0927 09:48:56.498349 (+ 20204us) service_pool.cc:214] Skipping call since client already timed out
0927 09:48:56.498362 (+    13us) inbound_call.cc:173] Queueing failure response
Metrics: {}
[       OK ] Parameters/TestRpc.TimedOutOnResponseMetricServiceQueue/SSL_UnixSocket (101 ms)
[ RUN      ] Parameters/TestRpc.RpcPendingConnectionsMetric/SSL_UnixSocket
I20260927 09:48:56.508606  1182 acceptor_pool.cc:254] collecting diagnostics on the listening RPC socket 0.0.0.0:39155 every 8 connection(s)
I20260927 09:48:56.508658  1183 acceptor_pool.cc:254] collecting diagnostics on the listening RPC socket 0.0.0.0:39155 every 8 connection(s)
W20260927 09:48:56.519120  1178 negotiation.cc:337] Failed RPC negotiation. Trace:
0927 09:48:56.518759 (+     0us) reactor.cc:625] Submitting negotiation task for server connection from 127.0.0.1:45914 (local address 127.0.0.1:39155)
0927 09:48:56.518853 (+    94us) server_negotiation.cc:206] Beginning negotiation
0927 09:48:56.518857 (+     4us) server_negotiation.cc:399] Waiting for connection header
0927 09:48:56.519007 (+   150us) negotiation.cc:327] Negotiation complete: Network error: Server connection negotiation failed: server connection from 127.0.0.1:45914: BlockingRecv error: recv got EOF from 127.0.0.1:45914 (error 108)
Metrics: {"server-negotiator.queue_time_us":58}
[       OK ] Parameters/TestRpc.RpcPendingConnectionsMetric/SSL_UnixSocket (23 ms)
[ RUN      ] Parameters/TestRpc.TestRpcContextClientDeadline/SSL_UnixSocket
I20260927 09:48:56.536113  1198 acceptor_pool.cc:254] collecting diagnostics on the listening RPC socket unix:/tmp/dist-test-taskmDnEWG/test-tmp/rpc-test-6f6a5b79c6d04942b2c1e84ee151b4d5.sock every 8 connection(s)
I20260927 09:48:56.536178  1199 acceptor_pool.cc:254] collecting diagnostics on the listening RPC socket unix:/tmp/dist-test-taskmDnEWG/test-tmp/rpc-test-6f6a5b79c6d04942b2c1e84ee151b4d5.sock every 8 connection(s)
W20260927 09:48:56.570012  1195 connection.cc:196] Error closing socket: Network error: TlsSocket::Close: Broken pipe
[       OK ] Parameters/TestRpc.TestRpcContextClientDeadline/SSL_UnixSocket (41 ms)
[ RUN      ] Parameters/TestRpc.TestApplicationFeatureFlagUnsupportedServer/SSL_UnixSocket
I20260927 09:48:56.584649  1224 acceptor_pool.cc:254] collecting diagnostics on the listening RPC socket unix:/tmp/dist-test-taskmDnEWG/test-tmp/rpc-test-a2002afd631b4d9ea7ea6c47955dc6de.sock every 8 connection(s)
I20260927 09:48:56.584630  1223 acceptor_pool.cc:254] collecting diagnostics on the listening RPC socket unix:/tmp/dist-test-taskmDnEWG/test-tmp/rpc-test-a2002afd631b4d9ea7ea6c47955dc6de.sock every 8 connection(s)
[       OK ] Parameters/TestRpc.TestApplicationFeatureFlagUnsupportedServer/SSL_UnixSocket (27 ms)
[ RUN      ] Parameters/TestRpc.TestCancellationAsync/SSL_UnixSocket
I20260927 09:48:56.615067  1249 acceptor_pool.cc:254] collecting diagnostics on the listening RPC socket unix:/tmp/dist-test-taskmDnEWG/test-tmp/rpc-test-f6787d7ef6484f0b830802cffc2b8efd.sock every 8 connection(s)
I20260927 09:48:56.615093  1248 acceptor_pool.cc:254] collecting diagnostics on the listening RPC socket unix:/tmp/dist-test-taskmDnEWG/test-tmp/rpc-test-f6787d7ef6484f0b830802cffc2b8efd.sock every 8 connection(s)
I20260927 09:48:56.615227   816 rpc-test.cc:1716] Connecting to unix:/tmp/dist-test-taskmDnEWG/test-tmp/rpc-test-f6787d7ef6484f0b830802cffc2b8efd.sock
I20260927 09:48:56.634325   816 test_util.cc:268] Using random seed: -609591342
I20260927 09:48:56.647953  1251 rpc-test-base.h:240] got call: sleep_micros: 500 pattern: 4294967295 num_repetitions: 2097152 sidecar_idx: 0
I20260927 09:48:56.658949  1251 rpc-test-base.h:240] got call: sleep_micros: 500 pattern: 4294967295 num_repetitions: 2097152 sidecar_idx: 0
I20260927 09:48:56.669822  1251 rpc-test-base.h:240] got call: sleep_micros: 500 pattern: 4294967295 num_repetitions: 2097152 sidecar_idx: 0
I20260927 09:48:56.680357  1251 rpc-test-base.h:240] got call: sleep_micros: 500 pattern: 4294967295 num_repetitions: 2097152 sidecar_idx: 0
I20260927 09:48:56.690860  1251 rpc-test-base.h:240] got call: sleep_micros: 500 pattern: 4294967295 num_repetitions: 2097152 sidecar_idx: 0
I20260927 09:48:56.701892  1251 rpc-test-base.h:240] got call: sleep_micros: 500 pattern: 4294967295 num_repetitions: 2097152 sidecar_idx: 0
I20260927 09:48:56.712625  1251 rpc-test-base.h:240] got call: sleep_micros: 500 pattern: 4294967295 num_repetitions: 2097152 sidecar_idx: 0
I20260927 09:48:56.723085  1251 rpc-test-base.h:240] got call: sleep_micros: 500 pattern: 4294967295 num_repetitions: 2097152 sidecar_idx: 0
W20260927 09:48:56.724711  1245 connection.cc:196] Error closing socket: Network error: TlsSocket::Close: Broken pipe
W20260927 09:48:56.726130  1245 connection.cc:441] server connection from unix:<unnamed> torn down before Call kudu.rpc.GenericCalculatorService.SleepWithSidecar from unix:<unnamed> (request call id 9) could send its response
[       OK ] Parameters/TestRpc.TestCancellationAsync/SSL_UnixSocket (128 ms)
[ RUN      ] Parameters/TestRpc.TestPerformanceBySocketType/SSL_UnixSocket
I20260927 09:48:56.750356  1273 acceptor_pool.cc:254] collecting diagnostics on the listening RPC socket unix:/tmp/dist-test-taskmDnEWG/test-tmp/rpc-test-84ba424097114d1d9ff195b440496957.sock every 8 connection(s)
I20260927 09:48:56.750411  1274 acceptor_pool.cc:254] collecting diagnostics on the listening RPC socket unix:/tmp/dist-test-taskmDnEWG/test-tmp/rpc-test-84ba424097114d1d9ff195b440496957.sock every 8 connection(s)
I20260927 09:48:56.750710   816 rpc-test.cc:1846] Connecting to unix:/tmp/dist-test-taskmDnEWG/test-tmp/rpc-test-84ba424097114d1d9ff195b440496957.sock
I20260927 09:48:58.055490   816 rpc-test.cc:1859] Sending 1024MB via ssl-enabled unix socket: real 1.294s	user 1.445s	sys 0.868s
I20260927 09:48:59.336462   816 rpc-test.cc:1859] Sending 1024MB via ssl-enabled unix socket: real 1.281s	user 1.446s	sys 0.842s
I20260927 09:49:00.644192   816 rpc-test.cc:1859] Sending 1024MB via ssl-enabled unix socket: real 1.308s	user 1.436s	sys 0.901s
I20260927 09:49:01.909947   816 rpc-test.cc:1859] Sending 1024MB via ssl-enabled unix socket: real 1.266s	user 1.319s	sys 0.942s
I20260927 09:49:03.188966   816 rpc-test.cc:1859] Sending 1024MB via ssl-enabled unix socket: real 1.279s	user 1.378s	sys 0.905s
W20260927 09:49:03.189693  1270 connection.cc:196] Error closing socket: Network error: TlsSocket::Close: Broken pipe
[       OK ] Parameters/TestRpc.TestPerformanceBySocketType/SSL_UnixSocket (6463 ms)
[----------] 20 tests from Parameters/TestRpc (26155 ms total)

[----------] 1 test from Parameters/TestRpcSocketTxRxQueue
[ RUN      ] Parameters/TestRpcSocketTxRxQueue.AcceptorRxQueueSizeMetric/0
I20260927 09:49:03.192684  1298 acceptor_pool.cc:254] collecting diagnostics on the listening RPC socket 0.0.0.0:34171 every 1 connection(s)
I20260927 09:49:03.192745  1299 acceptor_pool.cc:254] collecting diagnostics on the listening RPC socket 0.0.0.0:34171 every 1 connection(s)
W20260927 09:49:03.193265  1294 negotiation.cc:337] Failed RPC negotiation. Trace:
0927 09:49:03.193102 (+     0us) reactor.cc:625] Submitting negotiation task for server connection from 127.0.0.1:52166 (local address 127.0.0.1:34171)
0927 09:49:03.193178 (+    76us) server_negotiation.cc:206] Beginning negotiation
0927 09:49:03.193179 (+     1us) server_negotiation.cc:399] Waiting for connection header
0927 09:49:03.193239 (+    60us) negotiation.cc:327] Negotiation complete: Network error: Server connection negotiation failed: server connection from 127.0.0.1:52166: BlockingRecv error: recv got EOF from 127.0.0.1:52166 (error 108)
Metrics: {"server-negotiator.queue_time_us":38}
[       OK ] Parameters/TestRpcSocketTxRxQueue.AcceptorRxQueueSizeMetric/0 (4 ms)
[----------] 1 test from Parameters/TestRpcSocketTxRxQueue (4 ms total)

[----------] Global test environment tear-down
[==========] 21 tests from 2 test suites ran. (26160 ms total)
[  PASSED  ] 20 tests.
[  FAILED  ] 1 test, listed below:
[  FAILED  ] Parameters/TestRpc.TestCallWithChainCertAndChainCA/SSL_UnixSocket, where GetParam() = (true, true)

 1 FAILED TEST