Diagnosed failure
Parameters/TestRpc.TestCallWithChainCertAndChainCA/SSL_UnixSocket: /data0/somelongdirectorytoavoidrpathissues/src/kudu/src/kudu/rpc/rpc-test.cc:270: Failure
Failed
Bad status: Runtime error: could not verify certificate chain (error with cert: subject=CN = localhost, ST = sadfjas, C = AS, emailAddress = sdflkdsajf, O = lskdfjlsad, OU = sldfkja, issuer=C = AS, ST = ASDfkjdhf, L = lskdjf, O = saldfja, OU = skdjf, CN = localhost, emailAddress = sadjflkadsj): : certificate has expired
Google Test trace:
/data0/somelongdirectorytoavoidrpathissues/src/kudu/src/kudu/rpc/rpc-test.cc:267: Connecting to unix:/tmp/dist-test-taskdqjq6Q/test-tmp/rpc-test-854f939026984911a1e29c15f9555c6d.sock
I20260923 19:32:45.074774 10121 test_util.cc:175] -----------------------------------------------
I20260923 19:32:45.074888 10121 test_util.cc:176] Had fatal failures, leaving test files at /tmp/dist-test-taskdqjq6Q/test-tmp/rpc-test.6.Parameters_TestRpc.TestCallWithChainCertAndChainCA_SSL_UnixSocket.1790191964967159-10121-0
Full log
Note: This is test shard 7 of 8.
[==========] Running 21 tests from 2 test suites.
[----------] Global test environment set-up.
[----------] 20 tests from Parameters/TestRpc
[ RUN ] Parameters/TestRpc.TestMessengerCreateDestroy/SSL_UnixSocket
WARNING: Logging before InitGoogleLogging() is written to STDERR
I20260923 19:32:45.013453 10121 rpc-test.cc:169] started messenger TestCreateDestroy
[ OK ] Parameters/TestRpc.TestMessengerCreateDestroy/SSL_UnixSocket (29 ms)
[ RUN ] Parameters/TestRpc.TestNegotiationDeadlock/SSL_UnixSocket
I20260923 19:32:45.028023 10141 acceptor_pool.cc:254] collecting diagnostics on the listening RPC socket unix:/tmp/dist-test-taskdqjq6Q/test-tmp/rpc-test-71a418a555bb4fa7a9ea58ed07c2dcda.sock every 8 connection(s)
I20260923 19:32:45.028331 10142 acceptor_pool.cc:254] collecting diagnostics on the listening RPC socket unix:/tmp/dist-test-taskdqjq6Q/test-tmp/rpc-test-71a418a555bb4fa7a9ea58ed07c2dcda.sock every 8 connection(s)
[ OK ] Parameters/TestRpc.TestNegotiationDeadlock/SSL_UnixSocket (30 ms)
[ RUN ] Parameters/TestRpc.TestCallWithChainCertAndChainCA/SSL_UnixSocket
I20260923 19:32:45.063089 10157 acceptor_pool.cc:254] collecting diagnostics on the listening RPC socket unix:/tmp/dist-test-taskdqjq6Q/test-tmp/rpc-test-854f939026984911a1e29c15f9555c6d.sock every 8 connection(s)
I20260923 19:32:45.063477 10158 acceptor_pool.cc:254] collecting diagnostics on the listening RPC socket unix:/tmp/dist-test-taskdqjq6Q/test-tmp/rpc-test-854f939026984911a1e29c15f9555c6d.sock every 8 connection(s)
/data0/somelongdirectorytoavoidrpathissues/src/kudu/src/kudu/rpc/rpc-test.cc:270: Failure
Failed
Bad status: Runtime error: could not verify certificate chain (error with cert: subject=CN = localhost, ST = sadfjas, C = AS, emailAddress = sdflkdsajf, O = lskdfjlsad, OU = sldfkja, issuer=C = AS, ST = ASDfkjdhf, L = lskdjf, O = saldfja, OU = skdjf, CN = localhost, emailAddress = sadjflkadsj): : certificate has expired
Google Test trace:
/data0/somelongdirectorytoavoidrpathissues/src/kudu/src/kudu/rpc/rpc-test.cc:267: Connecting to unix:/tmp/dist-test-taskdqjq6Q/test-tmp/rpc-test-854f939026984911a1e29c15f9555c6d.sock
I20260923 19:32:45.074774 10121 test_util.cc:175] -----------------------------------------------
I20260923 19:32:45.074888 10121 test_util.cc:176] Had fatal failures, leaving test files at /tmp/dist-test-taskdqjq6Q/test-tmp/rpc-test.6.Parameters_TestRpc.TestCallWithChainCertAndChainCA_SSL_UnixSocket.1790191964967159-10121-0
[ FAILED ] Parameters/TestRpc.TestCallWithChainCertAndChainCA/SSL_UnixSocket, where GetParam() = (true, true) (27 ms)
[ RUN ] Parameters/TestRpc.TestCallWithPasswordProtectedKey/SSL_UnixSocket
I20260923 19:32:45.089067 10182 acceptor_pool.cc:254] collecting diagnostics on the listening RPC socket unix:/tmp/dist-test-taskdqjq6Q/test-tmp/rpc-test-916f3e0d21654dfd91936cdd5e455e7a.sock every 8 connection(s)
I20260923 19:32:45.089330 10183 acceptor_pool.cc:254] collecting diagnostics on the listening RPC socket unix:/tmp/dist-test-taskdqjq6Q/test-tmp/rpc-test-916f3e0d21654dfd91936cdd5e455e7a.sock every 8 connection(s)
W20260923 19:32:45.119714 10179 connection.cc:196] Error closing socket: Network error: TlsSocket::Close: Broken pipe
[ OK ] Parameters/TestRpc.TestCallWithPasswordProtectedKey/SSL_UnixSocket (49 ms)
[ RUN ] Parameters/TestRpc.TestCallToBadServer/SSL_UnixSocket
I20260923 19:32:45.141021 10121 rpc-test.cc:394] Status: Network error: Client connection negotiation failed: client connection to 0.0.0.0:0: connect: Connection refused (error 111)
I20260923 19:32:45.141659 10121 rpc-test.cc:394] Status: Network error: Client connection negotiation failed: client connection to 0.0.0.0:0: connect: Connection refused (error 111)
I20260923 19:32:45.142181 10121 rpc-test.cc:394] Status: Network error: Client connection negotiation failed: client connection to 0.0.0.0:0: connect: Connection refused (error 111)
I20260923 19:32:45.142705 10121 rpc-test.cc:394] Status: Network error: Client connection negotiation failed: client connection to 0.0.0.0:0: connect: Connection refused (error 111)
I20260923 19:32:45.143218 10121 rpc-test.cc:394] Status: Network error: Client connection negotiation failed: client connection to 0.0.0.0:0: connect: Connection refused (error 111)
[ OK ] Parameters/TestRpc.TestCallToBadServer/SSL_UnixSocket (21 ms)
[ RUN ] Parameters/TestRpc.TestWrongService/SSL_UnixSocket
I20260923 19:32:45.155125 10217 acceptor_pool.cc:254] collecting diagnostics on the listening RPC socket unix:/tmp/dist-test-taskdqjq6Q/test-tmp/rpc-test-d4caf37e92ce4c6c84085c8e3f507c92.sock every 8 connection(s)
I20260923 19:32:45.155370 10218 acceptor_pool.cc:254] collecting diagnostics on the listening RPC socket unix:/tmp/dist-test-taskdqjq6Q/test-tmp/rpc-test-d4caf37e92ce4c6c84085c8e3f507c92.sock every 8 connection(s)
I20260923 19:32:45.172772 10214 messenger.cc:345] service WrongServiceName not registered on TestServer
[ OK ] Parameters/TestRpc.TestWrongService/SSL_UnixSocket (33 ms)
[ RUN ] Parameters/TestRpc.TestConnectionKeepalive/SSL_UnixSocket
I20260923 19:32:45.206528 10240 acceptor_pool.cc:254] collecting diagnostics on the listening RPC socket unix:/tmp/dist-test-taskdqjq6Q/test-tmp/rpc-test-3156135874b2496b85f0853c2ff67e54.sock every 8 connection(s)
I20260923 19:32:45.206760 10241 acceptor_pool.cc:254] collecting diagnostics on the listening RPC socket unix:/tmp/dist-test-taskdqjq6Q/test-tmp/rpc-test-3156135874b2496b85f0853c2ff67e54.sock every 8 connection(s)
I20260923 19:32:45.207742 10121 rpc-test.cc:488] Connecting to unix:/tmp/dist-test-taskdqjq6Q/test-tmp/rpc-test-3156135874b2496b85f0853c2ff67e54.sock
W20260923 19:32:45.681972 10253 connection.cc:196] Error closing socket: Network error: TlsSocket::Close: Broken pipe
[ OK ] Parameters/TestRpc.TestConnectionKeepalive/SSL_UnixSocket (1052 ms)
[ RUN ] Parameters/TestRpc.TestClientConnectionMetrics/SSL_UnixSocket
I20260923 19:32:46.251838 10265 acceptor_pool.cc:254] collecting diagnostics on the listening RPC socket unix:/tmp/dist-test-taskdqjq6Q/test-tmp/rpc-test-5666b1bdf7b749fbbaaa9ca52194599b.sock every 8 connection(s)
I20260923 19:32:46.252117 10266 acceptor_pool.cc:254] collecting diagnostics on the listening RPC socket unix:/tmp/dist-test-taskdqjq6Q/test-tmp/rpc-test-5666b1bdf7b749fbbaaa9ca52194599b.sock every 8 connection(s)
I20260923 19:32:46.253005 10121 rpc-test.cc:569] Connecting to unix:/tmp/dist-test-taskdqjq6Q/test-tmp/rpc-test-5666b1bdf7b749fbbaaa9ca52194599b.sock
[ OK ] Parameters/TestRpc.TestClientConnectionMetrics/SSL_UnixSocket (21141 ms)
[ RUN ] Parameters/TestRpc.TestCredentialsPolicy/SSL_UnixSocket
I20260923 19:33:07.398788 10288 acceptor_pool.cc:254] collecting diagnostics on the listening RPC socket unix:/tmp/dist-test-taskdqjq6Q/test-tmp/rpc-test-df8c11daeeda4daebcc6c4d6d1826de9.sock every 8 connection(s)
I20260923 19:33:07.399065 10289 acceptor_pool.cc:254] collecting diagnostics on the listening RPC socket unix:/tmp/dist-test-taskdqjq6Q/test-tmp/rpc-test-df8c11daeeda4daebcc6c4d6d1826de9.sock every 8 connection(s)
I20260923 19:33:07.400086 10121 rpc-test.cc:700] Connecting to unix:/tmp/dist-test-taskdqjq6Q/test-tmp/rpc-test-df8c11daeeda4daebcc6c4d6d1826de9.sock
W20260923 19:33:07.439137 10287 connection.cc:196] Error closing socket: Network error: TlsSocket::Close: Broken pipe
[ OK ] Parameters/TestRpc.TestCredentialsPolicy/SSL_UnixSocket (77 ms)
[ RUN ] Parameters/TestRpc.TestCallLongerThanKeepalive/SSL_UnixSocket
I20260923 19:33:07.463640 10313 acceptor_pool.cc:254] collecting diagnostics on the listening RPC socket unix:/tmp/dist-test-taskdqjq6Q/test-tmp/rpc-test-ba1588b416574979bfec13fd39e91acb.sock every 8 connection(s)
I20260923 19:33:07.463907 10314 acceptor_pool.cc:254] collecting diagnostics on the listening RPC socket unix:/tmp/dist-test-taskdqjq6Q/test-tmp/rpc-test-ba1588b416574979bfec13fd39e91acb.sock every 8 connection(s)
I20260923 19:33:07.494149 10317 rpc-test-base.h:222] got call: sleep_micros: 3000000 deferred: true
I20260923 19:33:10.495847 10317 rpcz_store.cc:275] Call kudu.rpc.GenericCalculatorService.Sleep from unix:<unnamed> (request call id 0) took 3001 ms. Trace:
I20260923 19:33:10.496023 10317 rpcz_store.cc:276] 0923 19:33:07.494028 (+ 0us) service_pool.cc:170] Inserting onto call queue
0923 19:33:07.494102 (+ 74us) service_pool.cc:227] Handling call
0923 19:33:10.495799 (+3001697us) inbound_call.cc:173] Queueing success response
Metrics: {}
[ OK ] Parameters/TestRpc.TestCallLongerThanKeepalive/SSL_UnixSocket (3052 ms)
[ RUN ] Parameters/TestRpc.TestRpcSidecar/SSL_UnixSocket
I20260923 19:33:10.512291 10338 acceptor_pool.cc:254] collecting diagnostics on the listening RPC socket unix:/tmp/dist-test-taskdqjq6Q/test-tmp/rpc-test-81389c24a1b14c23a0205575f4d26f4e.sock every 8 connection(s)
I20260923 19:33:10.512562 10339 acceptor_pool.cc:254] collecting diagnostics on the listening RPC socket unix:/tmp/dist-test-taskdqjq6Q/test-tmp/rpc-test-81389c24a1b14c23a0205575f4d26f4e.sock every 8 connection(s)
W20260923 19:33:10.625376 10335 connection.cc:196] Error closing socket: Network error: TlsSocket::Close: Broken pipe
[ OK ] Parameters/TestRpc.TestRpcSidecar/SSL_UnixSocket (127 ms)
[ RUN ] Parameters/TestRpc.TestRpcSidecarLimits/SSL_UnixSocket
I20260923 19:33:12.774619 10363 acceptor_pool.cc:254] collecting diagnostics on the listening RPC socket unix:/tmp/dist-test-taskdqjq6Q/test-tmp/rpc-test-7f6bcde31324435e9b64a3714e956e17.sock every 8 connection(s)
I20260923 19:33:12.774927 10364 acceptor_pool.cc:254] collecting diagnostics on the listening RPC socket unix:/tmp/dist-test-taskdqjq6Q/test-tmp/rpc-test-7f6bcde31324435e9b64a3714e956e17.sock every 8 connection(s)
W20260923 19:33:12.784008 10121 serialization.cc:72] Serialized kudu.rpc_test.PushStringsRequestPB (2147483654 bytes) is larger than the maximum configured RPC message size (52428800 bytes). Sending anyway, but peer may reject the data.
W20260923 19:33:12.789839 10360 connection.cc:535] server connection from unix:<unnamed> recv error: Network error: RPC frame had a length of 2147483714, but we only support messages up to 52428800 bytes long.
W20260923 19:33:12.790001 10360 connection.cc:158] shutting down server connection from unix:<unnamed> with pending inbound data: 4/2147483714 bytes received; last active 0 ns ago: status Network error: RPC frame had a length of 2147483714, but we only support messages up to 52428800 bytes long.
W20260923 19:33:12.790530 10376 connection.cc:196] Error closing socket: Network error: TlsSocket::Close: Broken pipe
I20260923 19:33:12.805943 10388 acceptor_pool.cc:254] collecting diagnostics on the listening RPC socket unix:/tmp/dist-test-taskdqjq6Q/test-tmp/rpc-test-7f6bcde31324435e9b64a3714e956e17.sock every 8 connection(s)
I20260923 19:33:12.806102 10389 acceptor_pool.cc:254] collecting diagnostics on the listening RPC socket unix:/tmp/dist-test-taskdqjq6Q/test-tmp/rpc-test-7f6bcde31324435e9b64a3714e956e17.sock every 8 connection(s)
W20260923 19:33:18.405082 10385 connection.cc:577] server connection from unix:<unnamed>: received bad data: 'Corruption: Invalid packet: message had a length of 2147483710, but we only support messages up to 2147483647 bytes
'
W20260923 19:33:18.405769 10401 connection.cc:196] Error closing socket: Network error: TlsSocket::Close: Broken pipe
[ OK ] Parameters/TestRpc.TestRpcSidecarLimits/SSL_UnixSocket (8290 ms)
[ RUN ] Parameters/TestRpc.TestCallTimeoutDoesntAffectNegotiation/SSL_UnixSocket
I20260923 19:33:18.940733 10413 acceptor_pool.cc:254] collecting diagnostics on the listening RPC socket unix:/tmp/dist-test-taskdqjq6Q/test-tmp/rpc-test-f24e5d12335540c489f796b3caabba98.sock every 8 connection(s)
I20260923 19:33:18.941069 10414 acceptor_pool.cc:254] collecting diagnostics on the listening RPC socket unix:/tmp/dist-test-taskdqjq6Q/test-tmp/rpc-test-f24e5d12335540c489f796b3caabba98.sock every 8 connection(s)
W20260923 19:33:18.955420 10409 negotiation.cc:266] Injecting 500ms delay in negotiation
I20260923 19:33:19.005739 10121 rpc-test-base.h:595] status: Timed out: connection negotiation to unix:/tmp/dist-test-taskdqjq6Q/test-tmp/rpc-test-f24e5d12335540c489f796b3caabba98.sock for RPC Sleep timed out after 0.050s (ON_OUTBOUND_QUEUE), seconds elapsed: 0.0510243
[ OK ] Parameters/TestRpc.TestCallTimeoutDoesntAffectNegotiation/SSL_UnixSocket (546 ms)
[ RUN ] Parameters/TestRpc.TestRpcHandlerLatencyMetric/SSL_UnixSocket
I20260923 19:33:19.492350 10438 acceptor_pool.cc:254] collecting diagnostics on the listening RPC socket unix:/tmp/dist-test-taskdqjq6Q/test-tmp/rpc-test-92ebe0c599724ce18fbf46821db4950e.sock every 8 connection(s)
I20260923 19:33:19.492547 10439 acceptor_pool.cc:254] collecting diagnostics on the listening RPC socket unix:/tmp/dist-test-taskdqjq6Q/test-tmp/rpc-test-92ebe0c599724ce18fbf46821db4950e.sock every 8 connection(s)
I20260923 19:33:19.529950 10121 rpc-test.cc:1236] Sleep() min lat: 20628
I20260923 19:33:19.530113 10121 rpc-test.cc:1237] Sleep() mean lat: 20628
I20260923 19:33:19.530202 10121 rpc-test.cc:1238] Sleep() max lat: 20628
I20260923 19:33:19.530251 10121 rpc-test.cc:1239] Sleep() #calls: 1
W20260923 19:33:19.531472 10435 connection.cc:196] Error closing socket: Network error: TlsSocket::Close: Broken pipe
[ OK ] Parameters/TestRpc.TestRpcHandlerLatencyMetric/SSL_UnixSocket (69 ms)
[ RUN ] Parameters/TestRpc.TimedOutOnResponseMetricServiceQueue/SSL_UnixSocket
I20260923 19:33:19.549612 10464 acceptor_pool.cc:254] collecting diagnostics on the listening RPC socket unix:/tmp/dist-test-taskdqjq6Q/test-tmp/rpc-test-7883b56ee6234dc2be370d8f75c84499.sock every 8 connection(s)
I20260923 19:33:19.549890 10465 acceptor_pool.cc:254] collecting diagnostics on the listening RPC socket unix:/tmp/dist-test-taskdqjq6Q/test-tmp/rpc-test-7883b56ee6234dc2be370d8f75c84499.sock every 8 connection(s)
W20260923 19:33:19.611174 10466 rpcz_store.cc:267] Call kudu.rpc_test.CalculatorService.Sleep from unix:<unnamed> (request call id 2) took 20 ms (client timeout 20 ms). Trace:
W20260923 19:33:19.611351 10466 rpcz_store.cc:269] 0923 19:33:19.590822 (+ 0us) service_pool.cc:170] Inserting onto call queue
0923 19:33:19.611124 (+ 20302us) service_pool.cc:214] Skipping call since client already timed out
0923 19:33:19.611159 (+ 35us) inbound_call.cc:173] Queueing failure response
Metrics: {}
[ OK ] Parameters/TestRpc.TimedOutOnResponseMetricServiceQueue/SSL_UnixSocket (80 ms)
[ RUN ] Parameters/TestRpc.RpcPendingConnectionsMetric/SSL_UnixSocket
I20260923 19:33:19.620164 10487 acceptor_pool.cc:254] collecting diagnostics on the listening RPC socket 0.0.0.0:46751 every 8 connection(s)
I20260923 19:33:19.620411 10488 acceptor_pool.cc:254] collecting diagnostics on the listening RPC socket 0.0.0.0:46751 every 8 connection(s)
W20260923 19:33:19.622315 10483 negotiation.cc:337] Failed RPC negotiation. Trace:
0923 19:33:19.621761 (+ 0us) reactor.cc:625] Submitting negotiation task for server connection from 127.0.0.1:47738 (local address 127.0.0.1:46751)
0923 19:33:19.621915 (+ 154us) server_negotiation.cc:206] Beginning negotiation
0923 19:33:19.621918 (+ 3us) server_negotiation.cc:399] Waiting for connection header
0923 19:33:19.622043 (+ 125us) negotiation.cc:327] Negotiation complete: Network error: Server connection negotiation failed: server connection from 127.0.0.1:47738: BlockingRecv error: recv got EOF from 127.0.0.1:47738 (error 108)
Metrics: {"server-negotiator.queue_time_us":49}
[ OK ] Parameters/TestRpc.RpcPendingConnectionsMetric/SSL_UnixSocket (19 ms)
[ RUN ] Parameters/TestRpc.TestRpcContextClientDeadline/SSL_UnixSocket
I20260923 19:33:19.647583 10503 acceptor_pool.cc:254] collecting diagnostics on the listening RPC socket unix:/tmp/dist-test-taskdqjq6Q/test-tmp/rpc-test-ee02d2be90ec40b599af00e40a781870.sock every 8 connection(s)
I20260923 19:33:19.647810 10504 acceptor_pool.cc:254] collecting diagnostics on the listening RPC socket unix:/tmp/dist-test-taskdqjq6Q/test-tmp/rpc-test-ee02d2be90ec40b599af00e40a781870.sock every 8 connection(s)
[ OK ] Parameters/TestRpc.TestRpcContextClientDeadline/SSL_UnixSocket (82 ms)
[ RUN ] Parameters/TestRpc.TestApplicationFeatureFlagUnsupportedServer/SSL_UnixSocket
I20260923 19:33:19.732270 10528 acceptor_pool.cc:254] collecting diagnostics on the listening RPC socket unix:/tmp/dist-test-taskdqjq6Q/test-tmp/rpc-test-9262fdc72dd842b4b0b7d19b73e4808b.sock every 8 connection(s)
I20260923 19:33:19.732481 10529 acceptor_pool.cc:254] collecting diagnostics on the listening RPC socket unix:/tmp/dist-test-taskdqjq6Q/test-tmp/rpc-test-9262fdc72dd842b4b0b7d19b73e4808b.sock every 8 connection(s)
W20260923 19:33:19.778365 10525 connection.cc:196] Error closing socket: Network error: TlsSocket::Close: Broken pipe
[ OK ] Parameters/TestRpc.TestApplicationFeatureFlagUnsupportedServer/SSL_UnixSocket (64 ms)
[ RUN ] Parameters/TestRpc.TestCancellationAsync/SSL_UnixSocket
I20260923 19:33:19.797587 10553 acceptor_pool.cc:254] collecting diagnostics on the listening RPC socket unix:/tmp/dist-test-taskdqjq6Q/test-tmp/rpc-test-add2bfaf48154a06a1b529d8d3ae46e3.sock every 8 connection(s)
I20260923 19:33:19.797837 10554 acceptor_pool.cc:254] collecting diagnostics on the listening RPC socket unix:/tmp/dist-test-taskdqjq6Q/test-tmp/rpc-test-add2bfaf48154a06a1b529d8d3ae46e3.sock every 8 connection(s)
I20260923 19:33:19.798784 10121 rpc-test.cc:1716] Connecting to unix:/tmp/dist-test-taskdqjq6Q/test-tmp/rpc-test-add2bfaf48154a06a1b529d8d3ae46e3.sock
I20260923 19:33:19.833310 10121 test_util.cc:268] Using random seed: -1908747061
I20260923 19:33:19.867463 10557 rpc-test-base.h:240] got call: sleep_micros: 500 pattern: 4294967295 num_repetitions: 2097152 sidecar_idx: 0
I20260923 19:33:19.894657 10556 rpc-test-base.h:240] got call: sleep_micros: 500 pattern: 4294967295 num_repetitions: 2097152 sidecar_idx: 0
I20260923 19:33:19.921890 10555 rpc-test-base.h:240] got call: sleep_micros: 500 pattern: 4294967295 num_repetitions: 2097152 sidecar_idx: 0
I20260923 19:33:19.950701 10557 rpc-test-base.h:240] got call: sleep_micros: 500 pattern: 4294967295 num_repetitions: 2097152 sidecar_idx: 0
I20260923 19:33:19.988485 10555 rpc-test-base.h:240] got call: sleep_micros: 500 pattern: 4294967295 num_repetitions: 2097152 sidecar_idx: 0
I20260923 19:33:20.020968 10557 rpc-test-base.h:240] got call: sleep_micros: 500 pattern: 4294967295 num_repetitions: 2097152 sidecar_idx: 0
I20260923 19:33:20.052954 10555 rpc-test-base.h:240] got call: sleep_micros: 500 pattern: 4294967295 num_repetitions: 2097152 sidecar_idx: 0
W20260923 19:33:20.054931 10550 connection.cc:196] Error closing socket: Network error: TlsSocket::Close: Broken pipe
W20260923 19:33:20.067796 10550 connection.cc:441] server connection from unix:<unnamed> torn down before Call kudu.rpc.GenericCalculatorService.SleepWithSidecar from unix:<unnamed> (request call id 8) could send its response
W20260923 19:33:20.091912 10550 connection.cc:441] server connection from unix:<unnamed> torn down before Call kudu.rpc.GenericCalculatorService.SleepWithSidecar from unix:<unnamed> (request call id 9) could send its response
[ OK ] Parameters/TestRpc.TestCancellationAsync/SSL_UnixSocket (313 ms)
[ RUN ] Parameters/TestRpc.TestPerformanceBySocketType/SSL_UnixSocket
I20260923 19:33:20.121755 10578 acceptor_pool.cc:254] collecting diagnostics on the listening RPC socket unix:/tmp/dist-test-taskdqjq6Q/test-tmp/rpc-test-b2b6a4ce312346eba0f3f5a03d7c4255.sock every 8 connection(s)
I20260923 19:33:20.122011 10579 acceptor_pool.cc:254] collecting diagnostics on the listening RPC socket unix:/tmp/dist-test-taskdqjq6Q/test-tmp/rpc-test-b2b6a4ce312346eba0f3f5a03d7c4255.sock every 8 connection(s)
I20260923 19:33:20.123023 10121 rpc-test.cc:1846] Connecting to unix:/tmp/dist-test-taskdqjq6Q/test-tmp/rpc-test-b2b6a4ce312346eba0f3f5a03d7c4255.sock
I20260923 19:33:23.208987 10121 rpc-test.cc:1859] Sending 1024MB via ssl-enabled unix socket: real 3.071s user 2.973s sys 2.237s
I20260923 19:33:26.285774 10121 rpc-test.cc:1859] Sending 1024MB via ssl-enabled unix socket: real 3.077s user 2.944s sys 2.266s
I20260923 19:33:29.308737 10121 rpc-test.cc:1859] Sending 1024MB via ssl-enabled unix socket: real 3.023s user 2.916s sys 2.194s
I20260923 19:33:32.438545 10121 rpc-test.cc:1859] Sending 1024MB via ssl-enabled unix socket: real 3.130s user 3.070s sys 2.237s
I20260923 19:33:35.528273 10121 rpc-test.cc:1859] Sending 1024MB via ssl-enabled unix socket: real 3.090s user 3.023s sys 2.207s
W20260923 19:33:35.529266 10575 connection.cc:196] Error closing socket: Network error: TlsSocket::Close: Broken pipe
[ OK ] Parameters/TestRpc.TestPerformanceBySocketType/SSL_UnixSocket (15440 ms)
[----------] 20 tests from Parameters/TestRpc (50549 ms total)
[----------] 1 test from Parameters/TestRpcSocketTxRxQueue
[ RUN ] Parameters/TestRpcSocketTxRxQueue.AcceptorRxQueueSizeMetric/0
I20260923 19:33:35.544101 10603 acceptor_pool.cc:254] collecting diagnostics on the listening RPC socket 0.0.0.0:35891 every 1 connection(s)
I20260923 19:33:35.544301 10604 acceptor_pool.cc:254] collecting diagnostics on the listening RPC socket 0.0.0.0:35891 every 1 connection(s)
W20260923 19:33:35.545851 10599 negotiation.cc:337] Failed RPC negotiation. Trace:
0923 19:33:35.545478 (+ 0us) reactor.cc:625] Submitting negotiation task for server connection from 127.0.0.1:56836 (local address 127.0.0.1:35891)
0923 19:33:35.545620 (+ 142us) server_negotiation.cc:206] Beginning negotiation
0923 19:33:35.545624 (+ 4us) server_negotiation.cc:399] Waiting for connection header
0923 19:33:35.545745 (+ 121us) negotiation.cc:327] Negotiation complete: Network error: Server connection negotiation failed: server connection from 127.0.0.1:56836: BlockingRecv error: recv got EOF from 127.0.0.1:56836 (error 108)
Metrics: {"server-negotiator.queue_time_us":47}
[ OK ] Parameters/TestRpcSocketTxRxQueue.AcceptorRxQueueSizeMetric/0 (13 ms)
[----------] 1 test from Parameters/TestRpcSocketTxRxQueue (13 ms total)
[----------] Global test environment tear-down
[==========] 21 tests from 2 test suites ran. (50563 ms total)
[ PASSED ] 20 tests.
[ FAILED ] 1 test, listed below:
[ FAILED ] Parameters/TestRpc.TestCallWithChainCertAndChainCA/SSL_UnixSocket, where GetParam() = (true, true)
1 FAILED TEST