Diagnosed failure
Parameters/TestRpc.TestCallWithChainCertAndChainCA/SSL_UnixSocket: /data0/somelongdirectorytoavoidrpathissues/src/kudu/src/kudu/rpc/rpc-test.cc:270: Failure
Failed
Bad status: Runtime error: could not verify certificate chain (error with cert: subject=CN = localhost, ST = sadfjas, C = AS, emailAddress = sdflkdsajf, O = lskdfjlsad, OU = sldfkja, issuer=C = AS, ST = ASDfkjdhf, L = lskdjf, O = saldfja, OU = skdjf, CN = localhost, emailAddress = sadjflkadsj): : certificate has expired
Google Test trace:
/data0/somelongdirectorytoavoidrpathissues/src/kudu/src/kudu/rpc/rpc-test.cc:267: Connecting to unix:/tmp/dist-test-taskQQNIuT/test-tmp/rpc-test-150a3f16b52f4af0a1a210b46e07c907.sock
I20260924 03:10:53.155218 379 test_util.cc:175] -----------------------------------------------
I20260924 03:10:53.155300 379 test_util.cc:176] Had fatal failures, leaving test files at /tmp/dist-test-taskQQNIuT/test-tmp/rpc-test.6.Parameters_TestRpc.TestCallWithChainCertAndChainCA_SSL_UnixSocket.1790219452992908-379-0
Full log
Note: This is test shard 7 of 8.
[==========] Running 21 tests from 2 test suites.
[----------] Global test environment set-up.
[----------] 20 tests from Parameters/TestRpc
[ RUN ] Parameters/TestRpc.TestMessengerCreateDestroy/SSL_UnixSocket
WARNING: Logging before InitGoogleLogging() is written to STDERR
I20260924 03:10:53.056250 379 rpc-test.cc:169] started messenger TestCreateDestroy
[ OK ] Parameters/TestRpc.TestMessengerCreateDestroy/SSL_UnixSocket (46 ms)
[ RUN ] Parameters/TestRpc.TestNegotiationDeadlock/SSL_UnixSocket
I20260924 03:10:53.075397 399 acceptor_pool.cc:254] collecting diagnostics on the listening RPC socket unix:/tmp/dist-test-taskQQNIuT/test-tmp/rpc-test-928f05c8185b44269fd6005d20ec0b78.sock every 8 connection(s)
I20260924 03:10:53.075681 400 acceptor_pool.cc:254] collecting diagnostics on the listening RPC socket unix:/tmp/dist-test-taskQQNIuT/test-tmp/rpc-test-928f05c8185b44269fd6005d20ec0b78.sock every 8 connection(s)
[ OK ] Parameters/TestRpc.TestNegotiationDeadlock/SSL_UnixSocket (34 ms)
[ RUN ] Parameters/TestRpc.TestCallWithChainCertAndChainCA/SSL_UnixSocket
I20260924 03:10:53.142805 415 acceptor_pool.cc:254] collecting diagnostics on the listening RPC socket unix:/tmp/dist-test-taskQQNIuT/test-tmp/rpc-test-150a3f16b52f4af0a1a210b46e07c907.sock every 8 connection(s)
I20260924 03:10:53.143141 416 acceptor_pool.cc:254] collecting diagnostics on the listening RPC socket unix:/tmp/dist-test-taskQQNIuT/test-tmp/rpc-test-150a3f16b52f4af0a1a210b46e07c907.sock every 8 connection(s)
/data0/somelongdirectorytoavoidrpathissues/src/kudu/src/kudu/rpc/rpc-test.cc:270: Failure
Failed
Bad status: Runtime error: could not verify certificate chain (error with cert: subject=CN = localhost, ST = sadfjas, C = AS, emailAddress = sdflkdsajf, O = lskdfjlsad, OU = sldfkja, issuer=C = AS, ST = ASDfkjdhf, L = lskdjf, O = saldfja, OU = skdjf, CN = localhost, emailAddress = sadjflkadsj): : certificate has expired
Google Test trace:
/data0/somelongdirectorytoavoidrpathissues/src/kudu/src/kudu/rpc/rpc-test.cc:267: Connecting to unix:/tmp/dist-test-taskQQNIuT/test-tmp/rpc-test-150a3f16b52f4af0a1a210b46e07c907.sock
I20260924 03:10:53.155218 379 test_util.cc:175] -----------------------------------------------
I20260924 03:10:53.155300 379 test_util.cc:176] Had fatal failures, leaving test files at /tmp/dist-test-taskQQNIuT/test-tmp/rpc-test.6.Parameters_TestRpc.TestCallWithChainCertAndChainCA_SSL_UnixSocket.1790219452992908-379-0
[ FAILED ] Parameters/TestRpc.TestCallWithChainCertAndChainCA/SSL_UnixSocket, where GetParam() = (true, true) (61 ms)
[ RUN ] Parameters/TestRpc.TestCallWithPasswordProtectedKey/SSL_UnixSocket
I20260924 03:10:53.166821 440 acceptor_pool.cc:254] collecting diagnostics on the listening RPC socket unix:/tmp/dist-test-taskQQNIuT/test-tmp/rpc-test-613851afd4f14fe3a5f2d7f5b90ee44c.sock every 8 connection(s)
I20260924 03:10:53.167116 441 acceptor_pool.cc:254] collecting diagnostics on the listening RPC socket unix:/tmp/dist-test-taskQQNIuT/test-tmp/rpc-test-613851afd4f14fe3a5f2d7f5b90ee44c.sock every 8 connection(s)
W20260924 03:10:53.197657 437 connection.cc:196] Error closing socket: Network error: TlsSocket::Close: Broken pipe
[ OK ] Parameters/TestRpc.TestCallWithPasswordProtectedKey/SSL_UnixSocket (47 ms)
[ RUN ] Parameters/TestRpc.TestCallToBadServer/SSL_UnixSocket
I20260924 03:10:53.213292 379 rpc-test.cc:394] Status: Network error: Client connection negotiation failed: client connection to 0.0.0.0:0: connect: Connection refused (error 111)
I20260924 03:10:53.213965 379 rpc-test.cc:394] Status: Network error: Client connection negotiation failed: client connection to 0.0.0.0:0: connect: Connection refused (error 111)
I20260924 03:10:53.214624 379 rpc-test.cc:394] Status: Network error: Client connection negotiation failed: client connection to 0.0.0.0:0: connect: Connection refused (error 111)
I20260924 03:10:53.215127 379 rpc-test.cc:394] Status: Network error: Client connection negotiation failed: client connection to 0.0.0.0:0: connect: Connection refused (error 111)
I20260924 03:10:53.215646 379 rpc-test.cc:394] Status: Network error: Client connection negotiation failed: client connection to 0.0.0.0:0: connect: Connection refused (error 111)
[ OK ] Parameters/TestRpc.TestCallToBadServer/SSL_UnixSocket (14 ms)
[ RUN ] Parameters/TestRpc.TestWrongService/SSL_UnixSocket
I20260924 03:10:53.227694 475 acceptor_pool.cc:254] collecting diagnostics on the listening RPC socket unix:/tmp/dist-test-taskQQNIuT/test-tmp/rpc-test-0a2467a7d58b4017b21555cd9200969b.sock every 8 connection(s)
I20260924 03:10:53.227934 476 acceptor_pool.cc:254] collecting diagnostics on the listening RPC socket unix:/tmp/dist-test-taskQQNIuT/test-tmp/rpc-test-0a2467a7d58b4017b21555cd9200969b.sock every 8 connection(s)
I20260924 03:10:53.259443 472 messenger.cc:345] service WrongServiceName not registered on TestServer
[ OK ] Parameters/TestRpc.TestWrongService/SSL_UnixSocket (47 ms)
[ RUN ] Parameters/TestRpc.TestConnectionKeepalive/SSL_UnixSocket
I20260924 03:10:53.287824 498 acceptor_pool.cc:254] collecting diagnostics on the listening RPC socket unix:/tmp/dist-test-taskQQNIuT/test-tmp/rpc-test-5978a39ce32b4fe28898b5e1bf2ae846.sock every 8 connection(s)
I20260924 03:10:53.288501 499 acceptor_pool.cc:254] collecting diagnostics on the listening RPC socket unix:/tmp/dist-test-taskQQNIuT/test-tmp/rpc-test-5978a39ce32b4fe28898b5e1bf2ae846.sock every 8 connection(s)
I20260924 03:10:53.289356 379 rpc-test.cc:488] Connecting to unix:/tmp/dist-test-taskQQNIuT/test-tmp/rpc-test-5978a39ce32b4fe28898b5e1bf2ae846.sock
W20260924 03:10:53.767072 511 connection.cc:196] Error closing socket: Network error: TlsSocket::Close: Broken pipe
[ OK ] Parameters/TestRpc.TestConnectionKeepalive/SSL_UnixSocket (1051 ms)
[ RUN ] Parameters/TestRpc.TestClientConnectionMetrics/SSL_UnixSocket
I20260924 03:10:54.382282 523 acceptor_pool.cc:254] collecting diagnostics on the listening RPC socket unix:/tmp/dist-test-taskQQNIuT/test-tmp/rpc-test-1b0bb170ac824e1d9028e3a548044765.sock every 8 connection(s)
I20260924 03:10:54.382571 524 acceptor_pool.cc:254] collecting diagnostics on the listening RPC socket unix:/tmp/dist-test-taskQQNIuT/test-tmp/rpc-test-1b0bb170ac824e1d9028e3a548044765.sock every 8 connection(s)
I20260924 03:10:54.383718 379 rpc-test.cc:569] Connecting to unix:/tmp/dist-test-taskQQNIuT/test-tmp/rpc-test-1b0bb170ac824e1d9028e3a548044765.sock
W20260924 03:11:15.409861 520 connection.cc:196] Error closing socket: Network error: TlsSocket::Close: Broken pipe
[ OK ] Parameters/TestRpc.TestClientConnectionMetrics/SSL_UnixSocket (21099 ms)
[ RUN ] Parameters/TestRpc.TestCredentialsPolicy/SSL_UnixSocket
I20260924 03:11:15.436641 546 acceptor_pool.cc:254] collecting diagnostics on the listening RPC socket unix:/tmp/dist-test-taskQQNIuT/test-tmp/rpc-test-a60b86bfd6a24bfdbc5e5deaea31fc8f.sock every 8 connection(s)
I20260924 03:11:15.436885 547 acceptor_pool.cc:254] collecting diagnostics on the listening RPC socket unix:/tmp/dist-test-taskQQNIuT/test-tmp/rpc-test-a60b86bfd6a24bfdbc5e5deaea31fc8f.sock every 8 connection(s)
I20260924 03:11:15.437824 379 rpc-test.cc:700] Connecting to unix:/tmp/dist-test-taskQQNIuT/test-tmp/rpc-test-a60b86bfd6a24bfdbc5e5deaea31fc8f.sock
W20260924 03:11:15.460740 545 connection.cc:196] Error closing socket: Network error: TlsSocket::Close: Broken pipe
W20260924 03:11:15.467840 545 connection.cc:196] Error closing socket: Network error: TlsSocket::Close: Broken pipe
[ OK ] Parameters/TestRpc.TestCredentialsPolicy/SSL_UnixSocket (55 ms)
[ RUN ] Parameters/TestRpc.TestCallLongerThanKeepalive/SSL_UnixSocket
I20260924 03:11:15.488297 571 acceptor_pool.cc:254] collecting diagnostics on the listening RPC socket unix:/tmp/dist-test-taskQQNIuT/test-tmp/rpc-test-70c16defc66d4f26bcc9734f552a91af.sock every 8 connection(s)
I20260924 03:11:15.488564 572 acceptor_pool.cc:254] collecting diagnostics on the listening RPC socket unix:/tmp/dist-test-taskQQNIuT/test-tmp/rpc-test-70c16defc66d4f26bcc9734f552a91af.sock every 8 connection(s)
I20260924 03:11:15.501647 575 rpc-test-base.h:222] got call: sleep_micros: 3000000 deferred: true
I20260924 03:11:18.503321 575 rpcz_store.cc:275] Call kudu.rpc.GenericCalculatorService.Sleep from unix:<unnamed> (request call id 0) took 3001 ms. Trace:
I20260924 03:11:18.503517 575 rpcz_store.cc:276] 0924 03:11:15.501551 (+ 0us) service_pool.cc:170] Inserting onto call queue
0924 03:11:15.501612 (+ 61us) service_pool.cc:227] Handling call
0924 03:11:18.503268 (+3001656us) inbound_call.cc:173] Queueing success response
Metrics: {}
W20260924 03:11:18.505766 568 connection.cc:196] Error closing socket: Network error: TlsSocket::Close: Broken pipe
[ OK ] Parameters/TestRpc.TestCallLongerThanKeepalive/SSL_UnixSocket (3039 ms)
[ RUN ] Parameters/TestRpc.TestRpcSidecar/SSL_UnixSocket
I20260924 03:11:18.520501 596 acceptor_pool.cc:254] collecting diagnostics on the listening RPC socket unix:/tmp/dist-test-taskQQNIuT/test-tmp/rpc-test-b7bef8d0f00449c384aac8b06acc0068.sock every 8 connection(s)
I20260924 03:11:18.520785 597 acceptor_pool.cc:254] collecting diagnostics on the listening RPC socket unix:/tmp/dist-test-taskQQNIuT/test-tmp/rpc-test-b7bef8d0f00449c384aac8b06acc0068.sock every 8 connection(s)
W20260924 03:11:18.622913 593 connection.cc:196] Error closing socket: Network error: TlsSocket::Close: Broken pipe
[ OK ] Parameters/TestRpc.TestRpcSidecar/SSL_UnixSocket (115 ms)
[ RUN ] Parameters/TestRpc.TestRpcSidecarLimits/SSL_UnixSocket
I20260924 03:11:20.743984 621 acceptor_pool.cc:254] collecting diagnostics on the listening RPC socket unix:/tmp/dist-test-taskQQNIuT/test-tmp/rpc-test-8b13179d40c24d5888c586b187c8d4b8.sock every 8 connection(s)
I20260924 03:11:20.744246 622 acceptor_pool.cc:254] collecting diagnostics on the listening RPC socket unix:/tmp/dist-test-taskQQNIuT/test-tmp/rpc-test-8b13179d40c24d5888c586b187c8d4b8.sock every 8 connection(s)
W20260924 03:11:20.759745 379 serialization.cc:72] Serialized kudu.rpc_test.PushStringsRequestPB (2147483654 bytes) is larger than the maximum configured RPC message size (52428800 bytes). Sending anyway, but peer may reject the data.
W20260924 03:11:20.765174 618 connection.cc:535] server connection from unix:<unnamed> recv error: Network error: RPC frame had a length of 2147483714, but we only support messages up to 52428800 bytes long.
W20260924 03:11:20.765300 618 connection.cc:158] shutting down server connection from unix:<unnamed> with pending inbound data: 4/2147483714 bytes received; last active 0 ns ago: status Network error: RPC frame had a length of 2147483714, but we only support messages up to 52428800 bytes long.
W20260924 03:11:20.765759 634 connection.cc:196] Error closing socket: Network error: TlsSocket::Close: Broken pipe
I20260924 03:11:20.783236 646 acceptor_pool.cc:254] collecting diagnostics on the listening RPC socket unix:/tmp/dist-test-taskQQNIuT/test-tmp/rpc-test-8b13179d40c24d5888c586b187c8d4b8.sock every 8 connection(s)
I20260924 03:11:20.783595 647 acceptor_pool.cc:254] collecting diagnostics on the listening RPC socket unix:/tmp/dist-test-taskQQNIuT/test-tmp/rpc-test-8b13179d40c24d5888c586b187c8d4b8.sock every 8 connection(s)
W20260924 03:11:26.369305 643 connection.cc:577] server connection from unix:<unnamed>: received bad data: 'Corruption: Invalid packet: message had a length of 2147483710, but we only support messages up to 2147483647 bytes
'
W20260924 03:11:26.370016 659 connection.cc:196] Error closing socket: Network error: TlsSocket::Close: Broken pipe
[ OK ] Parameters/TestRpc.TestRpcSidecarLimits/SSL_UnixSocket (8218 ms)
[ RUN ] Parameters/TestRpc.TestCallTimeoutDoesntAffectNegotiation/SSL_UnixSocket
I20260924 03:11:26.864708 671 acceptor_pool.cc:254] collecting diagnostics on the listening RPC socket unix:/tmp/dist-test-taskQQNIuT/test-tmp/rpc-test-b11b04c49e7d4b65b3e8ac43eab131c5.sock every 8 connection(s)
I20260924 03:11:26.864995 672 acceptor_pool.cc:254] collecting diagnostics on the listening RPC socket unix:/tmp/dist-test-taskQQNIuT/test-tmp/rpc-test-b11b04c49e7d4b65b3e8ac43eab131c5.sock every 8 connection(s)
W20260924 03:11:26.895602 667 negotiation.cc:266] Injecting 500ms delay in negotiation
I20260924 03:11:26.946149 379 rpc-test-base.h:595] status: Timed out: connection negotiation to unix:/tmp/dist-test-taskQQNIuT/test-tmp/rpc-test-b11b04c49e7d4b65b3e8ac43eab131c5.sock for RPC Sleep timed out after 0.050s (ON_OUTBOUND_QUEUE), seconds elapsed: 0.051052
[ OK ] Parameters/TestRpc.TestCallTimeoutDoesntAffectNegotiation/SSL_UnixSocket (561 ms)
[ RUN ] Parameters/TestRpc.TestRpcHandlerLatencyMetric/SSL_UnixSocket
I20260924 03:11:27.425640 696 acceptor_pool.cc:254] collecting diagnostics on the listening RPC socket unix:/tmp/dist-test-taskQQNIuT/test-tmp/rpc-test-c0ad3c7923184cb1a3aa00921a6aa528.sock every 8 connection(s)
I20260924 03:11:27.425863 697 acceptor_pool.cc:254] collecting diagnostics on the listening RPC socket unix:/tmp/dist-test-taskQQNIuT/test-tmp/rpc-test-c0ad3c7923184cb1a3aa00921a6aa528.sock every 8 connection(s)
I20260924 03:11:27.469010 379 rpc-test.cc:1236] Sleep() min lat: 20603
I20260924 03:11:27.469101 379 rpc-test.cc:1237] Sleep() mean lat: 20603
I20260924 03:11:27.469141 379 rpc-test.cc:1238] Sleep() max lat: 20603
I20260924 03:11:27.469159 379 rpc-test.cc:1239] Sleep() #calls: 1
[ OK ] Parameters/TestRpc.TestRpcHandlerLatencyMetric/SSL_UnixSocket (68 ms)
[ RUN ] Parameters/TestRpc.TimedOutOnResponseMetricServiceQueue/SSL_UnixSocket
I20260924 03:11:27.492496 722 acceptor_pool.cc:254] collecting diagnostics on the listening RPC socket unix:/tmp/dist-test-taskQQNIuT/test-tmp/rpc-test-73e3373033aa490c83ac0cea89a4a067.sock every 8 connection(s)
I20260924 03:11:27.492714 723 acceptor_pool.cc:254] collecting diagnostics on the listening RPC socket unix:/tmp/dist-test-taskQQNIuT/test-tmp/rpc-test-73e3373033aa490c83ac0cea89a4a067.sock every 8 connection(s)
W20260924 03:11:27.555809 724 rpcz_store.cc:267] Call kudu.rpc_test.CalculatorService.Sleep from unix:<unnamed> (request call id 2) took 20 ms (client timeout 20 ms). Trace:
W20260924 03:11:27.555946 724 rpcz_store.cc:269] 0924 03:11:27.535469 (+ 0us) service_pool.cc:170] Inserting onto call queue
0924 03:11:27.555735 (+ 20266us) service_pool.cc:214] Skipping call since client already timed out
0924 03:11:27.555788 (+ 53us) inbound_call.cc:173] Queueing failure response
Metrics: {}
[ OK ] Parameters/TestRpc.TimedOutOnResponseMetricServiceQueue/SSL_UnixSocket (85 ms)
[ RUN ] Parameters/TestRpc.RpcPendingConnectionsMetric/SSL_UnixSocket
I20260924 03:11:27.564643 745 acceptor_pool.cc:254] collecting diagnostics on the listening RPC socket 0.0.0.0:43869 every 8 connection(s)
I20260924 03:11:27.564850 746 acceptor_pool.cc:254] collecting diagnostics on the listening RPC socket 0.0.0.0:43869 every 8 connection(s)
W20260924 03:11:27.574515 741 negotiation.cc:337] Failed RPC negotiation. Trace:
0924 03:11:27.573651 (+ 0us) reactor.cc:625] Submitting negotiation task for server connection from 127.0.0.1:43066 (local address 127.0.0.1:43869)
0924 03:11:27.573870 (+ 219us) server_negotiation.cc:206] Beginning negotiation
0924 03:11:27.573879 (+ 9us) server_negotiation.cc:399] Waiting for connection header
0924 03:11:27.574086 (+ 207us) negotiation.cc:327] Negotiation complete: Network error: Server connection negotiation failed: server connection from 127.0.0.1:43066: BlockingRecv error: recv got EOF from 127.0.0.1:43066 (error 108)
Metrics: {"server-negotiator.queue_time_us":69}
[ OK ] Parameters/TestRpc.RpcPendingConnectionsMetric/SSL_UnixSocket (26 ms)
[ RUN ] Parameters/TestRpc.TestRpcContextClientDeadline/SSL_UnixSocket
I20260924 03:11:27.601943 761 acceptor_pool.cc:254] collecting diagnostics on the listening RPC socket unix:/tmp/dist-test-taskQQNIuT/test-tmp/rpc-test-4cac5c23a4fc4e9c83b779bb47fe01f7.sock every 8 connection(s)
I20260924 03:11:27.602245 762 acceptor_pool.cc:254] collecting diagnostics on the listening RPC socket unix:/tmp/dist-test-taskQQNIuT/test-tmp/rpc-test-4cac5c23a4fc4e9c83b779bb47fe01f7.sock every 8 connection(s)
[ OK ] Parameters/TestRpc.TestRpcContextClientDeadline/SSL_UnixSocket (61 ms)
[ RUN ] Parameters/TestRpc.TestApplicationFeatureFlagUnsupportedServer/SSL_UnixSocket
I20260924 03:11:27.666682 786 acceptor_pool.cc:254] collecting diagnostics on the listening RPC socket unix:/tmp/dist-test-taskQQNIuT/test-tmp/rpc-test-76adb09b8bcc42d29d374b4ebe342a40.sock every 8 connection(s)
I20260924 03:11:27.666909 787 acceptor_pool.cc:254] collecting diagnostics on the listening RPC socket unix:/tmp/dist-test-taskQQNIuT/test-tmp/rpc-test-76adb09b8bcc42d29d374b4ebe342a40.sock every 8 connection(s)
[ OK ] Parameters/TestRpc.TestApplicationFeatureFlagUnsupportedServer/SSL_UnixSocket (42 ms)
[ RUN ] Parameters/TestRpc.TestCancellationAsync/SSL_UnixSocket
I20260924 03:11:27.723377 811 acceptor_pool.cc:254] collecting diagnostics on the listening RPC socket unix:/tmp/dist-test-taskQQNIuT/test-tmp/rpc-test-6457e1e640b148b0b5e65b1607c5e75b.sock every 8 connection(s)
I20260924 03:11:27.723663 812 acceptor_pool.cc:254] collecting diagnostics on the listening RPC socket unix:/tmp/dist-test-taskQQNIuT/test-tmp/rpc-test-6457e1e640b148b0b5e65b1607c5e75b.sock every 8 connection(s)
I20260924 03:11:27.724506 379 rpc-test.cc:1716] Connecting to unix:/tmp/dist-test-taskQQNIuT/test-tmp/rpc-test-6457e1e640b148b0b5e65b1607c5e75b.sock
I20260924 03:11:27.741238 379 test_util.cc:268] Using random seed: -190642905
I20260924 03:11:27.773871 815 rpc-test-base.h:240] got call: sleep_micros: 500 pattern: 4294967295 num_repetitions: 2097152 sidecar_idx: 0
I20260924 03:11:27.800243 814 rpc-test-base.h:240] got call: sleep_micros: 500 pattern: 4294967295 num_repetitions: 2097152 sidecar_idx: 0
I20260924 03:11:27.827739 813 rpc-test-base.h:240] got call: sleep_micros: 500 pattern: 4294967295 num_repetitions: 2097152 sidecar_idx: 0
I20260924 03:11:27.854586 815 rpc-test-base.h:240] got call: sleep_micros: 500 pattern: 4294967295 num_repetitions: 2097152 sidecar_idx: 0
I20260924 03:11:27.892696 814 rpc-test-base.h:240] got call: sleep_micros: 500 pattern: 4294967295 num_repetitions: 2097152 sidecar_idx: 0
I20260924 03:11:27.921415 815 rpc-test-base.h:240] got call: sleep_micros: 500 pattern: 4294967295 num_repetitions: 2097152 sidecar_idx: 0
I20260924 03:11:27.949290 814 rpc-test-base.h:240] got call: sleep_micros: 500 pattern: 4294967295 num_repetitions: 2097152 sidecar_idx: 0
W20260924 03:11:27.951141 808 connection.cc:196] Error closing socket: Network error: TlsSocket::Close: Broken pipe
W20260924 03:11:27.967329 808 connection.cc:441] server connection from unix:<unnamed> torn down before Call kudu.rpc.GenericCalculatorService.SleepWithSidecar from unix:<unnamed> (request call id 8) could send its response
W20260924 03:11:27.983651 808 connection.cc:441] server connection from unix:<unnamed> torn down before Call kudu.rpc.GenericCalculatorService.SleepWithSidecar from unix:<unnamed> (request call id 9) could send its response
[ OK ] Parameters/TestRpc.TestCancellationAsync/SSL_UnixSocket (295 ms)
[ RUN ] Parameters/TestRpc.TestPerformanceBySocketType/SSL_UnixSocket
I20260924 03:11:28.031703 836 acceptor_pool.cc:254] collecting diagnostics on the listening RPC socket unix:/tmp/dist-test-taskQQNIuT/test-tmp/rpc-test-a4bfd1587ddc4d1ba5233f08f9a16025.sock every 8 connection(s)
I20260924 03:11:28.031935 837 acceptor_pool.cc:254] collecting diagnostics on the listening RPC socket unix:/tmp/dist-test-taskQQNIuT/test-tmp/rpc-test-a4bfd1587ddc4d1ba5233f08f9a16025.sock every 8 connection(s)
I20260924 03:11:28.032831 379 rpc-test.cc:1846] Connecting to unix:/tmp/dist-test-taskQQNIuT/test-tmp/rpc-test-a4bfd1587ddc4d1ba5233f08f9a16025.sock
I20260924 03:11:30.985170 379 rpc-test.cc:1859] Sending 1024MB via ssl-enabled unix socket: real 2.930s user 2.849s sys 2.162s
I20260924 03:11:33.943187 379 rpc-test.cc:1859] Sending 1024MB via ssl-enabled unix socket: real 2.958s user 2.909s sys 2.146s
I20260924 03:11:36.959339 379 rpc-test.cc:1859] Sending 1024MB via ssl-enabled unix socket: real 3.016s user 3.005s sys 2.147s
I20260924 03:11:39.941352 379 rpc-test.cc:1859] Sending 1024MB via ssl-enabled unix socket: real 2.982s user 2.890s sys 2.210s
I20260924 03:11:42.882185 379 rpc-test.cc:1859] Sending 1024MB via ssl-enabled unix socket: real 2.941s user 2.797s sys 2.214s
W20260924 03:11:42.883419 833 connection.cc:196] Error closing socket: Network error: TlsSocket::Close: Broken pipe
[ OK ] Parameters/TestRpc.TestPerformanceBySocketType/SSL_UnixSocket (14901 ms)
[----------] 20 tests from Parameters/TestRpc (49875 ms total)
[----------] 1 test from Parameters/TestRpcSocketTxRxQueue
[ RUN ] Parameters/TestRpcSocketTxRxQueue.AcceptorRxQueueSizeMetric/0
I20260924 03:11:42.896907 861 acceptor_pool.cc:254] collecting diagnostics on the listening RPC socket 0.0.0.0:45053 every 1 connection(s)
I20260924 03:11:42.897214 862 acceptor_pool.cc:254] collecting diagnostics on the listening RPC socket 0.0.0.0:45053 every 1 connection(s)
W20260924 03:11:42.898896 857 negotiation.cc:337] Failed RPC negotiation. Trace:
0924 03:11:42.898536 (+ 0us) reactor.cc:625] Submitting negotiation task for server connection from 127.0.0.1:54320 (local address 127.0.0.1:45053)
0924 03:11:42.898685 (+ 149us) server_negotiation.cc:206] Beginning negotiation
0924 03:11:42.898689 (+ 4us) server_negotiation.cc:399] Waiting for connection header
0924 03:11:42.898801 (+ 112us) negotiation.cc:327] Negotiation complete: Network error: Server connection negotiation failed: server connection from 127.0.0.1:54320: BlockingRecv error: recv got EOF from 127.0.0.1:54320 (error 108)
Metrics: {"server-negotiator.queue_time_us":51}
[ OK ] Parameters/TestRpcSocketTxRxQueue.AcceptorRxQueueSizeMetric/0 (13 ms)
[----------] 1 test from Parameters/TestRpcSocketTxRxQueue (13 ms total)
[----------] Global test environment tear-down
[==========] 21 tests from 2 test suites ran. (49889 ms total)
[ PASSED ] 20 tests.
[ FAILED ] 1 test, listed below:
[ FAILED ] Parameters/TestRpc.TestCallWithChainCertAndChainCA/SSL_UnixSocket, where GetParam() = (true, true)
1 FAILED TEST