Diagnosed failure

Parameters/TestRpc.TestCallWithChainCertAndChainCA/SSL_TCP: /data0/somelongdirectorytoavoidrpathissues/src/kudu/src/kudu/rpc/rpc-test.cc:270: Failure
Failed
Bad status: Runtime error: could not verify certificate chain (error with cert: subject=CN = localhost, ST = sadfjas, C = AS, emailAddress = sdflkdsajf, O = lskdfjlsad, OU = sldfkja, issuer=C = AS, ST = ASDfkjdhf, L = lskdjf, O = saldfja, OU = skdjf, CN = localhost, emailAddress = sadjflkadsj): : certificate has expired
Google Test trace:
/data0/somelongdirectorytoavoidrpathissues/src/kudu/src/kudu/rpc/rpc-test.cc:267: Connecting to 0.0.0.0:39625
I20260927 18:30:43.069962   379 test_util.cc:175] -----------------------------------------------
I20260927 18:30:43.070070   379 test_util.cc:176] Had fatal failures, leaving test files at /tmp/dist-test-taskSMjG_m/test-tmp/rpc-test.5.Parameters_TestRpc.TestCallWithChainCertAndChainCA_SSL_TCP.1790533842959062-379-0

Full log

Note: This is test shard 6 of 8.
[==========] Running 21 tests from 2 test suites.
[----------] Global test environment set-up.
[----------] 20 tests from Parameters/TestRpc
[ RUN      ] Parameters/TestRpc.TestMessengerCreateDestroy/SSL_TCP
WARNING: Logging before InitGoogleLogging() is written to STDERR
I20260927 18:30:43.003845   379 rpc-test.cc:169] started messenger TestCreateDestroy
[       OK ] Parameters/TestRpc.TestMessengerCreateDestroy/SSL_TCP (25 ms)
[ RUN      ] Parameters/TestRpc.TestNegotiationDeadlock/SSL_TCP
I20260927 18:30:43.020766   399 acceptor_pool.cc:254] collecting diagnostics on the listening RPC socket 0.0.0.0:37955 every 8 connection(s)
I20260927 18:30:43.021024   400 acceptor_pool.cc:254] collecting diagnostics on the listening RPC socket 0.0.0.0:37955 every 8 connection(s)
[       OK ] Parameters/TestRpc.TestNegotiationDeadlock/SSL_TCP (35 ms)
[ RUN      ] Parameters/TestRpc.TestCallWithChainCertAndChainCA/SSL_TCP
I20260927 18:30:43.056771   415 acceptor_pool.cc:254] collecting diagnostics on the listening RPC socket 0.0.0.0:39625 every 8 connection(s)
I20260927 18:30:43.057186   416 acceptor_pool.cc:254] collecting diagnostics on the listening RPC socket 0.0.0.0:39625 every 8 connection(s)
/data0/somelongdirectorytoavoidrpathissues/src/kudu/src/kudu/rpc/rpc-test.cc:270: Failure
Failed
Bad status: Runtime error: could not verify certificate chain (error with cert: subject=CN = localhost, ST = sadfjas, C = AS, emailAddress = sdflkdsajf, O = lskdfjlsad, OU = sldfkja, issuer=C = AS, ST = ASDfkjdhf, L = lskdjf, O = saldfja, OU = skdjf, CN = localhost, emailAddress = sadjflkadsj): : certificate has expired
Google Test trace:
/data0/somelongdirectorytoavoidrpathissues/src/kudu/src/kudu/rpc/rpc-test.cc:267: Connecting to 0.0.0.0:39625
I20260927 18:30:43.069962   379 test_util.cc:175] -----------------------------------------------
I20260927 18:30:43.070070   379 test_util.cc:176] Had fatal failures, leaving test files at /tmp/dist-test-taskSMjG_m/test-tmp/rpc-test.5.Parameters_TestRpc.TestCallWithChainCertAndChainCA_SSL_TCP.1790533842959062-379-0
[  FAILED  ] Parameters/TestRpc.TestCallWithChainCertAndChainCA/SSL_TCP, where GetParam() = (true, false) (27 ms)
[ RUN      ] Parameters/TestRpc.TestCallWithPasswordProtectedKey/SSL_TCP
I20260927 18:30:43.090210   440 acceptor_pool.cc:254] collecting diagnostics on the listening RPC socket 0.0.0.0:41759 every 8 connection(s)
I20260927 18:30:43.090483   441 acceptor_pool.cc:254] collecting diagnostics on the listening RPC socket 0.0.0.0:41759 every 8 connection(s)
[       OK ] Parameters/TestRpc.TestCallWithPasswordProtectedKey/SSL_TCP (58 ms)
[ RUN      ] Parameters/TestRpc.TestCallToBadServer/SSL_TCP
I20260927 18:30:43.172638   379 rpc-test.cc:394] Status: Network error: Client connection negotiation failed: client connection to 0.0.0.0:0: connect: Connection refused (error 111)
I20260927 18:30:43.173590   379 rpc-test.cc:394] Status: Network error: Client connection negotiation failed: client connection to 0.0.0.0:0: connect: Connection refused (error 111)
I20260927 18:30:43.174305   379 rpc-test.cc:394] Status: Network error: Client connection negotiation failed: client connection to 0.0.0.0:0: connect: Connection refused (error 111)
I20260927 18:30:43.174916   379 rpc-test.cc:394] Status: Network error: Client connection negotiation failed: client connection to 0.0.0.0:0: connect: Connection refused (error 111)
I20260927 18:30:43.175562   379 rpc-test.cc:394] Status: Network error: Client connection negotiation failed: client connection to 0.0.0.0:0: connect: Connection refused (error 111)
[       OK ] Parameters/TestRpc.TestCallToBadServer/SSL_TCP (49 ms)
[ RUN      ] Parameters/TestRpc.TestWrongService/SSL_TCP
I20260927 18:30:43.198457   475 acceptor_pool.cc:254] collecting diagnostics on the listening RPC socket 0.0.0.0:41839 every 8 connection(s)
I20260927 18:30:43.198781   476 acceptor_pool.cc:254] collecting diagnostics on the listening RPC socket 0.0.0.0:41839 every 8 connection(s)
I20260927 18:30:43.233064   474 messenger.cc:345] service WrongServiceName not registered on TestServer
[       OK ] Parameters/TestRpc.TestWrongService/SSL_TCP (60 ms)
[ RUN      ] Parameters/TestRpc.TestConnectionKeepalive/SSL_TCP
I20260927 18:30:43.257730   498 acceptor_pool.cc:254] collecting diagnostics on the listening RPC socket 0.0.0.0:45267 every 8 connection(s)
I20260927 18:30:43.258095   499 acceptor_pool.cc:254] collecting diagnostics on the listening RPC socket 0.0.0.0:45267 every 8 connection(s)
I20260927 18:30:43.258932   379 rpc-test.cc:488] Connecting to 0.0.0.0:45267
[       OK ] Parameters/TestRpc.TestConnectionKeepalive/SSL_TCP (1051 ms)
[ RUN      ] Parameters/TestRpc.TestClientConnectionMetrics/SSL_TCP
I20260927 18:30:44.331454   523 acceptor_pool.cc:254] collecting diagnostics on the listening RPC socket 0.0.0.0:34847 every 8 connection(s)
I20260927 18:30:44.331722   524 acceptor_pool.cc:254] collecting diagnostics on the listening RPC socket 0.0.0.0:34847 every 8 connection(s)
I20260927 18:30:44.332649   379 rpc-test.cc:569] Connecting to 0.0.0.0:34847
[       OK ] Parameters/TestRpc.TestClientConnectionMetrics/SSL_TCP (20234 ms)
[ RUN      ] Parameters/TestRpc.TestCredentialsPolicy/SSL_TCP
I20260927 18:31:04.538390   546 acceptor_pool.cc:254] collecting diagnostics on the listening RPC socket 0.0.0.0:34991 every 8 connection(s)
I20260927 18:31:04.538610   547 acceptor_pool.cc:254] collecting diagnostics on the listening RPC socket 0.0.0.0:34991 every 8 connection(s)
I20260927 18:31:04.539644   379 rpc-test.cc:700] Connecting to 0.0.0.0:34991
[       OK ] Parameters/TestRpc.TestCredentialsPolicy/SSL_TCP (58 ms)
[ RUN      ] Parameters/TestRpc.TestCallLongerThanKeepalive/SSL_TCP
I20260927 18:31:04.605106   571 acceptor_pool.cc:254] collecting diagnostics on the listening RPC socket 0.0.0.0:45945 every 8 connection(s)
I20260927 18:31:04.605408   572 acceptor_pool.cc:254] collecting diagnostics on the listening RPC socket 0.0.0.0:45945 every 8 connection(s)
I20260927 18:31:04.642203   575 rpc-test-base.h:222] got call: sleep_micros: 3000000 deferred: true
I20260927 18:31:07.644018   575 rpcz_store.cc:275] Call kudu.rpc.GenericCalculatorService.Sleep from 127.0.0.1:55818 (request call id 0) took 3001 ms. Trace:
I20260927 18:31:07.644177   575 rpcz_store.cc:276] 0927 18:31:04.642097 (+     0us) service_pool.cc:170] Inserting onto call queue
0927 18:31:04.642159 (+    62us) service_pool.cc:227] Handling call
0927 18:31:07.643969 (+3001810us) inbound_call.cc:173] Queueing success response
Metrics: {}
[       OK ] Parameters/TestRpc.TestCallLongerThanKeepalive/SSL_TCP (3068 ms)
[ RUN      ] Parameters/TestRpc.TestRpcSidecar/SSL_TCP
I20260927 18:31:07.688567   596 acceptor_pool.cc:254] collecting diagnostics on the listening RPC socket 0.0.0.0:44029 every 8 connection(s)
I20260927 18:31:07.688858   597 acceptor_pool.cc:254] collecting diagnostics on the listening RPC socket 0.0.0.0:44029 every 8 connection(s)
[       OK ] Parameters/TestRpc.TestRpcSidecar/SSL_TCP (153 ms)
[ RUN      ] Parameters/TestRpc.TestRpcSidecarLimits/SSL_TCP
I20260927 18:31:09.968703   621 acceptor_pool.cc:254] collecting diagnostics on the listening RPC socket 0.0.0.0:45575 every 8 connection(s)
I20260927 18:31:09.969027   622 acceptor_pool.cc:254] collecting diagnostics on the listening RPC socket 0.0.0.0:45575 every 8 connection(s)
W20260927 18:31:09.989589   379 serialization.cc:72] Serialized kudu.rpc_test.PushStringsRequestPB (2147483654 bytes) is larger than the maximum configured RPC message size (52428800 bytes). Sending anyway, but peer may reject the data.
W20260927 18:31:09.996773   620 connection.cc:535] server connection from 127.0.0.1:51138 recv error: Network error: RPC frame had a length of 2147483714, but we only support messages up to 52428800 bytes long.
W20260927 18:31:09.996937   620 connection.cc:158] shutting down server connection from 127.0.0.1:51138 with pending inbound data: 4/2147483714 bytes received; last active 0 ns ago: status Network error: RPC frame had a length of 2147483714, but we only support messages up to 52428800 bytes long.
W20260927 18:31:09.997431   634 connection.cc:196] Error closing socket: Network error: TlsSocket::Close: Connection reset by peer
I20260927 18:31:10.012284   646 acceptor_pool.cc:254] collecting diagnostics on the listening RPC socket 0.0.0.0:46575 every 8 connection(s)
I20260927 18:31:10.012411   647 acceptor_pool.cc:254] collecting diagnostics on the listening RPC socket 0.0.0.0:46575 every 8 connection(s)
W20260927 18:31:15.342722   645 connection.cc:577] server connection from 127.0.0.1:36396: received bad data: 'Corruption: Invalid packet: message had a length of 2147483710, but we only support messages up to 2147483647 bytes
'
[       OK ] Parameters/TestRpc.TestRpcSidecarLimits/SSL_TCP (8005 ms)
[ RUN      ] Parameters/TestRpc.TestCallTimeoutDoesntAffectNegotiation/SSL_TCP
I20260927 18:31:15.833909   671 acceptor_pool.cc:254] collecting diagnostics on the listening RPC socket 0.0.0.0:46127 every 8 connection(s)
I20260927 18:31:15.834187   672 acceptor_pool.cc:254] collecting diagnostics on the listening RPC socket 0.0.0.0:46127 every 8 connection(s)
W20260927 18:31:15.853546   667 negotiation.cc:266] Injecting 500ms delay in negotiation
I20260927 18:31:15.903992   379 rpc-test-base.h:595] status: Timed out: connection negotiation to 0.0.0.0:46127 for RPC Sleep timed out after 0.050s (ON_OUTBOUND_QUEUE), seconds elapsed: 0.051245
[       OK ] Parameters/TestRpc.TestCallTimeoutDoesntAffectNegotiation/SSL_TCP (553 ms)
[ RUN      ] Parameters/TestRpc.TestRpcHandlerLatencyMetric/SSL_TCP
I20260927 18:31:16.380257   696 acceptor_pool.cc:254] collecting diagnostics on the listening RPC socket 0.0.0.0:45943 every 8 connection(s)
I20260927 18:31:16.380586   697 acceptor_pool.cc:254] collecting diagnostics on the listening RPC socket 0.0.0.0:45943 every 8 connection(s)
I20260927 18:31:16.425158   379 rpc-test.cc:1236] Sleep() min lat: 20645
I20260927 18:31:16.425246   379 rpc-test.cc:1237] Sleep() mean lat: 20645
I20260927 18:31:16.425283   379 rpc-test.cc:1238] Sleep() max lat: 20645
I20260927 18:31:16.425303   379 rpc-test.cc:1239] Sleep() #calls: 1
[       OK ] Parameters/TestRpc.TestRpcHandlerLatencyMetric/SSL_TCP (65 ms)
[ RUN      ] Parameters/TestRpc.TimedOutOnResponseMetricServiceQueue/SSL_TCP
I20260927 18:31:16.447664   722 acceptor_pool.cc:254] collecting diagnostics on the listening RPC socket 0.0.0.0:37461 every 8 connection(s)
I20260927 18:31:16.447906   723 acceptor_pool.cc:254] collecting diagnostics on the listening RPC socket 0.0.0.0:37461 every 8 connection(s)
W20260927 18:31:16.504998   724 rpcz_store.cc:267] Call kudu.rpc_test.CalculatorService.Sleep from 127.0.0.1:54546 (request call id 2) took 20 ms (client timeout 20 ms). Trace:
W20260927 18:31:16.505157   724 rpcz_store.cc:269] 0927 18:31:16.484488 (+     0us) service_pool.cc:170] Inserting onto call queue
0927 18:31:16.504921 (+ 20433us) service_pool.cc:214] Skipping call since client already timed out
0927 18:31:16.504974 (+    53us) inbound_call.cc:173] Queueing failure response
Metrics: {}
[       OK ] Parameters/TestRpc.TimedOutOnResponseMetricServiceQueue/SSL_TCP (78 ms)
[ RUN      ] Parameters/TestRpc.RpcPendingConnectionsMetric/SSL_TCP
I20260927 18:31:16.514582   745 acceptor_pool.cc:254] collecting diagnostics on the listening RPC socket 0.0.0.0:41973 every 8 connection(s)
I20260927 18:31:16.514797   746 acceptor_pool.cc:254] collecting diagnostics on the listening RPC socket 0.0.0.0:41973 every 8 connection(s)
W20260927 18:31:16.526230   741 negotiation.cc:337] Failed RPC negotiation. Trace:
0927 18:31:16.525269 (+     0us) reactor.cc:625] Submitting negotiation task for server connection from 127.0.0.1:40284 (local address 127.0.0.1:41973)
0927 18:31:16.525519 (+   250us) server_negotiation.cc:206] Beginning negotiation
0927 18:31:16.525526 (+     7us) server_negotiation.cc:399] Waiting for connection header
0927 18:31:16.525732 (+   206us) negotiation.cc:327] Negotiation complete: Network error: Server connection negotiation failed: server connection from 127.0.0.1:40284: BlockingRecv error: recv got EOF from 127.0.0.1:40284 (error 108)
Metrics: {"server-negotiator.queue_time_us":70}
[       OK ] Parameters/TestRpc.RpcPendingConnectionsMetric/SSL_TCP (28 ms)
[ RUN      ] Parameters/TestRpc.TestRpcContextClientDeadline/SSL_TCP
I20260927 18:31:16.559970   761 acceptor_pool.cc:254] collecting diagnostics on the listening RPC socket 0.0.0.0:37195 every 8 connection(s)
I20260927 18:31:16.560189   762 acceptor_pool.cc:254] collecting diagnostics on the listening RPC socket 0.0.0.0:37195 every 8 connection(s)
[       OK ] Parameters/TestRpc.TestRpcContextClientDeadline/SSL_TCP (78 ms)
[ RUN      ] Parameters/TestRpc.TestApplicationFeatureFlagUnsupportedServer/SSL_TCP
I20260927 18:31:16.634142   786 acceptor_pool.cc:254] collecting diagnostics on the listening RPC socket 0.0.0.0:38269 every 8 connection(s)
I20260927 18:31:16.634404   787 acceptor_pool.cc:254] collecting diagnostics on the listening RPC socket 0.0.0.0:38269 every 8 connection(s)
[       OK ] Parameters/TestRpc.TestApplicationFeatureFlagUnsupportedServer/SSL_TCP (43 ms)
[ RUN      ] Parameters/TestRpc.TestCancellationAsync/SSL_TCP
I20260927 18:31:16.686231   811 acceptor_pool.cc:254] collecting diagnostics on the listening RPC socket 0.0.0.0:38997 every 8 connection(s)
I20260927 18:31:16.687275   812 acceptor_pool.cc:254] collecting diagnostics on the listening RPC socket 0.0.0.0:38997 every 8 connection(s)
I20260927 18:31:16.688314   379 rpc-test.cc:1716] Connecting to 0.0.0.0:38997
I20260927 18:31:16.703424   379 test_util.cc:268] Using random seed: 665706583
I20260927 18:31:16.742246   815 rpc-test-base.h:240] got call: sleep_micros: 500 pattern: 4294967295 num_repetitions: 2097152 sidecar_idx: 0
I20260927 18:31:16.763528   814 rpc-test-base.h:240] got call: sleep_micros: 500 pattern: 4294967295 num_repetitions: 2097152 sidecar_idx: 0
I20260927 18:31:16.791433   813 rpc-test-base.h:240] got call: sleep_micros: 500 pattern: 4294967295 num_repetitions: 2097152 sidecar_idx: 0
I20260927 18:31:16.818831   815 rpc-test-base.h:240] got call: sleep_micros: 500 pattern: 4294967295 num_repetitions: 2097152 sidecar_idx: 0
I20260927 18:31:16.847440   814 rpc-test-base.h:240] got call: sleep_micros: 500 pattern: 4294967295 num_repetitions: 2097152 sidecar_idx: 0
I20260927 18:31:16.884648   813 rpc-test-base.h:240] got call: sleep_micros: 500 pattern: 4294967295 num_repetitions: 2097152 sidecar_idx: 0
W20260927 18:31:16.917600   809 connection.cc:196] Error closing socket: Network error: TlsSocket::Close: Broken pipe
W20260927 18:31:16.917862   809 connection.cc:441] server connection from 127.0.0.1:58094 torn down before Call kudu.rpc.GenericCalculatorService.SleepWithSidecar from 127.0.0.1:58094 (request call id 7) could send its response
W20260927 18:31:16.931525   809 connection.cc:441] server connection from 127.0.0.1:58094 torn down before Call kudu.rpc.GenericCalculatorService.SleepWithSidecar from 127.0.0.1:58094 (request call id 8) could send its response
[       OK ] Parameters/TestRpc.TestCancellationAsync/SSL_TCP (275 ms)
[ RUN      ] Parameters/TestRpc.TestPerformanceBySocketType/SSL_TCP
I20260927 18:31:16.956368   836 acceptor_pool.cc:254] collecting diagnostics on the listening RPC socket 0.0.0.0:33783 every 8 connection(s)
I20260927 18:31:16.956645   837 acceptor_pool.cc:254] collecting diagnostics on the listening RPC socket 0.0.0.0:33783 every 8 connection(s)
I20260927 18:31:16.957540   379 rpc-test.cc:1846] Connecting to 0.0.0.0:33783
I20260927 18:31:20.024288   379 rpc-test.cc:1859] Sending 1024MB via ssl-enabled tcp socket: real 3.052s	user 2.752s	sys 2.291s
I20260927 18:31:23.044811   379 rpc-test.cc:1859] Sending 1024MB via ssl-enabled tcp socket: real 3.020s	user 2.684s	sys 2.364s
I20260927 18:31:26.089392   379 rpc-test.cc:1859] Sending 1024MB via ssl-enabled tcp socket: real 3.044s	user 3.009s	sys 2.082s
I20260927 18:31:29.124203   379 rpc-test.cc:1859] Sending 1024MB via ssl-enabled tcp socket: real 3.035s	user 2.829s	sys 2.219s
I20260927 18:31:32.209820   379 rpc-test.cc:1859] Sending 1024MB via ssl-enabled tcp socket: real 3.085s	user 2.919s	sys 2.212s
[       OK ] Parameters/TestRpc.TestPerformanceBySocketType/SSL_TCP (15281 ms)
[----------] 20 tests from Parameters/TestRpc (49237 ms total)

[----------] 1 test from Parameters/TestRpcSocketTxRxQueue
[ RUN      ] Parameters/TestRpcSocketTxRxQueue.OverCapacity/0
W20260927 18:31:32.517675   853 negotiation.cc:337] Failed RPC negotiation. Trace:
0927 18:31:32.223156 (+     0us) reactor.cc:625] Submitting negotiation task for client connection to 0.0.0.0:45611 (local address 127.0.0.1:34228)
0927 18:31:32.223390 (+   234us) negotiation.cc:107] Waiting for socket to connect
0927 18:31:32.223406 (+    16us) client_negotiation.cc:174] Beginning negotiation
0927 18:31:32.223504 (+    98us) client_negotiation.cc:252] Sending NEGOTIATE NegotiatePB request
0927 18:31:32.517378 (+293874us) negotiation.cc:327] Negotiation complete: Network error: Client connection negotiation failed: client connection to 0.0.0.0:45611: BlockingRecv error: recv error from unknown peer: Transport endpoint is not connected (error 107)
Metrics: {"client-negotiator.queue_time_us":60}
W20260927 18:31:32.517678   862 negotiation.cc:337] Failed RPC negotiation. Trace:
0927 18:31:32.225699 (+     0us) reactor.cc:625] Submitting negotiation task for client connection to 0.0.0.0:45611 (local address 127.0.0.1:34240)
0927 18:31:32.225924 (+   225us) negotiation.cc:107] Waiting for socket to connect
0927 18:31:32.225950 (+    26us) client_negotiation.cc:174] Beginning negotiation
0927 18:31:32.226065 (+   115us) client_negotiation.cc:252] Sending NEGOTIATE NegotiatePB request
0927 18:31:32.517328 (+291263us) negotiation.cc:327] Negotiation complete: Network error: Client connection negotiation failed: client connection to 0.0.0.0:45611: BlockingRecv error: recv error from unknown peer: Transport endpoint is not connected (error 107)
Metrics: {"client-negotiator.queue_time_us":56}
W20260927 18:31:32.517935   889 negotiation.cc:337] Failed RPC negotiation. Trace:
0927 18:31:32.234435 (+     0us) reactor.cc:625] Submitting negotiation task for client connection to 0.0.0.0:45611 (local address 127.0.0.1:34274)
0927 18:31:32.234614 (+   179us) negotiation.cc:107] Waiting for socket to connect
0927 18:31:32.234627 (+    13us) client_negotiation.cc:174] Beginning negotiation
0927 18:31:32.234700 (+    73us) client_negotiation.cc:252] Sending NEGOTIATE NegotiatePB request
0927 18:31:32.517700 (+283000us) negotiation.cc:327] Negotiation complete: Network error: Client connection negotiation failed: client connection to 0.0.0.0:45611: BlockingRecv error: recv error from unknown peer: Transport endpoint is not connected (error 107)
Metrics: {"client-negotiator.queue_time_us":64}
W20260927 18:31:32.518285   880 negotiation.cc:337] Failed RPC negotiation. Trace:
0927 18:31:32.231625 (+     0us) reactor.cc:625] Submitting negotiation task for client connection to 0.0.0.0:45611 (local address 127.0.0.1:34266)
0927 18:31:32.231863 (+   238us) negotiation.cc:107] Waiting for socket to connect
0927 18:31:32.231881 (+    18us) client_negotiation.cc:174] Beginning negotiation
0927 18:31:32.231988 (+   107us) client_negotiation.cc:252] Sending NEGOTIATE NegotiatePB request
0927 18:31:32.517328 (+285340us) negotiation.cc:327] Negotiation complete: Network error: Client connection negotiation failed: client connection to 0.0.0.0:45611: BlockingRecv error: recv error from unknown peer: Transport endpoint is not connected (error 107)
Metrics: {"client-negotiator.queue_time_us":73}
W20260927 18:31:32.518456   898 negotiation.cc:337] Failed RPC negotiation. Trace:
0927 18:31:32.237562 (+     0us) reactor.cc:625] Submitting negotiation task for client connection to 0.0.0.0:45611 (local address 127.0.0.1:34280)
0927 18:31:32.237800 (+   238us) negotiation.cc:107] Waiting for socket to connect
0927 18:31:32.237815 (+    15us) client_negotiation.cc:174] Beginning negotiation
0927 18:31:32.237897 (+    82us) client_negotiation.cc:252] Sending NEGOTIATE NegotiatePB request
0927 18:31:32.517636 (+279739us) negotiation.cc:327] Negotiation complete: Network error: Client connection negotiation failed: client connection to 0.0.0.0:45611: BlockingRecv error: recv error from unknown peer: Transport endpoint is not connected (error 107)
Metrics: {"client-negotiator.queue_time_us":87}
W20260927 18:31:32.519210   871 negotiation.cc:337] Failed RPC negotiation. Trace:
0927 18:31:32.228578 (+     0us) reactor.cc:625] Submitting negotiation task for client connection to 0.0.0.0:45611 (local address 127.0.0.1:34252)
0927 18:31:32.228852 (+   274us) negotiation.cc:107] Waiting for socket to connect
0927 18:31:32.228872 (+    20us) client_negotiation.cc:174] Beginning negotiation
0927 18:31:32.228996 (+   124us) client_negotiation.cc:252] Sending NEGOTIATE NegotiatePB request
0927 18:31:32.517344 (+288348us) negotiation.cc:327] Negotiation complete: Network error: Client connection negotiation failed: client connection to 0.0.0.0:45611: BlockingRecv error: recv error from unknown peer: Transport endpoint is not connected (error 107)
Metrics: {"client-negotiator.queue_time_us":82}
[       OK ] Parameters/TestRpcSocketTxRxQueue.OverCapacity/0 (1076 ms)
[----------] 1 test from Parameters/TestRpcSocketTxRxQueue (1076 ms total)

[----------] Global test environment tear-down
[==========] 21 tests from 2 test suites ran. (50314 ms total)
[  PASSED  ] 20 tests.
[  FAILED  ] 1 test, listed below:
[  FAILED  ] Parameters/TestRpc.TestCallWithChainCertAndChainCA/SSL_TCP, where GetParam() = (true, false)

 1 FAILED TEST