Parameters/TestRpc.TestCallWithChainCertAndRootCA/SSL_UnixSocket: /data0/somelongdirectorytoavoidrpathissues/src/kudu/src/kudu/rpc/rpc-test.cc:303: Failure
Failed
Bad status: Runtime error: could not verify certificate chain (error with cert: subject=CN = localhost, ST = sadfjas, C = AS, emailAddress = sdflkdsajf, O = lskdfjlsad, OU = sldfkja, issuer=C = AS, ST = ASDfkjdhf, L = lskdjf, O = saldfja, OU = skdjf, CN = localhost, emailAddress = sadjflkadsj): : certificate has expired
Google Test trace:
/data0/somelongdirectorytoavoidrpathissues/src/kudu/src/kudu/rpc/rpc-test.cc:300: Connecting to unix:/tmp/dist-test-taskiKBbCl/test-tmp/rpc-test-33defb8a31ae407099c959c61ba6d88c.sock
I20260926 22:06:50.290331 14229 test_util.cc:175] -----------------------------------------------
I20260926 22:06:50.290505 14229 test_util.cc:176] Had fatal failures, leaving test files at /tmp/dist-test-taskiKBbCl/test-tmp/rpc-test.2.Parameters_TestRpc.TestCallWithChainCertAndRootCA_SSL_UnixSocket.1790460406859327-14229-0
Note: This is test shard 3 of 8.
[==========] Running 21 tests from 2 test suites.
[----------] Global test environment set-up.
[----------] 1 test from TestRpc
[ RUN ] TestRpc.TestNegotiationTimeout
WARNING: Logging before InitGoogleLogging() is written to STDERR
I20260926 22:06:47.048555 14229 rpc-test-base.h:595] status: Timed out: connection negotiation to 0.0.0.0:42881 for RPC Sleep timed out after 0.100s (ON_OUTBOUND_QUEUE), seconds elapsed: 0.101814
W20260926 22:06:49.964515 14239 negotiation.cc:337] Failed RPC negotiation. Trace:
0926 22:06:46.947696 (+ 0us) reactor.cc:625] Submitting negotiation task for client connection to 0.0.0.0:42881 (local address 127.0.0.1:51030)
0926 22:06:46.948390 (+ 694us) negotiation.cc:107] Waiting for socket to connect
0926 22:06:46.948438 (+ 48us) client_negotiation.cc:174] Beginning negotiation
0926 22:06:46.960758 (+ 12320us) client_negotiation.cc:252] Sending NEGOTIATE NegotiatePB request
0926 22:06:49.963428 (+3002670us) negotiation.cc:327] Negotiation complete: Timed out: Client connection negotiation failed: client connection to 0.0.0.0:42881: received 0 of 4 requested bytes
Metrics: {"client-negotiator.queue_time_us":222}
[ OK ] TestRpc.TestNegotiationTimeout (3056 ms)
[----------] 1 test from TestRpc (3056 ms total)
[----------] 20 tests from Parameters/TestRpc
[ RUN ] Parameters/TestRpc.TestAcceptorPoolStartStop/SSL_UnixSocket
I20260926 22:06:50.005535 14255 acceptor_pool.cc:254] collecting diagnostics on the listening RPC socket unix:/tmp/dist-test-taskiKBbCl/test-tmp/rpc-test-653c9f8a96314f3abdee7c300f45b355.sock every 8 connection(s)
I20260926 22:06:50.007315 14256 acceptor_pool.cc:254] collecting diagnostics on the listening RPC socket unix:/tmp/dist-test-taskiKBbCl/test-tmp/rpc-test-653c9f8a96314f3abdee7c300f45b355.sock every 8 connection(s)
I20260926 22:06:50.075536 14266 acceptor_pool.cc:254] collecting diagnostics on the listening RPC socket unix:/tmp/dist-test-taskiKBbCl/test-tmp/rpc-test-653c9f8a96314f3abdee7c300f45b355.sock every 8 connection(s)
I20260926 22:06:50.077029 14267 acceptor_pool.cc:254] collecting diagnostics on the listening RPC socket unix:/tmp/dist-test-taskiKBbCl/test-tmp/rpc-test-653c9f8a96314f3abdee7c300f45b355.sock every 8 connection(s)
I20260926 22:06:50.102367 14277 acceptor_pool.cc:254] collecting diagnostics on the listening RPC socket unix:/tmp/dist-test-taskiKBbCl/test-tmp/rpc-test-653c9f8a96314f3abdee7c300f45b355.sock every 8 connection(s)
I20260926 22:06:50.103148 14278 acceptor_pool.cc:254] collecting diagnostics on the listening RPC socket unix:/tmp/dist-test-taskiKBbCl/test-tmp/rpc-test-653c9f8a96314f3abdee7c300f45b355.sock every 8 connection(s)
I20260926 22:06:50.128528 14288 acceptor_pool.cc:254] collecting diagnostics on the listening RPC socket unix:/tmp/dist-test-taskiKBbCl/test-tmp/rpc-test-653c9f8a96314f3abdee7c300f45b355.sock every 8 connection(s)
I20260926 22:06:50.129246 14289 acceptor_pool.cc:254] collecting diagnostics on the listening RPC socket unix:/tmp/dist-test-taskiKBbCl/test-tmp/rpc-test-653c9f8a96314f3abdee7c300f45b355.sock every 8 connection(s)
I20260926 22:06:50.144515 14299 acceptor_pool.cc:254] collecting diagnostics on the listening RPC socket unix:/tmp/dist-test-taskiKBbCl/test-tmp/rpc-test-653c9f8a96314f3abdee7c300f45b355.sock every 8 connection(s)
I20260926 22:06:50.145259 14300 acceptor_pool.cc:254] collecting diagnostics on the listening RPC socket unix:/tmp/dist-test-taskiKBbCl/test-tmp/rpc-test-653c9f8a96314f3abdee7c300f45b355.sock every 8 connection(s)
[ OK ] Parameters/TestRpc.TestAcceptorPoolStartStop/SSL_UnixSocket (180 ms)
[ RUN ] Parameters/TestRpc.TestCall/SSL_UnixSocket
I20260926 22:06:50.179572 14312 acceptor_pool.cc:254] collecting diagnostics on the listening RPC socket unix:/tmp/dist-test-taskiKBbCl/test-tmp/rpc-test-de33a5a3113846788bfdbe496d111cb2.sock every 8 connection(s)
I20260926 22:06:50.181680 14313 acceptor_pool.cc:254] collecting diagnostics on the listening RPC socket unix:/tmp/dist-test-taskiKBbCl/test-tmp/rpc-test-de33a5a3113846788bfdbe496d111cb2.sock every 8 connection(s)
I20260926 22:06:50.186411 14229 rpc-test.cc:234] Connecting to unix:/tmp/dist-test-taskiKBbCl/test-tmp/rpc-test-de33a5a3113846788bfdbe496d111cb2.sock
W20260926 22:06:50.238262 14309 connection.cc:196] Error closing socket: Network error: TlsSocket::Close: Broken pipe
[ OK ] Parameters/TestRpc.TestCall/SSL_UnixSocket (94 ms)
[ RUN ] Parameters/TestRpc.TestCallWithChainCertAndRootCA/SSL_UnixSocket
I20260926 22:06:50.269865 14337 acceptor_pool.cc:254] collecting diagnostics on the listening RPC socket unix:/tmp/dist-test-taskiKBbCl/test-tmp/rpc-test-33defb8a31ae407099c959c61ba6d88c.sock every 8 connection(s)
I20260926 22:06:50.270639 14338 acceptor_pool.cc:254] collecting diagnostics on the listening RPC socket unix:/tmp/dist-test-taskiKBbCl/test-tmp/rpc-test-33defb8a31ae407099c959c61ba6d88c.sock every 8 connection(s)
/data0/somelongdirectorytoavoidrpathissues/src/kudu/src/kudu/rpc/rpc-test.cc:303: Failure
Failed
Bad status: Runtime error: could not verify certificate chain (error with cert: subject=CN = localhost, ST = sadfjas, C = AS, emailAddress = sdflkdsajf, O = lskdfjlsad, OU = sldfkja, issuer=C = AS, ST = ASDfkjdhf, L = lskdjf, O = saldfja, OU = skdjf, CN = localhost, emailAddress = sadjflkadsj): : certificate has expired
Google Test trace:
/data0/somelongdirectorytoavoidrpathissues/src/kudu/src/kudu/rpc/rpc-test.cc:300: Connecting to unix:/tmp/dist-test-taskiKBbCl/test-tmp/rpc-test-33defb8a31ae407099c959c61ba6d88c.sock
I20260926 22:06:50.290331 14229 test_util.cc:175] -----------------------------------------------
I20260926 22:06:50.290505 14229 test_util.cc:176] Had fatal failures, leaving test files at /tmp/dist-test-taskiKBbCl/test-tmp/rpc-test.2.Parameters_TestRpc.TestCallWithChainCertAndRootCA_SSL_UnixSocket.1790460406859327-14229-0
[ FAILED ] Parameters/TestRpc.TestCallWithChainCertAndRootCA/SSL_UnixSocket, where GetParam() = (true, true) (46 ms)
[ RUN ] Parameters/TestRpc.TestCallWithBadPasswordProtectedKey/SSL_UnixSocket
[ OK ] Parameters/TestRpc.TestCallWithBadPasswordProtectedKey/SSL_UnixSocket (29 ms)
[ RUN ] Parameters/TestRpc.TestInvalidMethodCall/SSL_UnixSocket
I20260926 22:06:50.353363 14374 acceptor_pool.cc:254] collecting diagnostics on the listening RPC socket unix:/tmp/dist-test-taskiKBbCl/test-tmp/rpc-test-4479a2b82e6944d8b2b5c09c363fc113.sock every 8 connection(s)
I20260926 22:06:50.354199 14375 acceptor_pool.cc:254] collecting diagnostics on the listening RPC socket unix:/tmp/dist-test-taskiKBbCl/test-tmp/rpc-test-4479a2b82e6944d8b2b5c09c363fc113.sock every 8 connection(s)
I20260926 22:06:50.357719 14229 rpc-test.cc:406] Connecting to unix:/tmp/dist-test-taskiKBbCl/test-tmp/rpc-test-4479a2b82e6944d8b2b5c09c363fc113.sock
W20260926 22:06:50.391566 14371 connection.cc:196] Error closing socket: Network error: TlsSocket::Close: Broken pipe
[ OK ] Parameters/TestRpc.TestInvalidMethodCall/SSL_UnixSocket (76 ms)
[ RUN ] Parameters/TestRpc.TestHighFDs/SSL_UnixSocket
I20260926 22:06:50.593420 14399 acceptor_pool.cc:254] collecting diagnostics on the listening RPC socket unix:/tmp/dist-test-taskiKBbCl/test-tmp/rpc-test-dd16e423a8f44090a43695d4fa8b8539.sock every 8 connection(s)
I20260926 22:06:50.594172 14400 acceptor_pool.cc:254] collecting diagnostics on the listening RPC socket unix:/tmp/dist-test-taskiKBbCl/test-tmp/rpc-test-dd16e423a8f44090a43695d4fa8b8539.sock every 8 connection(s)
W20260926 22:06:50.631512 14396 connection.cc:196] Error closing socket: Network error: TlsSocket::Close: Broken pipe
[ OK ] Parameters/TestRpc.TestHighFDs/SSL_UnixSocket (243 ms)
[ RUN ] Parameters/TestRpc.TestConnectionAlwaysKeepalive/SSL_UnixSocket
I20260926 22:06:50.662065 14422 acceptor_pool.cc:254] collecting diagnostics on the listening RPC socket unix:/tmp/dist-test-taskiKBbCl/test-tmp/rpc-test-7be26cb5ae0b431f9c6699de386030a1.sock every 8 connection(s)
I20260926 22:06:50.662820 14423 acceptor_pool.cc:254] collecting diagnostics on the listening RPC socket unix:/tmp/dist-test-taskiKBbCl/test-tmp/rpc-test-7be26cb5ae0b431f9c6699de386030a1.sock every 8 connection(s)
I20260926 22:06:50.665831 14229 rpc-test.cc:532] Connecting to unix:/tmp/dist-test-taskiKBbCl/test-tmp/rpc-test-7be26cb5ae0b431f9c6699de386030a1.sock
W20260926 22:06:53.727913 14421 connection.cc:196] Error closing socket: Network error: TlsSocket::Close: Broken pipe
[ OK ] Parameters/TestRpc.TestConnectionAlwaysKeepalive/SSL_UnixSocket (3091 ms)
[ RUN ] Parameters/TestRpc.TestReopenOutboundConnections/SSL_UnixSocket
I20260926 22:06:53.746147 14445 acceptor_pool.cc:254] collecting diagnostics on the listening RPC socket unix:/tmp/dist-test-taskiKBbCl/test-tmp/rpc-test-4c86b9dcff6d417aba1c1c62afa9676c.sock every 8 connection(s)
I20260926 22:06:53.746873 14446 acceptor_pool.cc:254] collecting diagnostics on the listening RPC socket unix:/tmp/dist-test-taskiKBbCl/test-tmp/rpc-test-4c86b9dcff6d417aba1c1c62afa9676c.sock every 8 connection(s)
I20260926 22:06:53.750991 14229 rpc-test.cc:658] Connecting to unix:/tmp/dist-test-taskiKBbCl/test-tmp/rpc-test-4c86b9dcff6d417aba1c1c62afa9676c.sock
W20260926 22:06:53.817498 14444 connection.cc:196] Error closing socket: Network error: TlsSocket::Close: Broken pipe
W20260926 22:06:53.826428 14444 connection.cc:196] Error closing socket: Network error: TlsSocket::Close: Broken pipe
W20260926 22:06:53.835872 14444 connection.cc:196] Error closing socket: Network error: TlsSocket::Close: Broken pipe
W20260926 22:06:53.844987 14444 connection.cc:196] Error closing socket: Network error: TlsSocket::Close: Broken pipe
W20260926 22:06:53.854178 14444 connection.cc:196] Error closing socket: Network error: TlsSocket::Close: Broken pipe
W20260926 22:06:53.863155 14444 connection.cc:196] Error closing socket: Network error: TlsSocket::Close: Broken pipe
W20260926 22:06:53.872268 14444 connection.cc:196] Error closing socket: Network error: TlsSocket::Close: Broken pipe
W20260926 22:06:53.881294 14444 connection.cc:196] Error closing socket: Network error: TlsSocket::Close: Broken pipe
W20260926 22:06:53.891629 14444 connection.cc:196] Error closing socket: Network error: TlsSocket::Close: Broken pipe
W20260926 22:06:53.904227 14444 connection.cc:196] Error closing socket: Network error: TlsSocket::Close: Broken pipe
W20260926 22:06:53.915036 14444 connection.cc:196] Error closing socket: Network error: TlsSocket::Close: Broken pipe
W20260926 22:06:53.925282 14444 connection.cc:196] Error closing socket: Network error: TlsSocket::Close: Broken pipe
W20260926 22:06:53.935781 14444 connection.cc:196] Error closing socket: Network error: TlsSocket::Close: Broken pipe
W20260926 22:06:53.946355 14444 connection.cc:196] Error closing socket: Network error: TlsSocket::Close: Broken pipe
W20260926 22:06:53.946434 14445 acceptor_pool.cc:285] unable to collect diagnostics on RPC socket unix:/tmp/dist-test-taskiKBbCl/test-tmp/rpc-test-4c86b9dcff6d417aba1c1c62afa9676c.sock: Not implemented: netlink diagnostics is currently supported only on IPv4 TCP sockets
W20260926 22:06:53.956884 14444 connection.cc:196] Error closing socket: Network error: TlsSocket::Close: Broken pipe
W20260926 22:06:53.966550 14444 connection.cc:196] Error closing socket: Network error: TlsSocket::Close: Broken pipe
W20260926 22:06:53.976923 14444 connection.cc:196] Error closing socket: Network error: TlsSocket::Close: Broken pipe
W20260926 22:06:53.987376 14444 connection.cc:196] Error closing socket: Network error: TlsSocket::Close: Broken pipe
W20260926 22:06:53.997850 14444 connection.cc:196] Error closing socket: Network error: TlsSocket::Close: Broken pipe
W20260926 22:06:54.008569 14444 connection.cc:196] Error closing socket: Network error: TlsSocket::Close: Broken pipe
W20260926 22:06:54.018975 14444 connection.cc:196] Error closing socket: Network error: TlsSocket::Close: Broken pipe
W20260926 22:06:54.029392 14444 connection.cc:196] Error closing socket: Network error: TlsSocket::Close: Broken pipe
W20260926 22:06:54.039973 14444 connection.cc:196] Error closing socket: Network error: TlsSocket::Close: Broken pipe
W20260926 22:06:54.049532 14444 connection.cc:196] Error closing socket: Network error: TlsSocket::Close: Broken pipe
W20260926 22:06:54.058833 14444 connection.cc:196] Error closing socket: Network error: TlsSocket::Close: Broken pipe
W20260926 22:06:54.068511 14444 connection.cc:196] Error closing socket: Network error: TlsSocket::Close: Broken pipe
W20260926 22:06:54.078197 14444 connection.cc:196] Error closing socket: Network error: TlsSocket::Close: Broken pipe
W20260926 22:06:54.087637 14444 connection.cc:196] Error closing socket: Network error: TlsSocket::Close: Broken pipe
W20260926 22:06:54.097081 14444 connection.cc:196] Error closing socket: Network error: TlsSocket::Close: Broken pipe
W20260926 22:06:54.106861 14444 connection.cc:196] Error closing socket: Network error: TlsSocket::Close: Broken pipe
W20260926 22:06:54.116072 14444 connection.cc:196] Error closing socket: Network error: TlsSocket::Close: Broken pipe
W20260926 22:06:54.127247 14444 connection.cc:196] Error closing socket: Network error: TlsSocket::Close: Broken pipe
[ OK ] Parameters/TestRpc.TestReopenOutboundConnections/SSL_UnixSocket (399 ms)
[ RUN ] Parameters/TestRpc.TestConnectionNetworkPlane/SSL_UnixSocket
I20260926 22:06:54.153628 14468 acceptor_pool.cc:254] collecting diagnostics on the listening RPC socket unix:/tmp/dist-test-taskiKBbCl/test-tmp/rpc-test-5afdd66536944f87a499953f5636dfcc.sock every 8 connection(s)
I20260926 22:06:54.154311 14469 acceptor_pool.cc:254] collecting diagnostics on the listening RPC socket unix:/tmp/dist-test-taskiKBbCl/test-tmp/rpc-test-5afdd66536944f87a499953f5636dfcc.sock every 8 connection(s)
I20260926 22:06:54.157461 14229 rpc-test.cc:772] Connecting to unix:/tmp/dist-test-taskiKBbCl/test-tmp/rpc-test-5afdd66536944f87a499953f5636dfcc.sock
W20260926 22:06:54.203063 14467 connection.cc:196] Error closing socket: Network error: TlsSocket::Close: Broken pipe
W20260926 22:06:54.203624 14467 connection.cc:196] Error closing socket: Network error: TlsSocket::Close: Broken pipe
[ OK ] Parameters/TestRpc.TestConnectionNetworkPlane/SSL_UnixSocket (77 ms)
[ RUN ] Parameters/TestRpc.TestTCPKeepalive/SSL_UnixSocket
I20260926 22:06:54.228047 14493 acceptor_pool.cc:254] collecting diagnostics on the listening RPC socket unix:/tmp/dist-test-taskiKBbCl/test-tmp/rpc-test-2c8b2f4f8cdb4749954741458403c8d9.sock every 8 connection(s)
I20260926 22:06:54.228770 14494 acceptor_pool.cc:254] collecting diagnostics on the listening RPC socket unix:/tmp/dist-test-taskiKBbCl/test-tmp/rpc-test-2c8b2f4f8cdb4749954741458403c8d9.sock every 8 connection(s)
I20260926 22:06:54.260161 14497 rpc-test-base.h:222] got call: sleep_micros: 8000000 deferred: true
I20260926 22:07:02.264842 14497 rpcz_store.cc:275] Call kudu.rpc.GenericCalculatorService.Sleep from unix:<unnamed> (request call id 0) took 8004 ms. Trace:
I20260926 22:07:02.265246 14497 rpcz_store.cc:276] 0926 22:06:54.260009 (+ 0us) service_pool.cc:170] Inserting onto call queue
0926 22:06:54.260108 (+ 99us) service_pool.cc:227] Handling call
0926 22:07:02.264676 (+8004568us) inbound_call.cc:173] Queueing success response
Metrics: {}
W20260926 22:07:02.272400 14490 connection.cc:196] Error closing socket: Network error: TlsSocket::Close: Broken pipe
[ OK ] Parameters/TestRpc.TestTCPKeepalive/SSL_UnixSocket (8070 ms)
[ RUN ] Parameters/TestRpc.TestMaxSmallSidecars/SSL_UnixSocket
I20260926 22:07:02.311619 14519 acceptor_pool.cc:254] collecting diagnostics on the listening RPC socket unix:/tmp/dist-test-taskiKBbCl/test-tmp/rpc-test-2e642db777a74a4ea214584025c659c1.sock every 8 connection(s)
I20260926 22:07:02.312491 14520 acceptor_pool.cc:254] collecting diagnostics on the listening RPC socket unix:/tmp/dist-test-taskiKBbCl/test-tmp/rpc-test-2e642db777a74a4ea214584025c659c1.sock every 8 connection(s)
W20260926 22:07:02.478972 14516 connection.cc:196] Error closing socket: Network error: TlsSocket::Close: Broken pipe
[ OK ] Parameters/TestRpc.TestMaxSmallSidecars/SSL_UnixSocket (204 ms)
[ RUN ] Parameters/TestRpc.TestCallTimeout/SSL_UnixSocket
I20260926 22:07:02.517392 14544 acceptor_pool.cc:254] collecting diagnostics on the listening RPC socket unix:/tmp/dist-test-taskiKBbCl/test-tmp/rpc-test-50add0ec46bf4f93a218aa577f4390a1.sock every 8 connection(s)
I20260926 22:07:02.518131 14545 acceptor_pool.cc:254] collecting diagnostics on the listening RPC socket unix:/tmp/dist-test-taskiKBbCl/test-tmp/rpc-test-50add0ec46bf4f93a218aa577f4390a1.sock every 8 connection(s)
I20260926 22:07:02.539701 14229 rpc-test-base.h:595] status: Timed out: connection negotiation to unix:/tmp/dist-test-taskiKBbCl/test-tmp/rpc-test-50add0ec46bf4f93a218aa577f4390a1.sock for RPC Sleep timed out after 0.000s (ON_OUTBOUND_QUEUE), seconds elapsed: 0.00235572
I20260926 22:07:02.547807 14548 rpc-test-base.h:222] got call: sleep_micros: 700000
I20260926 22:07:02.741511 14229 rpc-test-base.h:595] status: Timed out: Sleep RPC to unix:/tmp/dist-test-taskiKBbCl/test-tmp/rpc-test-50add0ec46bf4f93a218aa577f4390a1.sock timed out after 0.200s (SENT), seconds elapsed: 0.201504
I20260926 22:07:02.742914 14547 rpc-test-base.h:222] got call: sleep_micros: 2000000
W20260926 22:07:03.248427 14548 rpcz_store.cc:267] Call kudu.rpc.GenericCalculatorService.Sleep from unix:<unnamed> (request call id 1) took 700 ms (client timeout 200 ms). Trace:
W20260926 22:07:03.248750 14548 rpcz_store.cc:269] 0926 22:07:02.547632 (+ 0us) service_pool.cc:170] Inserting onto call queue
0926 22:07:02.547753 (+ 121us) service_pool.cc:227] Handling call
0926 22:07:03.248371 (+700618us) inbound_call.cc:173] Queueing success response
Metrics: {}
I20260926 22:07:04.243978 14229 rpc-test-base.h:595] status: Timed out: Sleep RPC to unix:/tmp/dist-test-taskiKBbCl/test-tmp/rpc-test-50add0ec46bf4f93a218aa577f4390a1.sock timed out after 1.500s (SENT), seconds elapsed: 1.5021
W20260926 22:07:04.743386 14547 rpcz_store.cc:267] Call kudu.rpc.GenericCalculatorService.Sleep from unix:<unnamed> (request call id 2) took 2000 ms (client timeout 1500 ms). Trace:
W20260926 22:07:04.743669 14547 rpcz_store.cc:269] 0926 22:07:02.742721 (+ 0us) service_pool.cc:170] Inserting onto call queue
0926 22:07:02.742846 (+ 125us) service_pool.cc:227] Handling call
0926 22:07:04.743328 (+2000482us) inbound_call.cc:173] Queueing success response
Metrics: {}
W20260926 22:07:04.744179 14541 connection.cc:441] server connection from unix:<unnamed> torn down before Call kudu.rpc.GenericCalculatorService.Sleep from unix:<unnamed> (request call id 2) could send its response
[ OK ] Parameters/TestRpc.TestCallTimeout/SSL_UnixSocket (2265 ms)
[ RUN ] Parameters/TestRpc.TestServerShutsDown/SSL_UnixSocket
I20260926 22:07:04.751026 14229 rpc-test.cc:1125] Connecting to 0.0.0.0:33899
W20260926 22:07:04.760632 14561 negotiation.cc:337] Failed RPC negotiation. Trace:
0926 22:07:04.759266 (+ 0us) reactor.cc:625] Submitting negotiation task for client connection to 0.0.0.0:33899 (local address 127.0.0.1:48714)
0926 22:07:04.759682 (+ 416us) negotiation.cc:107] Waiting for socket to connect
0926 22:07:04.759713 (+ 31us) client_negotiation.cc:174] Beginning negotiation
0926 22:07:04.759923 (+ 210us) client_negotiation.cc:252] Sending NEGOTIATE NegotiatePB request
0926 22:07:04.760150 (+ 227us) negotiation.cc:327] Negotiation complete: Network error: Client connection negotiation failed: client connection to 0.0.0.0:33899: BlockingWrite error: write error: Broken pipe (error 32)
Metrics: {"client-negotiator.queue_time_us":100}
[ OK ] Parameters/TestRpc.TestServerShutsDown/SSL_UnixSocket (13 ms)
[ RUN ] Parameters/TestRpc.TimedOutOnResponseMetric/SSL_UnixSocket
I20260926 22:07:04.779179 14578 acceptor_pool.cc:254] collecting diagnostics on the listening RPC socket unix:/tmp/dist-test-taskiKBbCl/test-tmp/rpc-test-6f449187a0ab4d6faaad074dcf730947.sock every 8 connection(s)
I20260926 22:07:04.779894 14579 acceptor_pool.cc:254] collecting diagnostics on the listening RPC socket unix:/tmp/dist-test-taskiKBbCl/test-tmp/rpc-test-6f449187a0ab4d6faaad074dcf730947.sock every 8 connection(s)
W20260926 22:07:05.037537 14582 rpcz_store.cc:267] Call kudu.rpc_test.CalculatorService.Sleep from unix:<unnamed> (request call id 3) took 50 ms (client timeout 25 ms). Trace:
W20260926 22:07:05.037829 14582 rpcz_store.cc:269] 0926 22:07:04.986896 (+ 0us) service_pool.cc:170] Inserting onto call queue
0926 22:07:04.986996 (+ 100us) service_pool.cc:227] Handling call
0926 22:07:05.037456 (+ 50460us) inbound_call.cc:173] Queueing success response
Related trace 'test_child':
Metrics: {"test_sleep_us":50000,"child_traces":[["test_child",{"related_trace_metric":1}]]}
W20260926 22:07:05.096486 14582 rpcz_store.cc:267] Call kudu.rpc_test.CalculatorService.Sleep from unix:<unnamed> (request call id 4) took 50 ms (client timeout 50 ms). Trace:
W20260926 22:07:05.096903 14582 rpcz_store.cc:269] 0926 22:07:05.045939 (+ 0us) service_pool.cc:170] Inserting onto call queue
0926 22:07:05.046051 (+ 112us) service_pool.cc:227] Handling call
0926 22:07:05.096422 (+ 50371us) inbound_call.cc:173] Queueing success response
Related trace 'test_child':
Metrics: {"test_sleep_us":50000,"child_traces":[["test_child",{"related_trace_metric":1}]]}
W20260926 22:07:05.099771 14575 connection.cc:196] Error closing socket: Network error: TlsSocket::Close: Broken pipe
W20260926 22:07:05.100201 14575 connection.cc:441] server connection from unix:<unnamed> torn down before Call kudu.rpc_test.CalculatorService.Sleep from unix:<unnamed> (request call id 4) could send its response
[ OK ] Parameters/TestRpc.TimedOutOnResponseMetric/SSL_UnixSocket (341 ms)
[ RUN ] Parameters/TestRpc.AcceptorDispatchingTimesMetric/SSL_UnixSocket
I20260926 22:07:05.115588 14603 acceptor_pool.cc:254] collecting diagnostics on the listening RPC socket 0.0.0.0:44109 every 8 connection(s)
I20260926 22:07:05.116256 14604 acceptor_pool.cc:254] collecting diagnostics on the listening RPC socket 0.0.0.0:44109 every 8 connection(s)
W20260926 22:07:05.122184 14599 negotiation.cc:337] Failed RPC negotiation. Trace:
0926 22:07:05.120272 (+ 0us) reactor.cc:625] Submitting negotiation task for server connection from 127.0.0.1:37966 (local address 127.0.0.1:44109)
0926 22:07:05.120844 (+ 572us) server_negotiation.cc:206] Beginning negotiation
0926 22:07:05.120881 (+ 37us) server_negotiation.cc:399] Waiting for connection header
0926 22:07:05.121201 (+ 320us) negotiation.cc:327] Negotiation complete: Network error: Server connection negotiation failed: server connection from 127.0.0.1:37966: BlockingRecv error: recv got EOF from 127.0.0.1:37966 (error 108)
Metrics: {"server-negotiator.queue_time_us":139}
[ OK ] Parameters/TestRpc.AcceptorDispatchingTimesMetric/SSL_UnixSocket (20 ms)
[ RUN ] Parameters/TestRpc.TestRpcCallbackDestroysMessenger/SSL_UnixSocket
[ OK ] Parameters/TestRpc.TestRpcCallbackDestroysMessenger/SSL_UnixSocket (17 ms)
[ RUN ] Parameters/TestRpc.TestApplicationFeatureFlag/SSL_UnixSocket
I20260926 22:07:05.180573 14628 acceptor_pool.cc:254] collecting diagnostics on the listening RPC socket unix:/tmp/dist-test-taskiKBbCl/test-tmp/rpc-test-df93b2066d954c7caf6120e9f970b957.sock every 8 connection(s)
I20260926 22:07:05.181311 14629 acceptor_pool.cc:254] collecting diagnostics on the listening RPC socket unix:/tmp/dist-test-taskiKBbCl/test-tmp/rpc-test-df93b2066d954c7caf6120e9f970b957.sock every 8 connection(s)
W20260926 22:07:05.223091 14625 messenger.cc:357] Unable to handle RPC call: Not implemented: call requires unsupported application feature flags: 99
W20260926 22:07:05.226193 14625 connection.cc:196] Error closing socket: Network error: TlsSocket::Close: Broken pipe
[ OK ] Parameters/TestRpc.TestApplicationFeatureFlag/SSL_UnixSocket (88 ms)
[ RUN ] Parameters/TestRpc.TestCancellation/SSL_UnixSocket
I20260926 22:07:05.255007 14653 acceptor_pool.cc:254] collecting diagnostics on the listening RPC socket unix:/tmp/dist-test-taskiKBbCl/test-tmp/rpc-test-f74a2c97589c43b0939c65de03cec9d5.sock every 8 connection(s)
I20260926 22:07:05.255757 14654 acceptor_pool.cc:254] collecting diagnostics on the listening RPC socket unix:/tmp/dist-test-taskiKBbCl/test-tmp/rpc-test-f74a2c97589c43b0939c65de03cec9d5.sock every 8 connection(s)
I20260926 22:07:05.258901 14229 rpc-test.cc:1648] Connecting to unix:/tmp/dist-test-taskiKBbCl/test-tmp/rpc-test-f74a2c97589c43b0939c65de03cec9d5.sock
I20260926 22:07:05.359196 14229 rpc-test-base.h:595] status: Aborted: Sleep RPC to unix:/tmp/dist-test-taskiKBbCl/test-tmp/rpc-test-f74a2c97589c43b0939c65de03cec9d5.sock is cancelled in state READY, seconds elapsed: 0.000306745
I20260926 22:07:05.529948 14229 rpc-test-base.h:595] status: Aborted: Sleep RPC to unix:/tmp/dist-test-taskiKBbCl/test-tmp/rpc-test-f74a2c97589c43b0939c65de03cec9d5.sock is cancelled in state SENT, seconds elapsed: 0.000944954
I20260926 22:07:05.530144 14656 rpc-test-base.h:222] got call: sleep_micros: 510000
I20260926 22:07:05.713083 14229 rpc-test-base.h:595] status: Aborted: Sleep RPC to unix:/tmp/dist-test-taskiKBbCl/test-tmp/rpc-test-f74a2c97589c43b0939c65de03cec9d5.sock is cancelled in state SENT, seconds elapsed: 0.000713793
I20260926 22:07:05.713441 14655 rpc-test-base.h:222] got call: sleep_micros: 510000
I20260926 22:07:05.908331 14229 rpc-test-base.h:595] status: Aborted: Sleep RPC to unix:/tmp/dist-test-taskiKBbCl/test-tmp/rpc-test-f74a2c97589c43b0939c65de03cec9d5.sock is cancelled in state SENT, seconds elapsed: 0.000677472
W20260926 22:07:05.919464 14657 rpcz_store.cc:267] Call kudu.rpc.GenericCalculatorService.Sleep from unix:<unnamed> (request call id 11) took 10 ms (client timeout 10 ms). Trace:
W20260926 22:07:05.919734 14657 rpcz_store.cc:269] 0926 22:07:05.908461 (+ 0us) service_pool.cc:170] Inserting onto call queue
0926 22:07:05.919181 (+ 10720us) service_pool.cc:214] Skipping call since client already timed out
0926 22:07:05.919290 (+ 109us) inbound_call.cc:173] Queueing failure response
Metrics: {}
I20260926 22:07:05.920277 14657 rpc-test-base.h:222] got call: sleep_micros: 1500000
W20260926 22:07:06.040769 14656 rpcz_store.cc:267] Call kudu.rpc.GenericCalculatorService.Sleep from unix:<unnamed> (request call id 3) took 510 ms (client timeout 10 ms). Trace:
W20260926 22:07:06.041095 14656 rpcz_store.cc:269] 0926 22:07:05.529970 (+ 0us) service_pool.cc:170] Inserting onto call queue
0926 22:07:05.530100 (+ 130us) service_pool.cc:227] Handling call
0926 22:07:06.040710 (+510610us) inbound_call.cc:173] Queueing success response
Metrics: {}
W20260926 22:07:06.223963 14655 rpcz_store.cc:267] Call kudu.rpc.GenericCalculatorService.Sleep from unix:<unnamed> (request call id 7) took 510 ms (client timeout 10 ms). Trace:
W20260926 22:07:06.224291 14655 rpcz_store.cc:269] 0926 22:07:05.713263 (+ 0us) service_pool.cc:170] Inserting onto call queue
0926 22:07:05.713378 (+ 115us) service_pool.cc:227] Handling call
0926 22:07:06.223908 (+510530us) inbound_call.cc:173] Queueing success response
Metrics: {}
I20260926 22:07:06.910293 14229 rpc-test-base.h:595] status: Timed out: Sleep RPC to unix:/tmp/dist-test-taskiKBbCl/test-tmp/rpc-test-f74a2c97589c43b0939c65de03cec9d5.sock timed out after 1.000s (SENT), seconds elapsed: 1.00162
I20260926 22:07:06.911633 14655 rpc-test-base.h:222] got call: sleep_micros: 1500000
W20260926 22:07:07.420957 14657 rpcz_store.cc:267] Call kudu.rpc.GenericCalculatorService.Sleep from unix:<unnamed> (request call id 12) took 1511 ms (client timeout 1000 ms). Trace:
W20260926 22:07:07.421380 14657 rpcz_store.cc:269] 0926 22:07:05.909435 (+ 0us) service_pool.cc:170] Inserting onto call queue
0926 22:07:05.920236 (+ 10801us) service_pool.cc:227] Handling call
0926 22:07:07.420796 (+1500560us) inbound_call.cc:173] Queueing success response
Metrics: {}
I20260926 22:07:07.912139 14229 rpc-test-base.h:595] status: Timed out: Sleep RPC to unix:/tmp/dist-test-taskiKBbCl/test-tmp/rpc-test-f74a2c97589c43b0939c65de03cec9d5.sock timed out after 1.000s (SENT), seconds elapsed: 1.00139
W20260926 22:07:07.913786 14650 messenger.cc:357] Unable to handle RPC call: Not implemented: call requires unsupported application feature flags: 99, 1
W20260926 22:07:07.915324 14650 messenger.cc:357] Unable to handle RPC call: Not implemented: call requires unsupported application feature flags: 99, 1
W20260926 22:07:08.129371 14650 connection.cc:196] Error closing socket: Network error: TlsSocket::Close: Broken pipe
W20260926 22:07:08.412273 14655 rpcz_store.cc:267] Call kudu.rpc.GenericCalculatorService.Sleep from unix:<unnamed> (request call id 13) took 1500 ms (client timeout 1000 ms). Trace:
W20260926 22:07:08.412590 14655 rpcz_store.cc:269] 0926 22:07:06.911407 (+ 0us) service_pool.cc:170] Inserting onto call queue
0926 22:07:06.911576 (+ 169us) service_pool.cc:227] Handling call
0926 22:07:08.412136 (+1500560us) inbound_call.cc:173] Queueing success response
Metrics: {}
W20260926 22:07:08.413201 14650 connection.cc:441] server connection from unix:<unnamed> torn down before Call kudu.rpc.GenericCalculatorService.Sleep from unix:<unnamed> (request call id 13) could send its response
[ OK ] Parameters/TestRpc.TestCancellation/SSL_UnixSocket (3190 ms)
[ RUN ] Parameters/TestRpc.TestCancellationMultiThreads/SSL_UnixSocket
I20260926 22:07:08.456101 14679 acceptor_pool.cc:254] collecting diagnostics on the listening RPC socket unix:/tmp/dist-test-taskiKBbCl/test-tmp/rpc-test-4823c007874641b488ba24be483c56f6.sock every 8 connection(s)
I20260926 22:07:08.456979 14680 acceptor_pool.cc:254] collecting diagnostics on the listening RPC socket unix:/tmp/dist-test-taskiKBbCl/test-tmp/rpc-test-4823c007874641b488ba24be483c56f6.sock every 8 connection(s)
I20260926 22:07:08.460278 14229 rpc-test.cc:1808] Connecting to unix:/tmp/dist-test-taskiKBbCl/test-tmp/rpc-test-4823c007874641b488ba24be483c56f6.sock
I20260926 22:07:08.609429 14693 test_util.cc:268] Using random seed: 232056615
I20260926 22:07:08.610518 14694 test_util.cc:268] Using random seed: 232057791
I20260926 22:07:08.612025 14695 test_util.cc:268] Using random seed: 232059296
I20260926 22:07:08.613812 14696 test_util.cc:268] Using random seed: 232060934
I20260926 22:07:08.615293 14697 test_util.cc:268] Using random seed: 232062421
I20260926 22:07:08.616677 14698 test_util.cc:268] Using random seed: 232063837
I20260926 22:07:08.618172 14699 test_util.cc:268] Using random seed: 232065310
I20260926 22:07:08.619798 14700 test_util.cc:268] Using random seed: 232066959
I20260926 22:07:08.621124 14701 test_util.cc:268] Using random seed: 232068303
I20260926 22:07:08.622664 14702 test_util.cc:268] Using random seed: 232069643
I20260926 22:07:08.624087 14703 test_util.cc:268] Using random seed: 232071235
I20260926 22:07:08.625490 14704 test_util.cc:268] Using random seed: 232072632
I20260926 22:07:08.627170 14705 test_util.cc:268] Using random seed: 232074307
I20260926 22:07:08.628544 14706 test_util.cc:268] Using random seed: 232075672
I20260926 22:07:08.630082 14707 test_util.cc:268] Using random seed: 232077177
I20260926 22:07:08.631963 14708 test_util.cc:268] Using random seed: 232079096
I20260926 22:07:08.633702 14709 test_util.cc:268] Using random seed: 232080805
I20260926 22:07:08.635324 14710 test_util.cc:268] Using random seed: 232082460
I20260926 22:07:08.637089 14711 test_util.cc:268] Using random seed: 232084193
I20260926 22:07:08.639305 14712 test_util.cc:268] Using random seed: 232086402
I20260926 22:07:08.641280 14713 test_util.cc:268] Using random seed: 232088359
I20260926 22:07:08.643188 14714 test_util.cc:268] Using random seed: 232090264
I20260926 22:07:08.644922 14715 test_util.cc:268] Using random seed: 232092048
I20260926 22:07:08.646821 14716 test_util.cc:268] Using random seed: 232093897
I20260926 22:07:08.651753 14717 test_util.cc:268] Using random seed: 232098818
I20260926 22:07:08.653644 14718 test_util.cc:268] Using random seed: 232100749
I20260926 22:07:08.655459 14719 test_util.cc:268] Using random seed: 232102563
I20260926 22:07:08.657305 14720 test_util.cc:268] Using random seed: 232104380
I20260926 22:07:08.659133 14721 test_util.cc:268] Using random seed: 232106222
I20260926 22:07:08.660892 14722 test_util.cc:268] Using random seed: 232108043
W20260926 22:07:28.045779 14676 connection.cc:196] Error closing socket: Network error: TlsSocket::Close: Broken pipe
[ OK ] Parameters/TestRpc.TestCancellationMultiThreads/SSL_UnixSocket (19641 ms)
[ RUN ] Parameters/TestRpc.TestCallId/SSL_UnixSocket
I20260926 22:07:28.089442 14736 acceptor_pool.cc:254] collecting diagnostics on the listening RPC socket unix:/tmp/dist-test-taskiKBbCl/test-tmp/rpc-test-5a19c1321eb245918fa5bfd7e81ea14d.sock every 8 connection(s)
I20260926 22:07:28.090313 14737 acceptor_pool.cc:254] collecting diagnostics on the listening RPC socket unix:/tmp/dist-test-taskiKBbCl/test-tmp/rpc-test-5a19c1321eb245918fa5bfd7e81ea14d.sock every 8 connection(s)
W20260926 22:07:28.137912 14733 connection.cc:196] Error closing socket: Network error: TlsSocket::Close: Broken pipe
[ OK ] Parameters/TestRpc.TestCallId/SSL_UnixSocket (80 ms)
[----------] 20 tests from Parameters/TestRpc (38175 ms total)
[----------] Global test environment tear-down
[==========] 21 tests from 2 test suites ran. (41233 ms total)
[ PASSED ] 20 tests.
[ FAILED ] 1 test, listed below:
[ FAILED ] Parameters/TestRpc.TestCallWithChainCertAndRootCA/SSL_UnixSocket, where GetParam() = (true, true)
1 FAILED TEST
I20260926 22:07:28.161808 14229 logging.cc:424] LogThrottler /data0/somelongdirectorytoavoidrpathissues/src/kudu/src/kudu/rpc/acceptor_pool.cc:285: suppressed but not reported on 3 messages since previous log ~34 seconds ago