Diagnosed failure

Parameters/TestRpc.TestCallWithChainCertAndChainCA/SSL_TCP: /data0/somelongdirectorytoavoidrpathissues/src/kudu/src/kudu/rpc/rpc-test.cc:270: Failure
Failed
Bad status: Runtime error: could not verify certificate chain (error with cert: subject=CN = localhost, ST = sadfjas, C = AS, emailAddress = sdflkdsajf, O = lskdfjlsad, OU = sldfkja, issuer=C = AS, ST = ASDfkjdhf, L = lskdjf, O = saldfja, OU = skdjf, CN = localhost, emailAddress = sadjflkadsj): : certificate has expired
Google Test trace:
/data0/somelongdirectorytoavoidrpathissues/src/kudu/src/kudu/rpc/rpc-test.cc:267: Connecting to 0.0.0.0:40061
I20260928 16:35:00.351204 25493 test_util.cc:175] -----------------------------------------------
I20260928 16:35:00.351274 25493 test_util.cc:176] Had fatal failures, leaving test files at /tmp/dist-test-taski6QUq5/test-tmp/rpc-test.5.Parameters_TestRpc.TestCallWithChainCertAndChainCA_SSL_TCP.1790613300273607-25493-0

Full log

Note: This is test shard 6 of 8.
[==========] Running 21 tests from 2 test suites.
[----------] Global test environment set-up.
[----------] 20 tests from Parameters/TestRpc
[ RUN      ] Parameters/TestRpc.TestMessengerCreateDestroy/SSL_TCP
WARNING: Logging before InitGoogleLogging() is written to STDERR
I20260928 16:35:00.306561 25493 rpc-test.cc:169] started messenger TestCreateDestroy
[       OK ] Parameters/TestRpc.TestMessengerCreateDestroy/SSL_TCP (28 ms)
[ RUN      ] Parameters/TestRpc.TestNegotiationDeadlock/SSL_TCP
I20260928 16:35:00.319027 25514 acceptor_pool.cc:254] collecting diagnostics on the listening RPC socket 0.0.0.0:42649 every 8 connection(s)
I20260928 16:35:00.319062 25513 acceptor_pool.cc:254] collecting diagnostics on the listening RPC socket 0.0.0.0:42649 every 8 connection(s)
[       OK ] Parameters/TestRpc.TestNegotiationDeadlock/SSL_TCP (28 ms)
[ RUN      ] Parameters/TestRpc.TestCallWithChainCertAndChainCA/SSL_TCP
I20260928 16:35:00.345563 25530 acceptor_pool.cc:254] collecting diagnostics on the listening RPC socket 0.0.0.0:40061 every 8 connection(s)
I20260928 16:35:00.345616 25529 acceptor_pool.cc:254] collecting diagnostics on the listening RPC socket 0.0.0.0:40061 every 8 connection(s)
/data0/somelongdirectorytoavoidrpathissues/src/kudu/src/kudu/rpc/rpc-test.cc:270: Failure
Failed
Bad status: Runtime error: could not verify certificate chain (error with cert: subject=CN = localhost, ST = sadfjas, C = AS, emailAddress = sdflkdsajf, O = lskdfjlsad, OU = sldfkja, issuer=C = AS, ST = ASDfkjdhf, L = lskdjf, O = saldfja, OU = skdjf, CN = localhost, emailAddress = sadjflkadsj): : certificate has expired
Google Test trace:
/data0/somelongdirectorytoavoidrpathissues/src/kudu/src/kudu/rpc/rpc-test.cc:267: Connecting to 0.0.0.0:40061
I20260928 16:35:00.351204 25493 test_util.cc:175] -----------------------------------------------
I20260928 16:35:00.351274 25493 test_util.cc:176] Had fatal failures, leaving test files at /tmp/dist-test-taski6QUq5/test-tmp/rpc-test.5.Parameters_TestRpc.TestCallWithChainCertAndChainCA_SSL_TCP.1790613300273607-25493-0
[  FAILED  ] Parameters/TestRpc.TestCallWithChainCertAndChainCA/SSL_TCP, where GetParam() = (true, false) (14 ms)
[ RUN      ] Parameters/TestRpc.TestCallWithPasswordProtectedKey/SSL_TCP
I20260928 16:35:00.358211 25554 acceptor_pool.cc:254] collecting diagnostics on the listening RPC socket 0.0.0.0:32947 every 8 connection(s)
I20260928 16:35:00.358235 25555 acceptor_pool.cc:254] collecting diagnostics on the listening RPC socket 0.0.0.0:32947 every 8 connection(s)
[       OK ] Parameters/TestRpc.TestCallWithPasswordProtectedKey/SSL_TCP (24 ms)
[ RUN      ] Parameters/TestRpc.TestCallToBadServer/SSL_TCP
I20260928 16:35:00.390573 25493 rpc-test.cc:394] Status: Network error: Client connection negotiation failed: client connection to 0.0.0.0:0: connect: Connection refused (error 111)
I20260928 16:35:00.391156 25493 rpc-test.cc:394] Status: Network error: Client connection negotiation failed: client connection to 0.0.0.0:0: connect: Connection refused (error 111)
I20260928 16:35:00.391745 25493 rpc-test.cc:394] Status: Network error: Client connection negotiation failed: client connection to 0.0.0.0:0: connect: Connection refused (error 111)
I20260928 16:35:00.392331 25493 rpc-test.cc:394] Status: Network error: Client connection negotiation failed: client connection to 0.0.0.0:0: connect: Connection refused (error 111)
I20260928 16:35:00.392771 25493 rpc-test.cc:394] Status: Network error: Client connection negotiation failed: client connection to 0.0.0.0:0: connect: Connection refused (error 111)
[       OK ] Parameters/TestRpc.TestCallToBadServer/SSL_TCP (17 ms)
[ RUN      ] Parameters/TestRpc.TestWrongService/SSL_TCP
I20260928 16:35:00.404511 25589 acceptor_pool.cc:254] collecting diagnostics on the listening RPC socket 0.0.0.0:45675 every 8 connection(s)
I20260928 16:35:00.404532 25590 acceptor_pool.cc:254] collecting diagnostics on the listening RPC socket 0.0.0.0:45675 every 8 connection(s)
I20260928 16:35:00.426245 25586 messenger.cc:345] service WrongServiceName not registered on TestServer
[       OK ] Parameters/TestRpc.TestWrongService/SSL_TCP (35 ms)
[ RUN      ] Parameters/TestRpc.TestConnectionKeepalive/SSL_TCP
I20260928 16:35:00.446578 25613 acceptor_pool.cc:254] collecting diagnostics on the listening RPC socket 0.0.0.0:37735 every 8 connection(s)
I20260928 16:35:00.446578 25612 acceptor_pool.cc:254] collecting diagnostics on the listening RPC socket 0.0.0.0:37735 every 8 connection(s)
I20260928 16:35:00.446836 25493 rpc-test.cc:488] Connecting to 0.0.0.0:37735
[       OK ] Parameters/TestRpc.TestConnectionKeepalive/SSL_TCP (1042 ms)
[ RUN      ] Parameters/TestRpc.TestClientConnectionMetrics/SSL_TCP
I20260928 16:35:01.480578 25637 acceptor_pool.cc:254] collecting diagnostics on the listening RPC socket 0.0.0.0:35357 every 8 connection(s)
I20260928 16:35:01.480711 25638 acceptor_pool.cc:254] collecting diagnostics on the listening RPC socket 0.0.0.0:35357 every 8 connection(s)
I20260928 16:35:01.480978 25493 rpc-test.cc:569] Connecting to 0.0.0.0:35357
[       OK ] Parameters/TestRpc.TestClientConnectionMetrics/SSL_TCP (18586 ms)
[ RUN      ] Parameters/TestRpc.TestCredentialsPolicy/SSL_TCP
I20260928 16:35:20.074985 25662 acceptor_pool.cc:254] collecting diagnostics on the listening RPC socket 0.0.0.0:38689 every 8 connection(s)
I20260928 16:35:20.074977 25661 acceptor_pool.cc:254] collecting diagnostics on the listening RPC socket 0.0.0.0:38689 every 8 connection(s)
I20260928 16:35:20.075217 25493 rpc-test.cc:700] Connecting to 0.0.0.0:38689
[       OK ] Parameters/TestRpc.TestCredentialsPolicy/SSL_TCP (55 ms)
[ RUN      ] Parameters/TestRpc.TestCallLongerThanKeepalive/SSL_TCP
I20260928 16:35:20.129388 25686 acceptor_pool.cc:254] collecting diagnostics on the listening RPC socket 0.0.0.0:33379 every 8 connection(s)
I20260928 16:35:20.129436 25687 acceptor_pool.cc:254] collecting diagnostics on the listening RPC socket 0.0.0.0:33379 every 8 connection(s)
I20260928 16:35:20.148022 25689 rpc-test-base.h:222] got call: sleep_micros: 3000000 deferred: true
I20260928 16:35:23.149744 25689 rpcz_store.cc:275] Call kudu.rpc.GenericCalculatorService.Sleep from 127.0.0.1:33522 (request call id 0) took 3001 ms. Trace:
I20260928 16:35:23.149977 25689 rpcz_store.cc:276] 0928 16:35:20.147821 (+     0us) service_pool.cc:170] Inserting onto call queue
0928 16:35:20.147960 (+   139us) service_pool.cc:227] Handling call
0928 16:35:23.149710 (+3001750us) inbound_call.cc:173] Queueing success response
Metrics: {}
[       OK ] Parameters/TestRpc.TestCallLongerThanKeepalive/SSL_TCP (3039 ms)
[ RUN      ] Parameters/TestRpc.TestRpcSidecar/SSL_TCP
I20260928 16:35:23.177083 25712 acceptor_pool.cc:254] collecting diagnostics on the listening RPC socket 0.0.0.0:41963 every 8 connection(s)
I20260928 16:35:23.177181 25713 acceptor_pool.cc:254] collecting diagnostics on the listening RPC socket 0.0.0.0:41963 every 8 connection(s)
[       OK ] Parameters/TestRpc.TestRpcSidecar/SSL_TCP (97 ms)
[ RUN      ] Parameters/TestRpc.TestRpcSidecarLimits/SSL_TCP
I20260928 16:35:25.464986 25737 acceptor_pool.cc:254] collecting diagnostics on the listening RPC socket 0.0.0.0:42741 every 8 connection(s)
I20260928 16:35:25.465037 25738 acceptor_pool.cc:254] collecting diagnostics on the listening RPC socket 0.0.0.0:42741 every 8 connection(s)
W20260928 16:35:25.478354 25493 serialization.cc:72] Serialized kudu.rpc_test.PushStringsRequestPB (2147483654 bytes) is larger than the maximum configured RPC message size (52428800 bytes). Sending anyway, but peer may reject the data.
W20260928 16:35:25.483521 25735 connection.cc:535] server connection from 127.0.0.1:56244 recv error: Network error: RPC frame had a length of 2147483714, but we only support messages up to 52428800 bytes long.
W20260928 16:35:25.483649 25735 connection.cc:158] shutting down server connection from 127.0.0.1:56244 with pending inbound data: 4/2147483714 bytes received; last active 0 ns ago: status Network error: RPC frame had a length of 2147483714, but we only support messages up to 52428800 bytes long.
W20260928 16:35:25.484028 25750 connection.cc:196] Error closing socket: Network error: TlsSocket::Close: Connection reset by peer
I20260928 16:35:25.494835 25762 acceptor_pool.cc:254] collecting diagnostics on the listening RPC socket 0.0.0.0:37813 every 8 connection(s)
I20260928 16:35:25.494836 25763 acceptor_pool.cc:254] collecting diagnostics on the listening RPC socket 0.0.0.0:37813 every 8 connection(s)
W20260928 16:35:31.616621 25761 connection.cc:577] server connection from 127.0.0.1:58992: received bad data: 'Corruption: Invalid packet: message had a length of 2147483710, but we only support messages up to 2147483647 bytes
'
[       OK ] Parameters/TestRpc.TestRpcSidecarLimits/SSL_TCP (8369 ms)
[ RUN      ] Parameters/TestRpc.TestCallTimeoutDoesntAffectNegotiation/SSL_TCP
I20260928 16:35:31.667675 25788 acceptor_pool.cc:254] collecting diagnostics on the listening RPC socket 0.0.0.0:38731 every 8 connection(s)
I20260928 16:35:31.667769 25789 acceptor_pool.cc:254] collecting diagnostics on the listening RPC socket 0.0.0.0:38731 every 8 connection(s)
W20260928 16:35:31.679303 25784 negotiation.cc:266] Injecting 500ms delay in negotiation
I20260928 16:35:31.729637 25493 rpc-test-base.h:595] status: Timed out: connection negotiation to 0.0.0.0:38731 for RPC Sleep timed out after 0.050s (ON_OUTBOUND_QUEUE), seconds elapsed: 0.051067
[       OK ] Parameters/TestRpc.TestCallTimeoutDoesntAffectNegotiation/SSL_TCP (566 ms)
[ RUN      ] Parameters/TestRpc.TestRpcHandlerLatencyMetric/SSL_TCP
I20260928 16:35:32.204336 25813 acceptor_pool.cc:254] collecting diagnostics on the listening RPC socket 0.0.0.0:39437 every 8 connection(s)
I20260928 16:35:32.204339 25814 acceptor_pool.cc:254] collecting diagnostics on the listening RPC socket 0.0.0.0:39437 every 8 connection(s)
I20260928 16:35:32.246878 25493 rpc-test.cc:1236] Sleep() min lat: 20580
I20260928 16:35:32.246982 25493 rpc-test.cc:1237] Sleep() mean lat: 20580
I20260928 16:35:32.247014 25493 rpc-test.cc:1238] Sleep() max lat: 20580
I20260928 16:35:32.247028 25493 rpc-test.cc:1239] Sleep() #calls: 1
[       OK ] Parameters/TestRpc.TestRpcHandlerLatencyMetric/SSL_TCP (63 ms)
[ RUN      ] Parameters/TestRpc.TimedOutOnResponseMetricServiceQueue/SSL_TCP
I20260928 16:35:32.276273 25839 acceptor_pool.cc:254] collecting diagnostics on the listening RPC socket 0.0.0.0:37187 every 8 connection(s)
I20260928 16:35:32.276280 25840 acceptor_pool.cc:254] collecting diagnostics on the listening RPC socket 0.0.0.0:37187 every 8 connection(s)
W20260928 16:35:32.358325 25841 rpcz_store.cc:267] Call kudu.rpc_test.CalculatorService.Sleep from 127.0.0.1:32772 (request call id 2) took 20 ms (client timeout 20 ms). Trace:
W20260928 16:35:32.358431 25841 rpcz_store.cc:269] 0928 16:35:32.337930 (+     0us) service_pool.cc:170] Inserting onto call queue
0928 16:35:32.358270 (+ 20340us) service_pool.cc:214] Skipping call since client already timed out
0928 16:35:32.358303 (+    33us) inbound_call.cc:173] Queueing failure response
Metrics: {}
[       OK ] Parameters/TestRpc.TimedOutOnResponseMetricServiceQueue/SSL_TCP (111 ms)
[ RUN      ] Parameters/TestRpc.RpcPendingConnectionsMetric/SSL_TCP
I20260928 16:35:32.363736 25863 acceptor_pool.cc:254] collecting diagnostics on the listening RPC socket 0.0.0.0:33673 every 8 connection(s)
I20260928 16:35:32.363791 25864 acceptor_pool.cc:254] collecting diagnostics on the listening RPC socket 0.0.0.0:33673 every 8 connection(s)
W20260928 16:35:32.365288 25858 negotiation.cc:337] Failed RPC negotiation. Trace:
0928 16:35:32.364670 (+     0us) reactor.cc:625] Submitting negotiation task for server connection from 127.0.0.1:37144 (local address 127.0.0.1:33673)
0928 16:35:32.364822 (+   152us) server_negotiation.cc:206] Beginning negotiation
0928 16:35:32.364826 (+     4us) server_negotiation.cc:399] Waiting for connection header
0928 16:35:32.364910 (+    84us) negotiation.cc:327] Negotiation complete: Network error: Server connection negotiation failed: server connection from 127.0.0.1:37144: BlockingRecv error: recv got EOF from 127.0.0.1:37144 (error 108)
Metrics: {"server-negotiator.queue_time_us":38}
[       OK ] Parameters/TestRpc.RpcPendingConnectionsMetric/SSL_TCP (15 ms)
[ RUN      ] Parameters/TestRpc.TestRpcContextClientDeadline/SSL_TCP
I20260928 16:35:32.386603 25879 acceptor_pool.cc:254] collecting diagnostics on the listening RPC socket 0.0.0.0:33603 every 8 connection(s)
I20260928 16:35:32.386670 25880 acceptor_pool.cc:254] collecting diagnostics on the listening RPC socket 0.0.0.0:33603 every 8 connection(s)
[       OK ] Parameters/TestRpc.TestRpcContextClientDeadline/SSL_TCP (67 ms)
[ RUN      ] Parameters/TestRpc.TestApplicationFeatureFlagUnsupportedServer/SSL_TCP
I20260928 16:35:32.455770 25904 acceptor_pool.cc:254] collecting diagnostics on the listening RPC socket 0.0.0.0:45409 every 8 connection(s)
I20260928 16:35:32.455806 25905 acceptor_pool.cc:254] collecting diagnostics on the listening RPC socket 0.0.0.0:45409 every 8 connection(s)
[       OK ] Parameters/TestRpc.TestApplicationFeatureFlagUnsupportedServer/SSL_TCP (30 ms)
[ RUN      ] Parameters/TestRpc.TestCancellationAsync/SSL_TCP
I20260928 16:35:32.495616 25930 acceptor_pool.cc:254] collecting diagnostics on the listening RPC socket 0.0.0.0:34033 every 8 connection(s)
I20260928 16:35:32.495642 25929 acceptor_pool.cc:254] collecting diagnostics on the listening RPC socket 0.0.0.0:34033 every 8 connection(s)
I20260928 16:35:32.495858 25493 rpc-test.cc:1716] Connecting to 0.0.0.0:34033
I20260928 16:35:32.504251 25493 test_util.cc:268] Using random seed: -1482871114
I20260928 16:35:32.529682 25933 rpc-test-base.h:240] got call: sleep_micros: 500 pattern: 4294967295 num_repetitions: 2097152 sidecar_idx: 0
I20260928 16:35:32.550027 25933 rpc-test-base.h:240] got call: sleep_micros: 500 pattern: 4294967295 num_repetitions: 2097152 sidecar_idx: 0
I20260928 16:35:32.570235 25933 rpc-test-base.h:240] got call: sleep_micros: 500 pattern: 4294967295 num_repetitions: 2097152 sidecar_idx: 0
I20260928 16:35:32.590540 25933 rpc-test-base.h:240] got call: sleep_micros: 500 pattern: 4294967295 num_repetitions: 2097152 sidecar_idx: 0
I20260928 16:35:32.613511 25933 rpc-test-base.h:240] got call: sleep_micros: 500 pattern: 4294967295 num_repetitions: 2097152 sidecar_idx: 0
I20260928 16:35:32.637225 25933 rpc-test-base.h:240] got call: sleep_micros: 500 pattern: 4294967295 num_repetitions: 2097152 sidecar_idx: 0
I20260928 16:35:32.661614 25933 rpc-test-base.h:240] got call: sleep_micros: 500 pattern: 4294967295 num_repetitions: 2097152 sidecar_idx: 0
I20260928 16:35:32.686599 25933 rpc-test-base.h:240] got call: sleep_micros: 500 pattern: 4294967295 num_repetitions: 2097152 sidecar_idx: 0
I20260928 16:35:32.714124 25933 rpc-test-base.h:240] got call: sleep_micros: 500 pattern: 4294967295 num_repetitions: 2097152 sidecar_idx: 0
W20260928 16:35:32.732142 25928 connection.cc:441] server connection from 127.0.0.1:59732 torn down before Call kudu.rpc.GenericCalculatorService.SleepWithSidecar from 127.0.0.1:59732 (request call id 9) could send its response
[       OK ] Parameters/TestRpc.TestCancellationAsync/SSL_TCP (259 ms)
[ RUN      ] Parameters/TestRpc.TestPerformanceBySocketType/SSL_TCP
I20260928 16:35:32.762351 25954 acceptor_pool.cc:254] collecting diagnostics on the listening RPC socket 0.0.0.0:37893 every 8 connection(s)
I20260928 16:35:32.762409 25955 acceptor_pool.cc:254] collecting diagnostics on the listening RPC socket 0.0.0.0:37893 every 8 connection(s)
I20260928 16:35:32.762552 25493 rpc-test.cc:1846] Connecting to 0.0.0.0:37893
I20260928 16:35:35.640763 25493 rpc-test.cc:1859] Sending 1024MB via ssl-enabled tcp socket: real 2.855s	user 2.826s	sys 2.166s
I20260928 16:35:38.421401 25493 rpc-test.cc:1859] Sending 1024MB via ssl-enabled tcp socket: real 2.780s	user 2.749s	sys 2.136s
I20260928 16:35:41.323782 25493 rpc-test.cc:1859] Sending 1024MB via ssl-enabled tcp socket: real 2.902s	user 2.908s	sys 2.167s
I20260928 16:35:44.144645 25493 rpc-test.cc:1859] Sending 1024MB via ssl-enabled tcp socket: real 2.821s	user 2.758s	sys 2.183s
I20260928 16:35:47.018319 25493 rpc-test.cc:1859] Sending 1024MB via ssl-enabled tcp socket: real 2.874s	user 2.656s	sys 2.364s
[       OK ] Parameters/TestRpc.TestPerformanceBySocketType/SSL_TCP (14287 ms)
[----------] 20 tests from Parameters/TestRpc (46741 ms total)

[----------] 1 test from Parameters/TestRpcSocketTxRxQueue
[ RUN      ] Parameters/TestRpcSocketTxRxQueue.OverCapacity/0
W20260928 16:35:47.304376 26008 negotiation.cc:337] Failed RPC negotiation. Trace:
0928 16:35:47.036980 (+     0us) reactor.cc:625] Submitting negotiation task for client connection to 0.0.0.0:34671 (local address 127.0.0.1:59362)
0928 16:35:47.037181 (+   201us) negotiation.cc:107] Waiting for socket to connect
0928 16:35:47.037196 (+    15us) client_negotiation.cc:174] Beginning negotiation
0928 16:35:47.037303 (+   107us) client_negotiation.cc:252] Sending NEGOTIATE NegotiatePB request
0928 16:35:47.304190 (+266887us) negotiation.cc:327] Negotiation complete: Network error: Client connection negotiation failed: client connection to 0.0.0.0:34671: BlockingRecv error: recv error from unknown peer: Transport endpoint is not connected (error 107)
Metrics: {"client-negotiator.queue_time_us":110}
W20260928 16:35:47.304491 25999 negotiation.cc:337] Failed RPC negotiation. Trace:
0928 16:35:47.035164 (+     0us) reactor.cc:625] Submitting negotiation task for client connection to 0.0.0.0:34671 (local address 127.0.0.1:59348)
0928 16:35:47.035373 (+   209us) negotiation.cc:107] Waiting for socket to connect
0928 16:35:47.035386 (+    13us) client_negotiation.cc:174] Beginning negotiation
0928 16:35:47.035519 (+   133us) client_negotiation.cc:252] Sending NEGOTIATE NegotiatePB request
0928 16:35:47.304283 (+268764us) negotiation.cc:327] Negotiation complete: Network error: Client connection negotiation failed: client connection to 0.0.0.0:34671: BlockingRecv error: recv error from unknown peer: Transport endpoint is not connected (error 107)
Metrics: {"client-negotiator.queue_time_us":111}
W20260928 16:35:47.304409 25980 negotiation.cc:337] Failed RPC negotiation. Trace:
0928 16:35:47.032182 (+     0us) reactor.cc:625] Submitting negotiation task for client connection to 0.0.0.0:34671 (local address 127.0.0.1:59344)
0928 16:35:47.032305 (+   123us) negotiation.cc:107] Waiting for socket to connect
0928 16:35:47.032319 (+    14us) client_negotiation.cc:174] Beginning negotiation
0928 16:35:47.032405 (+    86us) client_negotiation.cc:252] Sending NEGOTIATE NegotiatePB request
0928 16:35:47.304190 (+271785us) negotiation.cc:327] Negotiation complete: Network error: Client connection negotiation failed: client connection to 0.0.0.0:34671: BlockingRecv error: recv error from unknown peer: Transport endpoint is not connected (error 107)
Metrics: {"client-negotiator.queue_time_us":48}
W20260928 16:35:47.304576 25970 negotiation.cc:337] Failed RPC negotiation. Trace:
0928 16:35:47.030686 (+     0us) reactor.cc:625] Submitting negotiation task for client connection to 0.0.0.0:34671 (local address 127.0.0.1:59328)
0928 16:35:47.030818 (+   132us) negotiation.cc:107] Waiting for socket to connect
0928 16:35:47.030833 (+    15us) client_negotiation.cc:174] Beginning negotiation
0928 16:35:47.030950 (+   117us) client_negotiation.cc:252] Sending NEGOTIATE NegotiatePB request
0928 16:35:47.304185 (+273235us) negotiation.cc:327] Negotiation complete: Network error: Client connection negotiation failed: client connection to 0.0.0.0:34671: BlockingRecv error: recv error from unknown peer: Transport endpoint is not connected (error 107)
Metrics: {"client-negotiator.queue_time_us":51}
W20260928 16:35:47.304576 25989 negotiation.cc:337] Failed RPC negotiation. Trace:
0928 16:35:47.033386 (+     0us) reactor.cc:625] Submitting negotiation task for client connection to 0.0.0.0:34671 (local address 127.0.0.1:59346)
0928 16:35:47.033526 (+   140us) negotiation.cc:107] Waiting for socket to connect
0928 16:35:47.033544 (+    18us) client_negotiation.cc:174] Beginning negotiation
0928 16:35:47.033674 (+   130us) client_negotiation.cc:252] Sending NEGOTIATE NegotiatePB request
0928 16:35:47.304185 (+270511us) negotiation.cc:327] Negotiation complete: Network error: Client connection negotiation failed: client connection to 0.0.0.0:34671: BlockingRecv error: recv error from unknown peer: Transport endpoint is not connected (error 107)
Metrics: {"client-negotiator.queue_time_us":38}
W20260928 16:35:47.305243 26017 negotiation.cc:337] Failed RPC negotiation. Trace:
0928 16:35:47.038703 (+     0us) reactor.cc:625] Submitting negotiation task for client connection to 0.0.0.0:34671 (local address 127.0.0.1:59366)
0928 16:35:47.039032 (+   329us) negotiation.cc:107] Waiting for socket to connect
0928 16:35:47.039049 (+    17us) client_negotiation.cc:174] Beginning negotiation
0928 16:35:47.039169 (+   120us) client_negotiation.cc:252] Sending NEGOTIATE NegotiatePB request
0928 16:35:47.305134 (+265965us) negotiation.cc:327] Negotiation complete: Network error: Client connection negotiation failed: client connection to 0.0.0.0:34671: BlockingRecv error: recv error from unknown peer: Transport endpoint is not connected (error 107)
Metrics: {"client-negotiator.queue_time_us":227}
[       OK ] Parameters/TestRpcSocketTxRxQueue.OverCapacity/0 (1066 ms)
[----------] 1 test from Parameters/TestRpcSocketTxRxQueue (1066 ms total)

[----------] Global test environment tear-down
[==========] 21 tests from 2 test suites ran. (47807 ms total)
[  PASSED  ] 20 tests.
[  FAILED  ] 1 test, listed below:
[  FAILED  ] Parameters/TestRpc.TestCallWithChainCertAndChainCA/SSL_TCP, where GetParam() = (true, false)

 1 FAILED TEST