Diagnosed failure
Parameters/TestRpc.TestCallWithChainCertAndChainCA/SSL_TCP: /data0/somelongdirectorytoavoidrpathissues/src/kudu/src/kudu/rpc/rpc-test.cc:270: Failure
Failed
Bad status: Runtime error: could not verify certificate chain (error with cert: subject=CN = localhost, ST = sadfjas, C = AS, emailAddress = sdflkdsajf, O = lskdfjlsad, OU = sldfkja, issuer=C = AS, ST = ASDfkjdhf, L = lskdjf, O = saldfja, OU = skdjf, CN = localhost, emailAddress = sadjflkadsj): : certificate has expired
Google Test trace:
/data0/somelongdirectorytoavoidrpathissues/src/kudu/src/kudu/rpc/rpc-test.cc:267: Connecting to 0.0.0.0:42875
I20260929 21:45:48.272822 7657 test_util.cc:175] -----------------------------------------------
I20260929 21:45:48.272989 7657 test_util.cc:176] Had fatal failures, leaving test files at /tmp/dist-test-taskLzTb_3/test-tmp/rpc-test.5.Parameters_TestRpc.TestCallWithChainCertAndChainCA_SSL_TCP.1790718347002323-7657-0
Full log
Note: This is test shard 6 of 8.
[==========] Running 21 tests from 2 test suites.
[----------] Global test environment set-up.
[----------] 20 tests from Parameters/TestRpc
[ RUN ] Parameters/TestRpc.TestMessengerCreateDestroy/SSL_TCP
WARNING: Logging before InitGoogleLogging() is written to STDERR
I20260929 21:45:47.100080 7657 rpc-test.cc:169] started messenger TestCreateDestroy
[ OK ] Parameters/TestRpc.TestMessengerCreateDestroy/SSL_TCP (1089 ms)
[ RUN ] Parameters/TestRpc.TestNegotiationDeadlock/SSL_TCP
I20260929 21:45:48.165849 7679 acceptor_pool.cc:254] collecting diagnostics on the listening RPC socket 0.0.0.0:45273 every 8 connection(s)
I20260929 21:45:48.167133 7680 acceptor_pool.cc:254] collecting diagnostics on the listening RPC socket 0.0.0.0:45273 every 8 connection(s)
[ OK ] Parameters/TestRpc.TestNegotiationDeadlock/SSL_TCP (75 ms)
[ RUN ] Parameters/TestRpc.TestCallWithChainCertAndChainCA/SSL_TCP
I20260929 21:45:48.246857 7695 acceptor_pool.cc:254] collecting diagnostics on the listening RPC socket 0.0.0.0:42875 every 8 connection(s)
I20260929 21:45:48.248744 7696 acceptor_pool.cc:254] collecting diagnostics on the listening RPC socket 0.0.0.0:42875 every 8 connection(s)
/data0/somelongdirectorytoavoidrpathissues/src/kudu/src/kudu/rpc/rpc-test.cc:270: Failure
Failed
Bad status: Runtime error: could not verify certificate chain (error with cert: subject=CN = localhost, ST = sadfjas, C = AS, emailAddress = sdflkdsajf, O = lskdfjlsad, OU = sldfkja, issuer=C = AS, ST = ASDfkjdhf, L = lskdjf, O = saldfja, OU = skdjf, CN = localhost, emailAddress = sadjflkadsj): : certificate has expired
Google Test trace:
/data0/somelongdirectorytoavoidrpathissues/src/kudu/src/kudu/rpc/rpc-test.cc:267: Connecting to 0.0.0.0:42875
I20260929 21:45:48.272822 7657 test_util.cc:175] -----------------------------------------------
I20260929 21:45:48.272989 7657 test_util.cc:176] Had fatal failures, leaving test files at /tmp/dist-test-taskLzTb_3/test-tmp/rpc-test.5.Parameters_TestRpc.TestCallWithChainCertAndChainCA_SSL_TCP.1790718347002323-7657-0
[ FAILED ] Parameters/TestRpc.TestCallWithChainCertAndChainCA/SSL_TCP, where GetParam() = (true, false) (55 ms)
[ RUN ] Parameters/TestRpc.TestCallWithPasswordProtectedKey/SSL_TCP
I20260929 21:45:48.287503 7720 acceptor_pool.cc:254] collecting diagnostics on the listening RPC socket 0.0.0.0:46671 every 8 connection(s)
I20260929 21:45:48.288221 7721 acceptor_pool.cc:254] collecting diagnostics on the listening RPC socket 0.0.0.0:46671 every 8 connection(s)
[ OK ] Parameters/TestRpc.TestCallWithPasswordProtectedKey/SSL_TCP (59 ms)
[ RUN ] Parameters/TestRpc.TestCallToBadServer/SSL_TCP
I20260929 21:45:48.379320 7657 rpc-test.cc:394] Status: Network error: Client connection negotiation failed: client connection to 0.0.0.0:0: connect: Connection refused (error 111)
I20260929 21:45:48.380571 7657 rpc-test.cc:394] Status: Network error: Client connection negotiation failed: client connection to 0.0.0.0:0: connect: Connection refused (error 111)
I20260929 21:45:48.381731 7657 rpc-test.cc:394] Status: Network error: Client connection negotiation failed: client connection to 0.0.0.0:0: connect: Connection refused (error 111)
I20260929 21:45:48.382865 7657 rpc-test.cc:394] Status: Network error: Client connection negotiation failed: client connection to 0.0.0.0:0: connect: Connection refused (error 111)
I20260929 21:45:48.383980 7657 rpc-test.cc:394] Status: Network error: Client connection negotiation failed: client connection to 0.0.0.0:0: connect: Connection refused (error 111)
[ OK ] Parameters/TestRpc.TestCallToBadServer/SSL_TCP (53 ms)
[ RUN ] Parameters/TestRpc.TestWrongService/SSL_TCP
I20260929 21:45:48.399956 7755 acceptor_pool.cc:254] collecting diagnostics on the listening RPC socket 0.0.0.0:39203 every 8 connection(s)
I20260929 21:45:48.400702 7756 acceptor_pool.cc:254] collecting diagnostics on the listening RPC socket 0.0.0.0:39203 every 8 connection(s)
I20260929 21:45:48.434137 7752 messenger.cc:345] service WrongServiceName not registered on TestServer
[ OK ] Parameters/TestRpc.TestWrongService/SSL_TCP (54 ms)
[ RUN ] Parameters/TestRpc.TestConnectionKeepalive/SSL_TCP
I20260929 21:45:48.458190 7778 acceptor_pool.cc:254] collecting diagnostics on the listening RPC socket 0.0.0.0:44411 every 8 connection(s)
I20260929 21:45:48.458971 7779 acceptor_pool.cc:254] collecting diagnostics on the listening RPC socket 0.0.0.0:44411 every 8 connection(s)
I20260929 21:45:48.461796 7657 rpc-test.cc:488] Connecting to 0.0.0.0:44411
[ OK ] Parameters/TestRpc.TestConnectionKeepalive/SSL_TCP (1075 ms)
[ RUN ] Parameters/TestRpc.TestClientConnectionMetrics/SSL_TCP
I20260929 21:45:49.555459 7803 acceptor_pool.cc:254] collecting diagnostics on the listening RPC socket 0.0.0.0:45531 every 8 connection(s)
I20260929 21:45:49.556205 7804 acceptor_pool.cc:254] collecting diagnostics on the listening RPC socket 0.0.0.0:45531 every 8 connection(s)
I20260929 21:45:49.559248 7657 rpc-test.cc:569] Connecting to 0.0.0.0:45531
[ OK ] Parameters/TestRpc.TestClientConnectionMetrics/SSL_TCP (109918 ms)
[ RUN ] Parameters/TestRpc.TestCredentialsPolicy/SSL_TCP
I20260929 21:47:39.465760 7837 acceptor_pool.cc:254] collecting diagnostics on the listening RPC socket 0.0.0.0:44491 every 8 connection(s)
I20260929 21:47:39.466451 7838 acceptor_pool.cc:254] collecting diagnostics on the listening RPC socket 0.0.0.0:44491 every 8 connection(s)
I20260929 21:47:39.469475 7657 rpc-test.cc:700] Connecting to 0.0.0.0:44491
[ OK ] Parameters/TestRpc.TestCredentialsPolicy/SSL_TCP (80 ms)
[ RUN ] Parameters/TestRpc.TestCallLongerThanKeepalive/SSL_TCP
I20260929 21:47:39.546748 7862 acceptor_pool.cc:254] collecting diagnostics on the listening RPC socket 0.0.0.0:46419 every 8 connection(s)
I20260929 21:47:39.547427 7863 acceptor_pool.cc:254] collecting diagnostics on the listening RPC socket 0.0.0.0:46419 every 8 connection(s)
I20260929 21:47:39.579859 7866 rpc-test-base.h:222] got call: sleep_micros: 3000000 deferred: true
I20260929 21:47:42.584023 7866 rpcz_store.cc:275] Call kudu.rpc.GenericCalculatorService.Sleep from 127.0.0.1:60688 (request call id 0) took 3004 ms. Trace:
I20260929 21:47:42.584316 7866 rpcz_store.cc:276] 0929 21:47:39.579615 (+ 0us) service_pool.cc:170] Inserting onto call queue
0929 21:47:39.579721 (+ 106us) service_pool.cc:227] Handling call
0929 21:47:42.583971 (+3004250us) inbound_call.cc:173] Queueing success response
Metrics: {}
[ OK ] Parameters/TestRpc.TestCallLongerThanKeepalive/SSL_TCP (3080 ms)
[ RUN ] Parameters/TestRpc.TestRpcSidecar/SSL_TCP
I20260929 21:47:42.624442 7887 acceptor_pool.cc:254] collecting diagnostics on the listening RPC socket 0.0.0.0:33131 every 8 connection(s)
I20260929 21:47:42.625111 7888 acceptor_pool.cc:254] collecting diagnostics on the listening RPC socket 0.0.0.0:33131 every 8 connection(s)
[ OK ] Parameters/TestRpc.TestRpcSidecar/SSL_TCP (513 ms)
[ RUN ] Parameters/TestRpc.TestRpcSidecarLimits/SSL_TCP
I20260929 21:47:59.034966 7914 acceptor_pool.cc:254] collecting diagnostics on the listening RPC socket 0.0.0.0:45543 every 8 connection(s)
I20260929 21:47:59.035722 7915 acceptor_pool.cc:254] collecting diagnostics on the listening RPC socket 0.0.0.0:45543 every 8 connection(s)
W20260929 21:47:59.048620 7657 serialization.cc:72] Serialized kudu.rpc_test.PushStringsRequestPB (2147483654 bytes) is larger than the maximum configured RPC message size (52428800 bytes). Sending anyway, but peer may reject the data.
W20260929 21:47:59.058495 7911 connection.cc:535] server connection from 127.0.0.1:33370 recv error: Network error: RPC frame had a length of 2147483714, but we only support messages up to 52428800 bytes long.
W20260929 21:47:59.058825 7911 connection.cc:158] shutting down server connection from 127.0.0.1:33370 with pending inbound data: 4/2147483714 bytes received; last active 0 ns ago: status Network error: RPC frame had a length of 2147483714, but we only support messages up to 52428800 bytes long.
W20260929 21:47:59.059607 7927 connection.cc:698] client connection to 0.0.0.0:45543 send error: Network error: failed to write to TLS socket: Connection reset by peer
W20260929 21:47:59.060117 7927 connection.cc:196] Error closing socket: Network error: TlsSocket::Close: Success
[ OK ] Parameters/TestRpc.TestRpcSidecarLimits/SSL_TCP (16515 ms)
[ RUN ] Parameters/TestRpc.TestCallTimeoutDoesntAffectNegotiation/SSL_TCP
I20260929 21:47:59.663293 7939 acceptor_pool.cc:254] collecting diagnostics on the listening RPC socket 0.0.0.0:36983 every 8 connection(s)
I20260929 21:47:59.663973 7940 acceptor_pool.cc:254] collecting diagnostics on the listening RPC socket 0.0.0.0:36983 every 8 connection(s)
W20260929 21:47:59.698611 7935 negotiation.cc:266] Injecting 500ms delay in negotiation
I20260929 21:47:59.749012 7657 rpc-test-base.h:595] status: Timed out: connection negotiation to 0.0.0.0:36983 for RPC Sleep timed out after 0.050s (ON_OUTBOUND_QUEUE), seconds elapsed: 0.0513685
[ OK ] Parameters/TestRpc.TestCallTimeoutDoesntAffectNegotiation/SSL_TCP (588 ms)
[ RUN ] Parameters/TestRpc.TestRpcHandlerLatencyMetric/SSL_TCP
I20260929 21:48:00.233222 7964 acceptor_pool.cc:254] collecting diagnostics on the listening RPC socket 0.0.0.0:34995 every 8 connection(s)
I20260929 21:48:00.233897 7965 acceptor_pool.cc:254] collecting diagnostics on the listening RPC socket 0.0.0.0:34995 every 8 connection(s)
I20260929 21:48:00.289275 7657 rpc-test.cc:1236] Sleep() min lat: 21462
I20260929 21:48:00.289463 7657 rpc-test.cc:1237] Sleep() mean lat: 21462
I20260929 21:48:00.289583 7657 rpc-test.cc:1238] Sleep() max lat: 21462
I20260929 21:48:00.289687 7657 rpc-test.cc:1239] Sleep() #calls: 1
[ OK ] Parameters/TestRpc.TestRpcHandlerLatencyMetric/SSL_TCP (81 ms)
[ RUN ] Parameters/TestRpc.TimedOutOnResponseMetricServiceQueue/SSL_TCP
I20260929 21:48:00.322970 7990 acceptor_pool.cc:254] collecting diagnostics on the listening RPC socket 0.0.0.0:44013 every 8 connection(s)
I20260929 21:48:00.323642 7991 acceptor_pool.cc:254] collecting diagnostics on the listening RPC socket 0.0.0.0:44013 every 8 connection(s)
W20260929 21:48:00.395715 7992 rpcz_store.cc:267] Call kudu.rpc_test.CalculatorService.Sleep from 127.0.0.1:45810 (request call id 2) took 20 ms (client timeout 20 ms). Trace:
W20260929 21:48:00.396029 7992 rpcz_store.cc:269] 0929 21:48:00.375245 (+ 0us) service_pool.cc:170] Inserting onto call queue
0929 21:48:00.395574 (+ 20329us) service_pool.cc:214] Skipping call since client already timed out
0929 21:48:00.395653 (+ 79us) inbound_call.cc:173] Queueing failure response
Metrics: {}
[ OK ] Parameters/TestRpc.TimedOutOnResponseMetricServiceQueue/SSL_TCP (105 ms)
[ RUN ] Parameters/TestRpc.RpcPendingConnectionsMetric/SSL_TCP
I20260929 21:48:00.411514 8013 acceptor_pool.cc:254] collecting diagnostics on the listening RPC socket 0.0.0.0:38977 every 8 connection(s)
I20260929 21:48:00.412187 8014 acceptor_pool.cc:254] collecting diagnostics on the listening RPC socket 0.0.0.0:38977 every 8 connection(s)
W20260929 21:48:00.416857 8009 negotiation.cc:337] Failed RPC negotiation. Trace:
0929 21:48:00.415712 (+ 0us) reactor.cc:625] Submitting negotiation task for server connection from 127.0.0.1:57132 (local address 127.0.0.1:38977)
0929 21:48:00.416066 (+ 354us) server_negotiation.cc:206] Beginning negotiation
0929 21:48:00.416083 (+ 17us) server_negotiation.cc:399] Waiting for connection header
0929 21:48:00.416345 (+ 262us) negotiation.cc:327] Negotiation complete: Network error: Server connection negotiation failed: server connection from 127.0.0.1:57132: BlockingRecv error: recv got EOF from 127.0.0.1:57132 (error 108)
Metrics: {"server-negotiator.queue_time_us":83}
[ OK ] Parameters/TestRpc.RpcPendingConnectionsMetric/SSL_TCP (27 ms)
[ RUN ] Parameters/TestRpc.TestRpcContextClientDeadline/SSL_TCP
I20260929 21:48:00.459275 8029 acceptor_pool.cc:254] collecting diagnostics on the listening RPC socket 0.0.0.0:35955 every 8 connection(s)
I20260929 21:48:00.459945 8030 acceptor_pool.cc:254] collecting diagnostics on the listening RPC socket 0.0.0.0:35955 every 8 connection(s)
[ OK ] Parameters/TestRpc.TestRpcContextClientDeadline/SSL_TCP (87 ms)
[ RUN ] Parameters/TestRpc.TestApplicationFeatureFlagUnsupportedServer/SSL_TCP
I20260929 21:48:00.547202 8054 acceptor_pool.cc:254] collecting diagnostics on the listening RPC socket 0.0.0.0:34785 every 8 connection(s)
I20260929 21:48:00.547852 8055 acceptor_pool.cc:254] collecting diagnostics on the listening RPC socket 0.0.0.0:34785 every 8 connection(s)
[ OK ] Parameters/TestRpc.TestApplicationFeatureFlagUnsupportedServer/SSL_TCP (77 ms)
[ RUN ] Parameters/TestRpc.TestCancellationAsync/SSL_TCP
I20260929 21:48:00.626729 8079 acceptor_pool.cc:254] collecting diagnostics on the listening RPC socket 0.0.0.0:36771 every 8 connection(s)
I20260929 21:48:00.627427 8080 acceptor_pool.cc:254] collecting diagnostics on the listening RPC socket 0.0.0.0:36771 every 8 connection(s)
I20260929 21:48:00.630287 7657 rpc-test.cc:1716] Connecting to 0.0.0.0:36771
I20260929 21:48:00.655227 7657 test_util.cc:268] Using random seed: 586064741
I20260929 21:48:00.879983 8083 rpc-test-base.h:240] got call: sleep_micros: 500 pattern: 4294967295 num_repetitions: 2097152 sidecar_idx: 0
I20260929 21:48:01.028936 8082 rpc-test-base.h:240] got call: sleep_micros: 500 pattern: 4294967295 num_repetitions: 2097152 sidecar_idx: 0
I20260929 21:48:01.210408 8083 rpc-test-base.h:240] got call: sleep_micros: 500 pattern: 4294967295 num_repetitions: 2097152 sidecar_idx: 0
I20260929 21:48:01.389259 8082 rpc-test-base.h:240] got call: sleep_micros: 500 pattern: 4294967295 num_repetitions: 2097152 sidecar_idx: 0
I20260929 21:48:01.558004 8083 rpc-test-base.h:240] got call: sleep_micros: 500 pattern: 4294967295 num_repetitions: 2097152 sidecar_idx: 0
I20260929 21:48:01.730792 8082 rpc-test-base.h:240] got call: sleep_micros: 500 pattern: 4294967295 num_repetitions: 2097152 sidecar_idx: 0
I20260929 21:48:01.895485 8083 rpc-test-base.h:240] got call: sleep_micros: 500 pattern: 4294967295 num_repetitions: 2097152 sidecar_idx: 0
I20260929 21:48:02.067768 8082 rpc-test-base.h:240] got call: sleep_micros: 500 pattern: 4294967295 num_repetitions: 2097152 sidecar_idx: 0
W20260929 21:48:02.205194 8077 connection.cc:535] server connection from 127.0.0.1:43404 recv error: Network error: failed to read from TLS socket (remote: unknown): Connection reset by peer (error 104)
W20260929 21:48:02.205448 8077 connection.cc:158] shutting down server connection from 127.0.0.1:43404 with pending inbound data: 7700565/8388693 bytes received; last active 0 ns ago: status Network error: failed to read from TLS socket (remote: unknown): Connection reset by peer (error 104)
W20260929 21:48:02.205842 8077 connection.cc:196] Error closing socket: Network error: TlsSocket::Close: Broken pipe
W20260929 21:48:02.259101 8077 connection.cc:441] server connection from 127.0.0.1:43404 torn down before Call kudu.rpc.GenericCalculatorService.SleepWithSidecar from 127.0.0.1:43404 (request call id 8) could send its response
[ OK ] Parameters/TestRpc.TestCancellationAsync/SSL_TCP (1675 ms)
[ RUN ] Parameters/TestRpc.TestPerformanceBySocketType/SSL_TCP
I20260929 21:48:02.359122 8104 acceptor_pool.cc:254] collecting diagnostics on the listening RPC socket 0.0.0.0:44013 every 8 connection(s)
I20260929 21:48:02.359858 8105 acceptor_pool.cc:254] collecting diagnostics on the listening RPC socket 0.0.0.0:44013 every 8 connection(s)
I20260929 21:48:02.362898 7657 rpc-test.cc:1846] Connecting to 0.0.0.0:44013
I20260929 21:48:20.534050 7657 rpc-test.cc:1859] Sending 1024MB via ssl-enabled tcp socket: real 18.140s user 16.228s sys 9.781s
I20260929 21:48:38.470234 7657 rpc-test.cc:1859] Sending 1024MB via ssl-enabled tcp socket: real 17.936s user 15.932s sys 9.702s
I20260929 21:48:56.388052 7657 rpc-test.cc:1859] Sending 1024MB via ssl-enabled tcp socket: real 17.917s user 15.655s sys 9.923s
I20260929 21:49:14.264739 7657 rpc-test.cc:1859] Sending 1024MB via ssl-enabled tcp socket: real 17.876s user 15.751s sys 9.729s
I20260929 21:49:32.166311 7657 rpc-test.cc:1859] Sending 1024MB via ssl-enabled tcp socket: real 17.901s user 15.596s sys 9.937s
[ OK ] Parameters/TestRpc.TestPerformanceBySocketType/SSL_TCP (89909 ms)
[----------] 20 tests from Parameters/TestRpc (225129 ms total)
[----------] 1 test from Parameters/TestRpcSocketTxRxQueue
[ RUN ] Parameters/TestRpcSocketTxRxQueue.OverCapacity/0
W20260929 21:49:32.604496 8157 negotiation.cc:337] Failed RPC negotiation. Trace:
0929 21:49:32.218883 (+ 0us) reactor.cc:625] Submitting negotiation task for client connection to 0.0.0.0:40053 (local address 127.0.0.1:56932)
0929 21:49:32.219412 (+ 529us) negotiation.cc:107] Waiting for socket to connect
0929 21:49:32.219441 (+ 29us) client_negotiation.cc:174] Beginning negotiation
0929 21:49:32.219641 (+ 200us) client_negotiation.cc:252] Sending NEGOTIATE NegotiatePB request
0929 21:49:32.603389 (+383748us) negotiation.cc:327] Negotiation complete: Network error: Client connection negotiation failed: client connection to 0.0.0.0:40053: BlockingRecv error: recv error from unknown peer: Transport endpoint is not connected (error 107)
Metrics: {"client-negotiator.queue_time_us":122}
W20260929 21:49:32.606114 8130 negotiation.cc:337] Failed RPC negotiation. Trace:
0929 21:49:32.194832 (+ 0us) reactor.cc:625] Submitting negotiation task for client connection to 0.0.0.0:40053 (local address 127.0.0.1:56916)
0929 21:49:32.195438 (+ 606us) negotiation.cc:107] Waiting for socket to connect
0929 21:49:32.195479 (+ 41us) client_negotiation.cc:174] Beginning negotiation
0929 21:49:32.195952 (+ 473us) client_negotiation.cc:252] Sending NEGOTIATE NegotiatePB request
0929 21:49:32.603484 (+407532us) negotiation.cc:327] Negotiation complete: Network error: Client connection negotiation failed: client connection to 0.0.0.0:40053: BlockingRecv error: recv error from unknown peer: Transport endpoint is not connected (error 107)
Metrics: {"client-negotiator.queue_time_us":100}
W20260929 21:49:32.606348 8166 negotiation.cc:337] Failed RPC negotiation. Trace:
0929 21:49:32.230132 (+ 0us) reactor.cc:625] Submitting negotiation task for client connection to 0.0.0.0:40053 (local address 127.0.0.1:56940)
0929 21:49:32.230694 (+ 562us) negotiation.cc:107] Waiting for socket to connect
0929 21:49:32.230726 (+ 32us) client_negotiation.cc:174] Beginning negotiation
0929 21:49:32.230910 (+ 184us) client_negotiation.cc:252] Sending NEGOTIATE NegotiatePB request
0929 21:49:32.604321 (+373411us) negotiation.cc:327] Negotiation complete: Network error: Client connection negotiation failed: client connection to 0.0.0.0:40053: BlockingRecv error: recv error from unknown peer: Transport endpoint is not connected (error 107)
Metrics: {"client-negotiator.queue_time_us":129}
W20260929 21:49:32.606755 8148 negotiation.cc:337] Failed RPC negotiation. Trace:
0929 21:49:32.207513 (+ 0us) reactor.cc:625] Submitting negotiation task for client connection to 0.0.0.0:40053 (local address 127.0.0.1:56928)
0929 21:49:32.208027 (+ 514us) negotiation.cc:107] Waiting for socket to connect
0929 21:49:32.208057 (+ 30us) client_negotiation.cc:174] Beginning negotiation
0929 21:49:32.208238 (+ 181us) client_negotiation.cc:252] Sending NEGOTIATE NegotiatePB request
0929 21:49:32.603405 (+395167us) negotiation.cc:327] Negotiation complete: Network error: Client connection negotiation failed: client connection to 0.0.0.0:40053: BlockingRecv error: recv error from unknown peer: Transport endpoint is not connected (error 107)
Metrics: {"client-negotiator.queue_time_us":120}
W20260929 21:49:32.607247 8139 negotiation.cc:337] Failed RPC negotiation. Trace:
0929 21:49:32.200973 (+ 0us) reactor.cc:625] Submitting negotiation task for client connection to 0.0.0.0:40053 (local address 127.0.0.1:56924)
0929 21:49:32.201454 (+ 481us) negotiation.cc:107] Waiting for socket to connect
0929 21:49:32.201482 (+ 28us) client_negotiation.cc:174] Beginning negotiation
0929 21:49:32.201653 (+ 171us) client_negotiation.cc:252] Sending NEGOTIATE NegotiatePB request
0929 21:49:32.603440 (+401787us) negotiation.cc:327] Negotiation complete: Network error: Client connection negotiation failed: client connection to 0.0.0.0:40053: BlockingRecv error: recv error from unknown peer: Transport endpoint is not connected (error 107)
Metrics: {"client-negotiator.queue_time_us":122}
W20260929 21:49:32.607354 8175 negotiation.cc:337] Failed RPC negotiation. Trace:
0929 21:49:32.241210 (+ 0us) reactor.cc:625] Submitting negotiation task for client connection to 0.0.0.0:40053 (local address 127.0.0.1:56946)
0929 21:49:32.241752 (+ 542us) negotiation.cc:107] Waiting for socket to connect
0929 21:49:32.241792 (+ 40us) client_negotiation.cc:174] Beginning negotiation
0929 21:49:32.242042 (+ 250us) client_negotiation.cc:252] Sending NEGOTIATE NegotiatePB request
0929 21:49:32.604236 (+362194us) negotiation.cc:327] Negotiation complete: Network error: Client connection negotiation failed: client connection to 0.0.0.0:40053: BlockingRecv error: recv error from unknown peer: Transport endpoint is not connected (error 107)
Metrics: {"client-negotiator.queue_time_us":131}
[ OK ] Parameters/TestRpcSocketTxRxQueue.OverCapacity/0 (1212 ms)
[----------] 1 test from Parameters/TestRpcSocketTxRxQueue (1212 ms total)
[----------] Global test environment tear-down
[==========] 21 tests from 2 test suites ran. (226342 ms total)
[ PASSED ] 20 tests.
[ FAILED ] 1 test, listed below:
[ FAILED ] Parameters/TestRpc.TestCallWithChainCertAndChainCA/SSL_TCP, where GetParam() = (true, false)
1 FAILED TEST