Diagnosed failure
Parameters/TestRpc.TestCallWithChainCertAndChainCA/SSL_UnixSocket: /data0/somelongdirectorytoavoidrpathissues/src/kudu/src/kudu/rpc/rpc-test.cc:270: Failure
Failed
Bad status: Runtime error: could not verify certificate chain (error with cert: subject=CN = localhost, ST = sadfjas, C = AS, emailAddress = sdflkdsajf, O = lskdfjlsad, OU = sldfkja, issuer=C = AS, ST = ASDfkjdhf, L = lskdjf, O = saldfja, OU = skdjf, CN = localhost, emailAddress = sadjflkadsj): : certificate has expired
Google Test trace:
/data0/somelongdirectorytoavoidrpathissues/src/kudu/src/kudu/rpc/rpc-test.cc:267: Connecting to unix:/tmp/dist-test-taskTmkCV2/test-tmp/rpc-test-dad0e3ce6b6b44c1ae9ec0f7a160e8c3.sock
I20260927 18:30:41.334825 379 test_util.cc:175] -----------------------------------------------
I20260927 18:30:41.334937 379 test_util.cc:176] Had fatal failures, leaving test files at /tmp/dist-test-taskTmkCV2/test-tmp/rpc-test.6.Parameters_TestRpc.TestCallWithChainCertAndChainCA_SSL_UnixSocket.1790533841216244-379-0
Full log
Note: This is test shard 7 of 8.
[==========] Running 21 tests from 2 test suites.
[----------] Global test environment set-up.
[----------] 20 tests from Parameters/TestRpc
[ RUN ] Parameters/TestRpc.TestMessengerCreateDestroy/SSL_UnixSocket
WARNING: Logging before InitGoogleLogging() is written to STDERR
I20260927 18:30:41.261761 379 rpc-test.cc:169] started messenger TestCreateDestroy
[ OK ] Parameters/TestRpc.TestMessengerCreateDestroy/SSL_UnixSocket (29 ms)
[ RUN ] Parameters/TestRpc.TestNegotiationDeadlock/SSL_UnixSocket
I20260927 18:30:41.277997 399 acceptor_pool.cc:254] collecting diagnostics on the listening RPC socket unix:/tmp/dist-test-taskTmkCV2/test-tmp/rpc-test-063da6eee1da480e959b07a07d251ea7.sock every 8 connection(s)
I20260927 18:30:41.278285 400 acceptor_pool.cc:254] collecting diagnostics on the listening RPC socket unix:/tmp/dist-test-taskTmkCV2/test-tmp/rpc-test-063da6eee1da480e959b07a07d251ea7.sock every 8 connection(s)
[ OK ] Parameters/TestRpc.TestNegotiationDeadlock/SSL_UnixSocket (33 ms)
[ RUN ] Parameters/TestRpc.TestCallWithChainCertAndChainCA/SSL_UnixSocket
I20260927 18:30:41.322631 415 acceptor_pool.cc:254] collecting diagnostics on the listening RPC socket unix:/tmp/dist-test-taskTmkCV2/test-tmp/rpc-test-dad0e3ce6b6b44c1ae9ec0f7a160e8c3.sock every 8 connection(s)
I20260927 18:30:41.322964 416 acceptor_pool.cc:254] collecting diagnostics on the listening RPC socket unix:/tmp/dist-test-taskTmkCV2/test-tmp/rpc-test-dad0e3ce6b6b44c1ae9ec0f7a160e8c3.sock every 8 connection(s)
/data0/somelongdirectorytoavoidrpathissues/src/kudu/src/kudu/rpc/rpc-test.cc:270: Failure
Failed
Bad status: Runtime error: could not verify certificate chain (error with cert: subject=CN = localhost, ST = sadfjas, C = AS, emailAddress = sdflkdsajf, O = lskdfjlsad, OU = sldfkja, issuer=C = AS, ST = ASDfkjdhf, L = lskdjf, O = saldfja, OU = skdjf, CN = localhost, emailAddress = sadjflkadsj): : certificate has expired
Google Test trace:
/data0/somelongdirectorytoavoidrpathissues/src/kudu/src/kudu/rpc/rpc-test.cc:267: Connecting to unix:/tmp/dist-test-taskTmkCV2/test-tmp/rpc-test-dad0e3ce6b6b44c1ae9ec0f7a160e8c3.sock
I20260927 18:30:41.334825 379 test_util.cc:175] -----------------------------------------------
I20260927 18:30:41.334937 379 test_util.cc:176] Had fatal failures, leaving test files at /tmp/dist-test-taskTmkCV2/test-tmp/rpc-test.6.Parameters_TestRpc.TestCallWithChainCertAndChainCA_SSL_UnixSocket.1790533841216244-379-0
[ FAILED ] Parameters/TestRpc.TestCallWithChainCertAndChainCA/SSL_UnixSocket, where GetParam() = (true, true) (36 ms)
[ RUN ] Parameters/TestRpc.TestCallWithPasswordProtectedKey/SSL_UnixSocket
I20260927 18:30:41.377485 440 acceptor_pool.cc:254] collecting diagnostics on the listening RPC socket unix:/tmp/dist-test-taskTmkCV2/test-tmp/rpc-test-7f7a85a92cf8440a9a7540a5e14cc03f.sock every 8 connection(s)
I20260927 18:30:41.377700 441 acceptor_pool.cc:254] collecting diagnostics on the listening RPC socket unix:/tmp/dist-test-taskTmkCV2/test-tmp/rpc-test-7f7a85a92cf8440a9a7540a5e14cc03f.sock every 8 connection(s)
W20260927 18:30:41.406610 437 connection.cc:196] Error closing socket: Network error: TlsSocket::Close: Broken pipe
[ OK ] Parameters/TestRpc.TestCallWithPasswordProtectedKey/SSL_UnixSocket (75 ms)
[ RUN ] Parameters/TestRpc.TestCallToBadServer/SSL_UnixSocket
I20260927 18:30:41.445899 379 rpc-test.cc:394] Status: Network error: Client connection negotiation failed: client connection to 0.0.0.0:0: connect: Connection refused (error 111)
I20260927 18:30:41.446712 379 rpc-test.cc:394] Status: Network error: Client connection negotiation failed: client connection to 0.0.0.0:0: connect: Connection refused (error 111)
I20260927 18:30:41.447331 379 rpc-test.cc:394] Status: Network error: Client connection negotiation failed: client connection to 0.0.0.0:0: connect: Connection refused (error 111)
I20260927 18:30:41.447899 379 rpc-test.cc:394] Status: Network error: Client connection negotiation failed: client connection to 0.0.0.0:0: connect: Connection refused (error 111)
I20260927 18:30:41.448483 379 rpc-test.cc:394] Status: Network error: Client connection negotiation failed: client connection to 0.0.0.0:0: connect: Connection refused (error 111)
[ OK ] Parameters/TestRpc.TestCallToBadServer/SSL_UnixSocket (40 ms)
[ RUN ] Parameters/TestRpc.TestWrongService/SSL_UnixSocket
I20260927 18:30:41.485652 475 acceptor_pool.cc:254] collecting diagnostics on the listening RPC socket unix:/tmp/dist-test-taskTmkCV2/test-tmp/rpc-test-7a15e253b4d14947ad552c5834d5217f.sock every 8 connection(s)
I20260927 18:30:41.485886 476 acceptor_pool.cc:254] collecting diagnostics on the listening RPC socket unix:/tmp/dist-test-taskTmkCV2/test-tmp/rpc-test-7a15e253b4d14947ad552c5834d5217f.sock every 8 connection(s)
I20260927 18:30:41.529870 472 messenger.cc:345] service WrongServiceName not registered on TestServer
W20260927 18:30:41.531097 472 connection.cc:196] Error closing socket: Network error: TlsSocket::Close: Broken pipe
[ OK ] Parameters/TestRpc.TestWrongService/SSL_UnixSocket (84 ms)
[ RUN ] Parameters/TestRpc.TestConnectionKeepalive/SSL_UnixSocket
I20260927 18:30:41.545939 498 acceptor_pool.cc:254] collecting diagnostics on the listening RPC socket unix:/tmp/dist-test-taskTmkCV2/test-tmp/rpc-test-9c954dfe9f26486ab8b506fb3313c11a.sock every 8 connection(s)
I20260927 18:30:41.546188 499 acceptor_pool.cc:254] collecting diagnostics on the listening RPC socket unix:/tmp/dist-test-taskTmkCV2/test-tmp/rpc-test-9c954dfe9f26486ab8b506fb3313c11a.sock every 8 connection(s)
I20260927 18:30:41.547073 379 rpc-test.cc:488] Connecting to unix:/tmp/dist-test-taskTmkCV2/test-tmp/rpc-test-9c954dfe9f26486ab8b506fb3313c11a.sock
W20260927 18:30:42.037245 511 connection.cc:196] Error closing socket: Network error: TlsSocket::Close: Broken pipe
[ OK ] Parameters/TestRpc.TestConnectionKeepalive/SSL_UnixSocket (1037 ms)
[ RUN ] Parameters/TestRpc.TestClientConnectionMetrics/SSL_UnixSocket
I20260927 18:30:42.589999 523 acceptor_pool.cc:254] collecting diagnostics on the listening RPC socket unix:/tmp/dist-test-taskTmkCV2/test-tmp/rpc-test-60231038ba5140c4acd74f7690f87505.sock every 8 connection(s)
I20260927 18:30:42.590195 524 acceptor_pool.cc:254] collecting diagnostics on the listening RPC socket unix:/tmp/dist-test-taskTmkCV2/test-tmp/rpc-test-60231038ba5140c4acd74f7690f87505.sock every 8 connection(s)
I20260927 18:30:42.591135 379 rpc-test.cc:569] Connecting to unix:/tmp/dist-test-taskTmkCV2/test-tmp/rpc-test-60231038ba5140c4acd74f7690f87505.sock
W20260927 18:31:02.808559 520 connection.cc:196] Error closing socket: Network error: TlsSocket::Close: Broken pipe
[ OK ] Parameters/TestRpc.TestClientConnectionMetrics/SSL_UnixSocket (20242 ms)
[ RUN ] Parameters/TestRpc.TestCredentialsPolicy/SSL_UnixSocket
I20260927 18:31:02.837662 546 acceptor_pool.cc:254] collecting diagnostics on the listening RPC socket unix:/tmp/dist-test-taskTmkCV2/test-tmp/rpc-test-01f591f4414244548ac9f825e9f59b3d.sock every 8 connection(s)
I20260927 18:31:02.837888 547 acceptor_pool.cc:254] collecting diagnostics on the listening RPC socket unix:/tmp/dist-test-taskTmkCV2/test-tmp/rpc-test-01f591f4414244548ac9f825e9f59b3d.sock every 8 connection(s)
I20260927 18:31:02.838846 379 rpc-test.cc:700] Connecting to unix:/tmp/dist-test-taskTmkCV2/test-tmp/rpc-test-01f591f4414244548ac9f825e9f59b3d.sock
W20260927 18:31:02.866463 545 connection.cc:196] Error closing socket: Network error: TlsSocket::Close: Broken pipe
[ OK ] Parameters/TestRpc.TestCredentialsPolicy/SSL_UnixSocket (60 ms)
[ RUN ] Parameters/TestRpc.TestCallLongerThanKeepalive/SSL_UnixSocket
I20260927 18:31:02.885308 571 acceptor_pool.cc:254] collecting diagnostics on the listening RPC socket unix:/tmp/dist-test-taskTmkCV2/test-tmp/rpc-test-c42cadfa900e4ddc8af83151105a357b.sock every 8 connection(s)
I20260927 18:31:02.885537 572 acceptor_pool.cc:254] collecting diagnostics on the listening RPC socket unix:/tmp/dist-test-taskTmkCV2/test-tmp/rpc-test-c42cadfa900e4ddc8af83151105a357b.sock every 8 connection(s)
I20260927 18:31:02.905896 575 rpc-test-base.h:222] got call: sleep_micros: 3000000 deferred: true
I20260927 18:31:05.907483 575 rpcz_store.cc:275] Call kudu.rpc.GenericCalculatorService.Sleep from unix:<unnamed> (request call id 0) took 3001 ms. Trace:
I20260927 18:31:05.907648 575 rpcz_store.cc:276] 0927 18:31:02.905798 (+ 0us) service_pool.cc:170] Inserting onto call queue
0927 18:31:02.905853 (+ 55us) service_pool.cc:227] Handling call
0927 18:31:05.907439 (+3001586us) inbound_call.cc:173] Queueing success response
Metrics: {}
[ OK ] Parameters/TestRpc.TestCallLongerThanKeepalive/SSL_UnixSocket (3037 ms)
[ RUN ] Parameters/TestRpc.TestRpcSidecar/SSL_UnixSocket
I20260927 18:31:05.926138 596 acceptor_pool.cc:254] collecting diagnostics on the listening RPC socket unix:/tmp/dist-test-taskTmkCV2/test-tmp/rpc-test-e793beb36f394e90b6fb84c0219b3056.sock every 8 connection(s)
I20260927 18:31:05.926355 597 acceptor_pool.cc:254] collecting diagnostics on the listening RPC socket unix:/tmp/dist-test-taskTmkCV2/test-tmp/rpc-test-e793beb36f394e90b6fb84c0219b3056.sock every 8 connection(s)
W20260927 18:31:06.034116 593 connection.cc:196] Error closing socket: Network error: TlsSocket::Close: Broken pipe
[ OK ] Parameters/TestRpc.TestRpcSidecar/SSL_UnixSocket (123 ms)
[ RUN ] Parameters/TestRpc.TestRpcSidecarLimits/SSL_UnixSocket
I20260927 18:31:08.081152 621 acceptor_pool.cc:254] collecting diagnostics on the listening RPC socket unix:/tmp/dist-test-taskTmkCV2/test-tmp/rpc-test-2c8f4b92a4dd460d9fdfb5cf8b9c1a30.sock every 8 connection(s)
I20260927 18:31:08.081357 622 acceptor_pool.cc:254] collecting diagnostics on the listening RPC socket unix:/tmp/dist-test-taskTmkCV2/test-tmp/rpc-test-2c8f4b92a4dd460d9fdfb5cf8b9c1a30.sock every 8 connection(s)
W20260927 18:31:08.093132 379 serialization.cc:72] Serialized kudu.rpc_test.PushStringsRequestPB (2147483654 bytes) is larger than the maximum configured RPC message size (52428800 bytes). Sending anyway, but peer may reject the data.
W20260927 18:31:08.098778 618 connection.cc:535] server connection from unix:<unnamed> recv error: Network error: RPC frame had a length of 2147483714, but we only support messages up to 52428800 bytes long.
W20260927 18:31:08.098908 618 connection.cc:158] shutting down server connection from unix:<unnamed> with pending inbound data: 4/2147483714 bytes received; last active 0 ns ago: status Network error: RPC frame had a length of 2147483714, but we only support messages up to 52428800 bytes long.
W20260927 18:31:08.099399 634 connection.cc:196] Error closing socket: Network error: TlsSocket::Close: Broken pipe
I20260927 18:31:08.114751 646 acceptor_pool.cc:254] collecting diagnostics on the listening RPC socket unix:/tmp/dist-test-taskTmkCV2/test-tmp/rpc-test-2c8f4b92a4dd460d9fdfb5cf8b9c1a30.sock every 8 connection(s)
I20260927 18:31:08.114894 647 acceptor_pool.cc:254] collecting diagnostics on the listening RPC socket unix:/tmp/dist-test-taskTmkCV2/test-tmp/rpc-test-2c8f4b92a4dd460d9fdfb5cf8b9c1a30.sock every 8 connection(s)
W20260927 18:31:13.614037 643 connection.cc:577] server connection from unix:<unnamed>: received bad data: 'Corruption: Invalid packet: message had a length of 2147483710, but we only support messages up to 2147483647 bytes
'
W20260927 18:31:13.614643 659 connection.cc:196] Error closing socket: Network error: TlsSocket::Close: Broken pipe
[ OK ] Parameters/TestRpc.TestRpcSidecarLimits/SSL_UnixSocket (7983 ms)
[ RUN ] Parameters/TestRpc.TestCallTimeoutDoesntAffectNegotiation/SSL_UnixSocket
I20260927 18:31:14.046924 671 acceptor_pool.cc:254] collecting diagnostics on the listening RPC socket unix:/tmp/dist-test-taskTmkCV2/test-tmp/rpc-test-3e26e6e286734f9ea12f4ee7eaaf56e4.sock every 8 connection(s)
I20260927 18:31:14.047163 672 acceptor_pool.cc:254] collecting diagnostics on the listening RPC socket unix:/tmp/dist-test-taskTmkCV2/test-tmp/rpc-test-3e26e6e286734f9ea12f4ee7eaaf56e4.sock every 8 connection(s)
W20260927 18:31:14.065302 667 negotiation.cc:266] Injecting 500ms delay in negotiation
I20260927 18:31:14.115715 379 rpc-test-base.h:595] status: Timed out: connection negotiation to unix:/tmp/dist-test-taskTmkCV2/test-tmp/rpc-test-3e26e6e286734f9ea12f4ee7eaaf56e4.sock for RPC Sleep timed out after 0.050s (ON_OUTBOUND_QUEUE), seconds elapsed: 0.0509977
[ OK ] Parameters/TestRpc.TestCallTimeoutDoesntAffectNegotiation/SSL_UnixSocket (553 ms)
[ RUN ] Parameters/TestRpc.TestRpcHandlerLatencyMetric/SSL_UnixSocket
I20260927 18:31:14.584554 696 acceptor_pool.cc:254] collecting diagnostics on the listening RPC socket unix:/tmp/dist-test-taskTmkCV2/test-tmp/rpc-test-142e05342cac41078e632df172e63433.sock every 8 connection(s)
I20260927 18:31:14.584811 697 acceptor_pool.cc:254] collecting diagnostics on the listening RPC socket unix:/tmp/dist-test-taskTmkCV2/test-tmp/rpc-test-142e05342cac41078e632df172e63433.sock every 8 connection(s)
I20260927 18:31:14.629848 379 rpc-test.cc:1236] Sleep() min lat: 20575
I20260927 18:31:14.629958 379 rpc-test.cc:1237] Sleep() mean lat: 20575
I20260927 18:31:14.630017 379 rpc-test.cc:1238] Sleep() max lat: 20575
I20260927 18:31:14.630050 379 rpc-test.cc:1239] Sleep() #calls: 1
W20260927 18:31:14.631305 693 connection.cc:196] Error closing socket: Network error: TlsSocket::Close: Broken pipe
[ OK ] Parameters/TestRpc.TestRpcHandlerLatencyMetric/SSL_UnixSocket (59 ms)
[ RUN ] Parameters/TestRpc.TimedOutOnResponseMetricServiceQueue/SSL_UnixSocket
I20260927 18:31:14.657219 722 acceptor_pool.cc:254] collecting diagnostics on the listening RPC socket unix:/tmp/dist-test-taskTmkCV2/test-tmp/rpc-test-924e1cc195c5448fa8e88f658a4ebc12.sock every 8 connection(s)
I20260927 18:31:14.657392 723 acceptor_pool.cc:254] collecting diagnostics on the listening RPC socket unix:/tmp/dist-test-taskTmkCV2/test-tmp/rpc-test-924e1cc195c5448fa8e88f658a4ebc12.sock every 8 connection(s)
W20260927 18:31:14.723691 724 rpcz_store.cc:267] Call kudu.rpc_test.CalculatorService.Sleep from unix:<unnamed> (request call id 2) took 20 ms (client timeout 20 ms). Trace:
W20260927 18:31:14.723886 724 rpcz_store.cc:269] 0927 18:31:14.703332 (+ 0us) service_pool.cc:170] Inserting onto call queue
0927 18:31:14.723636 (+ 20304us) service_pool.cc:214] Skipping call since client already timed out
0927 18:31:14.723674 (+ 38us) inbound_call.cc:173] Queueing failure response
Metrics: {}
[ OK ] Parameters/TestRpc.TimedOutOnResponseMetricServiceQueue/SSL_UnixSocket (93 ms)
[ RUN ] Parameters/TestRpc.RpcPendingConnectionsMetric/SSL_UnixSocket
I20260927 18:31:14.732180 745 acceptor_pool.cc:254] collecting diagnostics on the listening RPC socket 0.0.0.0:45817 every 8 connection(s)
I20260927 18:31:14.732374 746 acceptor_pool.cc:254] collecting diagnostics on the listening RPC socket 0.0.0.0:45817 every 8 connection(s)
W20260927 18:31:14.742370 741 negotiation.cc:337] Failed RPC negotiation. Trace:
0927 18:31:14.741544 (+ 0us) reactor.cc:625] Submitting negotiation task for server connection from 127.0.0.1:34798 (local address 127.0.0.1:45817)
0927 18:31:14.741737 (+ 193us) server_negotiation.cc:206] Beginning negotiation
0927 18:31:14.741744 (+ 7us) server_negotiation.cc:399] Waiting for connection header
0927 18:31:14.741939 (+ 195us) negotiation.cc:327] Negotiation complete: Network error: Server connection negotiation failed: server connection from 127.0.0.1:34798: BlockingRecv error: recv got EOF from 127.0.0.1:34798 (error 108)
Metrics: {"server-negotiator.queue_time_us":43}
[ OK ] Parameters/TestRpc.RpcPendingConnectionsMetric/SSL_UnixSocket (26 ms)
[ RUN ] Parameters/TestRpc.TestRpcContextClientDeadline/SSL_UnixSocket
I20260927 18:31:14.776986 761 acceptor_pool.cc:254] collecting diagnostics on the listening RPC socket unix:/tmp/dist-test-taskTmkCV2/test-tmp/rpc-test-e20a5ae7a18049b488386c4905ca3879.sock every 8 connection(s)
I20260927 18:31:14.777151 762 acceptor_pool.cc:254] collecting diagnostics on the listening RPC socket unix:/tmp/dist-test-taskTmkCV2/test-tmp/rpc-test-e20a5ae7a18049b488386c4905ca3879.sock every 8 connection(s)
W20260927 18:31:14.824077 758 connection.cc:196] Error closing socket: Network error: TlsSocket::Close: Broken pipe
[ OK ] Parameters/TestRpc.TestRpcContextClientDeadline/SSL_UnixSocket (72 ms)
[ RUN ] Parameters/TestRpc.TestApplicationFeatureFlagUnsupportedServer/SSL_UnixSocket
I20260927 18:31:14.845249 786 acceptor_pool.cc:254] collecting diagnostics on the listening RPC socket unix:/tmp/dist-test-taskTmkCV2/test-tmp/rpc-test-d86a5124786743f984ed2136679b9efa.sock every 8 connection(s)
I20260927 18:31:14.845434 787 acceptor_pool.cc:254] collecting diagnostics on the listening RPC socket unix:/tmp/dist-test-taskTmkCV2/test-tmp/rpc-test-d86a5124786743f984ed2136679b9efa.sock every 8 connection(s)
W20260927 18:31:14.867079 783 connection.cc:196] Error closing socket: Network error: TlsSocket::Close: Broken pipe
[ OK ] Parameters/TestRpc.TestApplicationFeatureFlagUnsupportedServer/SSL_UnixSocket (42 ms)
[ RUN ] Parameters/TestRpc.TestCancellationAsync/SSL_UnixSocket
I20260927 18:31:14.890563 811 acceptor_pool.cc:254] collecting diagnostics on the listening RPC socket unix:/tmp/dist-test-taskTmkCV2/test-tmp/rpc-test-0ce355a10b7245faaa16d4aaae44145b.sock every 8 connection(s)
I20260927 18:31:14.890779 812 acceptor_pool.cc:254] collecting diagnostics on the listening RPC socket unix:/tmp/dist-test-taskTmkCV2/test-tmp/rpc-test-0ce355a10b7245faaa16d4aaae44145b.sock every 8 connection(s)
I20260927 18:31:14.891702 379 rpc-test.cc:1716] Connecting to unix:/tmp/dist-test-taskTmkCV2/test-tmp/rpc-test-0ce355a10b7245faaa16d4aaae44145b.sock
I20260927 18:31:14.910758 379 test_util.cc:268] Using random seed: 663914003
I20260927 18:31:14.944185 815 rpc-test-base.h:240] got call: sleep_micros: 500 pattern: 4294967295 num_repetitions: 2097152 sidecar_idx: 0
I20260927 18:31:14.971724 814 rpc-test-base.h:240] got call: sleep_micros: 500 pattern: 4294967295 num_repetitions: 2097152 sidecar_idx: 0
I20260927 18:31:14.999456 815 rpc-test-base.h:240] got call: sleep_micros: 500 pattern: 4294967295 num_repetitions: 2097152 sidecar_idx: 0
I20260927 18:31:15.028592 814 rpc-test-base.h:240] got call: sleep_micros: 500 pattern: 4294967295 num_repetitions: 2097152 sidecar_idx: 0
I20260927 18:31:15.060412 815 rpc-test-base.h:240] got call: sleep_micros: 500 pattern: 4294967295 num_repetitions: 2097152 sidecar_idx: 0
I20260927 18:31:15.089444 814 rpc-test-base.h:240] got call: sleep_micros: 500 pattern: 4294967295 num_repetitions: 2097152 sidecar_idx: 0
I20260927 18:31:15.116482 815 rpc-test-base.h:240] got call: sleep_micros: 500 pattern: 4294967295 num_repetitions: 2097152 sidecar_idx: 0
W20260927 18:31:15.118901 808 connection.cc:196] Error closing socket: Network error: TlsSocket::Close: Broken pipe
W20260927 18:31:15.133195 808 connection.cc:441] server connection from unix:<unnamed> torn down before Call kudu.rpc.GenericCalculatorService.SleepWithSidecar from unix:<unnamed> (request call id 8) could send its response
W20260927 18:31:15.150110 808 connection.cc:441] server connection from unix:<unnamed> torn down before Call kudu.rpc.GenericCalculatorService.SleepWithSidecar from unix:<unnamed> (request call id 9) could send its response
[ OK ] Parameters/TestRpc.TestCancellationAsync/SSL_UnixSocket (282 ms)
[ RUN ] Parameters/TestRpc.TestPerformanceBySocketType/SSL_UnixSocket
I20260927 18:31:15.193367 836 acceptor_pool.cc:254] collecting diagnostics on the listening RPC socket unix:/tmp/dist-test-taskTmkCV2/test-tmp/rpc-test-68372c28b2fa4888ba4e5956c3fff2a1.sock every 8 connection(s)
I20260927 18:31:15.193552 837 acceptor_pool.cc:254] collecting diagnostics on the listening RPC socket unix:/tmp/dist-test-taskTmkCV2/test-tmp/rpc-test-68372c28b2fa4888ba4e5956c3fff2a1.sock every 8 connection(s)
I20260927 18:31:15.194386 379 rpc-test.cc:1846] Connecting to unix:/tmp/dist-test-taskTmkCV2/test-tmp/rpc-test-68372c28b2fa4888ba4e5956c3fff2a1.sock
I20260927 18:31:18.204185 379 rpc-test.cc:1859] Sending 1024MB via ssl-enabled unix socket: real 2.997s user 3.078s sys 2.009s
I20260927 18:31:21.136300 379 rpc-test.cc:1859] Sending 1024MB via ssl-enabled unix socket: real 2.932s user 2.898s sys 2.084s
I20260927 18:31:24.122432 379 rpc-test.cc:1859] Sending 1024MB via ssl-enabled unix socket: real 2.986s user 2.919s sys 2.128s
I20260927 18:31:27.225343 379 rpc-test.cc:1859] Sending 1024MB via ssl-enabled unix socket: real 3.103s user 3.166s sys 2.108s
I20260927 18:31:30.268754 379 rpc-test.cc:1859] Sending 1024MB via ssl-enabled unix socket: real 3.043s user 3.154s sys 2.021s
W20260927 18:31:30.269763 833 connection.cc:196] Error closing socket: Network error: TlsSocket::Close: Broken pipe
[ OK ] Parameters/TestRpc.TestPerformanceBySocketType/SSL_UnixSocket (15123 ms)
[----------] 20 tests from Parameters/TestRpc (49041 ms total)
[----------] 1 test from Parameters/TestRpcSocketTxRxQueue
[ RUN ] Parameters/TestRpcSocketTxRxQueue.AcceptorRxQueueSizeMetric/0
I20260927 18:31:30.280716 861 acceptor_pool.cc:254] collecting diagnostics on the listening RPC socket 0.0.0.0:37023 every 1 connection(s)
I20260927 18:31:30.280990 862 acceptor_pool.cc:254] collecting diagnostics on the listening RPC socket 0.0.0.0:37023 every 1 connection(s)
W20260927 18:31:30.282560 857 negotiation.cc:337] Failed RPC negotiation. Trace:
0927 18:31:30.282186 (+ 0us) reactor.cc:625] Submitting negotiation task for server connection from 127.0.0.1:42460 (local address 127.0.0.1:37023)
0927 18:31:30.282326 (+ 140us) server_negotiation.cc:206] Beginning negotiation
0927 18:31:30.282331 (+ 5us) server_negotiation.cc:399] Waiting for connection header
0927 18:31:30.282454 (+ 123us) negotiation.cc:327] Negotiation complete: Network error: Server connection negotiation failed: server connection from 127.0.0.1:42460: BlockingRecv error: recv got EOF from 127.0.0.1:42460 (error 108)
Metrics: {"server-negotiator.queue_time_us":47}
[ OK ] Parameters/TestRpcSocketTxRxQueue.AcceptorRxQueueSizeMetric/0 (9 ms)
[----------] 1 test from Parameters/TestRpcSocketTxRxQueue (9 ms total)
[----------] Global test environment tear-down
[==========] 21 tests from 2 test suites ran. (49051 ms total)
[ PASSED ] 20 tests.
[ FAILED ] 1 test, listed below:
[ FAILED ] Parameters/TestRpc.TestCallWithChainCertAndChainCA/SSL_UnixSocket, where GetParam() = (true, true)
1 FAILED TEST