Diagnosed failure

Parameters/TestRpc.TestCallWithChainCertAndChainCA/SSL_UnixSocket: /data0/somelongdirectorytoavoidrpathissues/src/kudu/src/kudu/rpc/rpc-test.cc:270: Failure
Failed
Bad status: Runtime error: could not verify certificate chain (error with cert: subject=CN = localhost, ST = sadfjas, C = AS, emailAddress = sdflkdsajf, O = lskdfjlsad, OU = sldfkja, issuer=C = AS, ST = ASDfkjdhf, L = lskdjf, O = saldfja, OU = skdjf, CN = localhost, emailAddress = sadjflkadsj): : certificate has expired
Google Test trace:
/data0/somelongdirectorytoavoidrpathissues/src/kudu/src/kudu/rpc/rpc-test.cc:267: Connecting to unix:/tmp/dist-test-taskI6h4BE/test-tmp/rpc-test-7db2bb5178b74b1996e5c88cf38251f2.sock
I20260924 10:34:58.216097  7359 test_util.cc:175] -----------------------------------------------
I20260924 10:34:58.216143  7359 test_util.cc:176] Had fatal failures, leaving test files at /tmp/dist-test-taskI6h4BE/test-tmp/rpc-test.6.Parameters_TestRpc.TestCallWithChainCertAndChainCA_SSL_UnixSocket.1790246098142861-7359-0

Full log

Note: This is test shard 7 of 8.
[==========] Running 21 tests from 2 test suites.
[----------] Global test environment set-up.
[----------] 20 tests from Parameters/TestRpc
[ RUN      ] Parameters/TestRpc.TestMessengerCreateDestroy/SSL_UnixSocket
WARNING: Logging before InitGoogleLogging() is written to STDERR
I20260924 10:34:58.164744  7359 rpc-test.cc:169] started messenger TestCreateDestroy
[       OK ] Parameters/TestRpc.TestMessengerCreateDestroy/SSL_UnixSocket (16 ms)
[ RUN      ] Parameters/TestRpc.TestNegotiationDeadlock/SSL_UnixSocket
I20260924 10:34:58.178915  7379 acceptor_pool.cc:254] collecting diagnostics on the listening RPC socket unix:/tmp/dist-test-taskI6h4BE/test-tmp/rpc-test-967653c2627542519c68a46e775b82de.sock every 8 connection(s)
I20260924 10:34:58.178933  7380 acceptor_pool.cc:254] collecting diagnostics on the listening RPC socket unix:/tmp/dist-test-taskI6h4BE/test-tmp/rpc-test-967653c2627542519c68a46e775b82de.sock every 8 connection(s)
[       OK ] Parameters/TestRpc.TestNegotiationDeadlock/SSL_UnixSocket (21 ms)
[ RUN      ] Parameters/TestRpc.TestCallWithChainCertAndChainCA/SSL_UnixSocket
I20260924 10:34:58.211488  7396 acceptor_pool.cc:254] collecting diagnostics on the listening RPC socket unix:/tmp/dist-test-taskI6h4BE/test-tmp/rpc-test-7db2bb5178b74b1996e5c88cf38251f2.sock every 8 connection(s)
I20260924 10:34:58.211500  7395 acceptor_pool.cc:254] collecting diagnostics on the listening RPC socket unix:/tmp/dist-test-taskI6h4BE/test-tmp/rpc-test-7db2bb5178b74b1996e5c88cf38251f2.sock every 8 connection(s)
/data0/somelongdirectorytoavoidrpathissues/src/kudu/src/kudu/rpc/rpc-test.cc:270: Failure
Failed
Bad status: Runtime error: could not verify certificate chain (error with cert: subject=CN = localhost, ST = sadfjas, C = AS, emailAddress = sdflkdsajf, O = lskdfjlsad, OU = sldfkja, issuer=C = AS, ST = ASDfkjdhf, L = lskdjf, O = saldfja, OU = skdjf, CN = localhost, emailAddress = sadjflkadsj): : certificate has expired
Google Test trace:
/data0/somelongdirectorytoavoidrpathissues/src/kudu/src/kudu/rpc/rpc-test.cc:267: Connecting to unix:/tmp/dist-test-taskI6h4BE/test-tmp/rpc-test-7db2bb5178b74b1996e5c88cf38251f2.sock
I20260924 10:34:58.216097  7359 test_util.cc:175] -----------------------------------------------
I20260924 10:34:58.216143  7359 test_util.cc:176] Had fatal failures, leaving test files at /tmp/dist-test-taskI6h4BE/test-tmp/rpc-test.6.Parameters_TestRpc.TestCallWithChainCertAndChainCA_SSL_UnixSocket.1790246098142861-7359-0
[  FAILED  ] Parameters/TestRpc.TestCallWithChainCertAndChainCA/SSL_UnixSocket, where GetParam() = (true, true) (27 ms)
[ RUN      ] Parameters/TestRpc.TestCallWithPasswordProtectedKey/SSL_UnixSocket
I20260924 10:34:58.224833  7420 acceptor_pool.cc:254] collecting diagnostics on the listening RPC socket unix:/tmp/dist-test-taskI6h4BE/test-tmp/rpc-test-178c2eb8a653497084d9e6719c8c387d.sock every 8 connection(s)
I20260924 10:34:58.224870  7421 acceptor_pool.cc:254] collecting diagnostics on the listening RPC socket unix:/tmp/dist-test-taskI6h4BE/test-tmp/rpc-test-178c2eb8a653497084d9e6719c8c387d.sock every 8 connection(s)
W20260924 10:34:58.237349  7417 connection.cc:196] Error closing socket: Network error: TlsSocket::Close: Broken pipe
[       OK ] Parameters/TestRpc.TestCallWithPasswordProtectedKey/SSL_UnixSocket (22 ms)
[ RUN      ] Parameters/TestRpc.TestCallToBadServer/SSL_UnixSocket
I20260924 10:34:58.282006  7359 rpc-test.cc:394] Status: Network error: Client connection negotiation failed: client connection to 0.0.0.0:0: connect: Connection refused (error 111)
I20260924 10:34:58.282446  7359 rpc-test.cc:394] Status: Network error: Client connection negotiation failed: client connection to 0.0.0.0:0: connect: Connection refused (error 111)
I20260924 10:34:58.282828  7359 rpc-test.cc:394] Status: Network error: Client connection negotiation failed: client connection to 0.0.0.0:0: connect: Connection refused (error 111)
I20260924 10:34:58.283200  7359 rpc-test.cc:394] Status: Network error: Client connection negotiation failed: client connection to 0.0.0.0:0: connect: Connection refused (error 111)
I20260924 10:34:58.283565  7359 rpc-test.cc:394] Status: Network error: Client connection negotiation failed: client connection to 0.0.0.0:0: connect: Connection refused (error 111)
[       OK ] Parameters/TestRpc.TestCallToBadServer/SSL_UnixSocket (45 ms)
[ RUN      ] Parameters/TestRpc.TestWrongService/SSL_UnixSocket
I20260924 10:34:58.299479  7455 acceptor_pool.cc:254] collecting diagnostics on the listening RPC socket unix:/tmp/dist-test-taskI6h4BE/test-tmp/rpc-test-fc793574dc4144e7a23cbf9e0bd4a6ff.sock every 8 connection(s)
I20260924 10:34:58.299520  7456 acceptor_pool.cc:254] collecting diagnostics on the listening RPC socket unix:/tmp/dist-test-taskI6h4BE/test-tmp/rpc-test-fc793574dc4144e7a23cbf9e0bd4a6ff.sock every 8 connection(s)
I20260924 10:34:58.309533  7452 messenger.cc:345] service WrongServiceName not registered on TestServer
[       OK ] Parameters/TestRpc.TestWrongService/SSL_UnixSocket (27 ms)
[ RUN      ] Parameters/TestRpc.TestConnectionKeepalive/SSL_UnixSocket
I20260924 10:34:58.331091  7478 acceptor_pool.cc:254] collecting diagnostics on the listening RPC socket unix:/tmp/dist-test-taskI6h4BE/test-tmp/rpc-test-0194e6efaec94e46bfc4b8025024b14b.sock every 8 connection(s)
I20260924 10:34:58.331146  7479 acceptor_pool.cc:254] collecting diagnostics on the listening RPC socket unix:/tmp/dist-test-taskI6h4BE/test-tmp/rpc-test-0194e6efaec94e46bfc4b8025024b14b.sock every 8 connection(s)
I20260924 10:34:58.331424  7359 rpc-test.cc:488] Connecting to unix:/tmp/dist-test-taskI6h4BE/test-tmp/rpc-test-0194e6efaec94e46bfc4b8025024b14b.sock
W20260924 10:34:58.814009  7491 connection.cc:196] Error closing socket: Network error: TlsSocket::Close: Broken pipe
[       OK ] Parameters/TestRpc.TestConnectionKeepalive/SSL_UnixSocket (1053 ms)
[ RUN      ] Parameters/TestRpc.TestClientConnectionMetrics/SSL_UnixSocket
I20260924 10:34:59.376588  7503 acceptor_pool.cc:254] collecting diagnostics on the listening RPC socket unix:/tmp/dist-test-taskI6h4BE/test-tmp/rpc-test-d49ba63110904c8193a9c5d1839404e0.sock every 8 connection(s)
I20260924 10:34:59.376641  7504 acceptor_pool.cc:254] collecting diagnostics on the listening RPC socket unix:/tmp/dist-test-taskI6h4BE/test-tmp/rpc-test-d49ba63110904c8193a9c5d1839404e0.sock every 8 connection(s)
I20260924 10:34:59.376854  7359 rpc-test.cc:569] Connecting to unix:/tmp/dist-test-taskI6h4BE/test-tmp/rpc-test-d49ba63110904c8193a9c5d1839404e0.sock
W20260924 10:35:09.300817  7500 connection.cc:196] Error closing socket: Network error: TlsSocket::Close: Broken pipe
[       OK ] Parameters/TestRpc.TestClientConnectionMetrics/SSL_UnixSocket (9936 ms)
[ RUN      ] Parameters/TestRpc.TestCredentialsPolicy/SSL_UnixSocket
I20260924 10:35:09.313536  7527 acceptor_pool.cc:254] collecting diagnostics on the listening RPC socket unix:/tmp/dist-test-taskI6h4BE/test-tmp/rpc-test-a1f9578a8c4d43dbb8270fd51a9e4021.sock every 8 connection(s)
I20260924 10:35:09.313570  7526 acceptor_pool.cc:254] collecting diagnostics on the listening RPC socket unix:/tmp/dist-test-taskI6h4BE/test-tmp/rpc-test-a1f9578a8c4d43dbb8270fd51a9e4021.sock every 8 connection(s)
I20260924 10:35:09.313866  7359 rpc-test.cc:700] Connecting to unix:/tmp/dist-test-taskI6h4BE/test-tmp/rpc-test-a1f9578a8c4d43dbb8270fd51a9e4021.sock
W20260924 10:35:09.335103  7525 connection.cc:196] Error closing socket: Network error: TlsSocket::Close: Broken pipe
W20260924 10:35:09.339360  7525 connection.cc:196] Error closing socket: Network error: TlsSocket::Close: Broken pipe
[       OK ] Parameters/TestRpc.TestCredentialsPolicy/SSL_UnixSocket (37 ms)
[ RUN      ] Parameters/TestRpc.TestCallLongerThanKeepalive/SSL_UnixSocket
I20260924 10:35:09.352515  7551 acceptor_pool.cc:254] collecting diagnostics on the listening RPC socket unix:/tmp/dist-test-taskI6h4BE/test-tmp/rpc-test-c3c2421516394bfa991fbdf50e08f82c.sock every 8 connection(s)
I20260924 10:35:09.352566  7552 acceptor_pool.cc:254] collecting diagnostics on the listening RPC socket unix:/tmp/dist-test-taskI6h4BE/test-tmp/rpc-test-c3c2421516394bfa991fbdf50e08f82c.sock every 8 connection(s)
I20260924 10:35:09.364346  7555 rpc-test-base.h:222] got call: sleep_micros: 3000000 deferred: true
I20260924 10:35:12.365115  7555 rpcz_store.cc:275] Call kudu.rpc.GenericCalculatorService.Sleep from unix:<unnamed> (request call id 0) took 3000 ms. Trace:
I20260924 10:35:12.365226  7555 rpcz_store.cc:276] 0924 10:35:09.364286 (+     0us) service_pool.cc:170] Inserting onto call queue
0924 10:35:09.364331 (+    45us) service_pool.cc:227] Handling call
0924 10:35:12.365095 (+3000764us) inbound_call.cc:173] Queueing success response
Metrics: {}
W20260924 10:35:12.366868  7548 connection.cc:196] Error closing socket: Network error: TlsSocket::Close: Broken pipe
[       OK ] Parameters/TestRpc.TestCallLongerThanKeepalive/SSL_UnixSocket (3027 ms)
[ RUN      ] Parameters/TestRpc.TestRpcSidecar/SSL_UnixSocket
I20260924 10:35:12.392297  7576 acceptor_pool.cc:254] collecting diagnostics on the listening RPC socket unix:/tmp/dist-test-taskI6h4BE/test-tmp/rpc-test-2ddece9319da428e86ed0ceef8d7065d.sock every 8 connection(s)
I20260924 10:35:12.392356  7577 acceptor_pool.cc:254] collecting diagnostics on the listening RPC socket unix:/tmp/dist-test-taskI6h4BE/test-tmp/rpc-test-2ddece9319da428e86ed0ceef8d7065d.sock every 8 connection(s)
W20260924 10:35:12.435529  7573 connection.cc:196] Error closing socket: Network error: TlsSocket::Close: Broken pipe
[       OK ] Parameters/TestRpc.TestRpcSidecar/SSL_UnixSocket (68 ms)
[ RUN      ] Parameters/TestRpc.TestRpcSidecarLimits/SSL_UnixSocket
I20260924 10:35:14.121723  7601 acceptor_pool.cc:254] collecting diagnostics on the listening RPC socket unix:/tmp/dist-test-taskI6h4BE/test-tmp/rpc-test-9f61ab52b8b24206a68fa977f98a4438.sock every 8 connection(s)
I20260924 10:35:14.121767  7602 acceptor_pool.cc:254] collecting diagnostics on the listening RPC socket unix:/tmp/dist-test-taskI6h4BE/test-tmp/rpc-test-9f61ab52b8b24206a68fa977f98a4438.sock every 8 connection(s)
W20260924 10:35:14.128589  7359 serialization.cc:72] Serialized kudu.rpc_test.PushStringsRequestPB (2147483654 bytes) is larger than the maximum configured RPC message size (52428800 bytes). Sending anyway, but peer may reject the data.
W20260924 10:35:14.132278  7598 connection.cc:535] server connection from unix:<unnamed> recv error: Network error: RPC frame had a length of 2147483714, but we only support messages up to 52428800 bytes long.
W20260924 10:35:14.132349  7598 connection.cc:158] shutting down server connection from unix:<unnamed> with pending inbound data: 4/2147483714 bytes received; last active 0 ns ago: status Network error: RPC frame had a length of 2147483714, but we only support messages up to 52428800 bytes long.
W20260924 10:35:14.132517  7614 connection.cc:698] client connection to unix:/tmp/dist-test-taskI6h4BE/test-tmp/rpc-test-9f61ab52b8b24206a68fa977f98a4438.sock send error: Network error: failed to write to TLS socket: Broken pipe
W20260924 10:35:14.132682  7614 connection.cc:196] Error closing socket: Network error: TlsSocket::Close: Success
I20260924 10:35:14.143944  7626 acceptor_pool.cc:254] collecting diagnostics on the listening RPC socket unix:/tmp/dist-test-taskI6h4BE/test-tmp/rpc-test-9f61ab52b8b24206a68fa977f98a4438.sock every 8 connection(s)
I20260924 10:35:14.143971  7627 acceptor_pool.cc:254] collecting diagnostics on the listening RPC socket unix:/tmp/dist-test-taskI6h4BE/test-tmp/rpc-test-9f61ab52b8b24206a68fa977f98a4438.sock every 8 connection(s)
W20260924 10:35:18.918576  7623 connection.cc:577] server connection from unix:<unnamed>: received bad data: 'Corruption: Invalid packet: message had a length of 2147483710, but we only support messages up to 2147483647 bytes
'
W20260924 10:35:18.918982  7639 connection.cc:196] Error closing socket: Network error: TlsSocket::Close: Broken pipe
[       OK ] Parameters/TestRpc.TestRpcSidecarLimits/SSL_UnixSocket (6484 ms)
[ RUN      ] Parameters/TestRpc.TestCallTimeoutDoesntAffectNegotiation/SSL_UnixSocket
I20260924 10:35:18.960803  7651 acceptor_pool.cc:254] collecting diagnostics on the listening RPC socket unix:/tmp/dist-test-taskI6h4BE/test-tmp/rpc-test-18db290bc2e74de49936b4e1fee47320.sock every 8 connection(s)
I20260924 10:35:18.960839  7652 acceptor_pool.cc:254] collecting diagnostics on the listening RPC socket unix:/tmp/dist-test-taskI6h4BE/test-tmp/rpc-test-18db290bc2e74de49936b4e1fee47320.sock every 8 connection(s)
W20260924 10:35:18.970788  7647 negotiation.cc:266] Injecting 500ms delay in negotiation
I20260924 10:35:19.021179  7359 rpc-test-base.h:595] status: Timed out: connection negotiation to unix:/tmp/dist-test-taskI6h4BE/test-tmp/rpc-test-18db290bc2e74de49936b4e1fee47320.sock for RPC Sleep timed out after 0.050s (ON_OUTBOUND_QUEUE), seconds elapsed: 0.0507902
[       OK ] Parameters/TestRpc.TestCallTimeoutDoesntAffectNegotiation/SSL_UnixSocket (561 ms)
[ RUN      ] Parameters/TestRpc.TestRpcHandlerLatencyMetric/SSL_UnixSocket
I20260924 10:35:19.495000  7676 acceptor_pool.cc:254] collecting diagnostics on the listening RPC socket unix:/tmp/dist-test-taskI6h4BE/test-tmp/rpc-test-d627b5cf39a84ca5bf6e8f5167c019f7.sock every 8 connection(s)
I20260924 10:35:19.495105  7677 acceptor_pool.cc:254] collecting diagnostics on the listening RPC socket unix:/tmp/dist-test-taskI6h4BE/test-tmp/rpc-test-d627b5cf39a84ca5bf6e8f5167c019f7.sock every 8 connection(s)
I20260924 10:35:19.530293  7359 rpc-test.cc:1236] Sleep() min lat: 20359
I20260924 10:35:19.530360  7359 rpc-test.cc:1237] Sleep() mean lat: 20359
I20260924 10:35:19.530388  7359 rpc-test.cc:1238] Sleep() max lat: 20359
I20260924 10:35:19.530401  7359 rpc-test.cc:1239] Sleep() #calls: 1
W20260924 10:35:19.531013  7673 connection.cc:196] Error closing socket: Network error: TlsSocket::Close: Broken pipe
[       OK ] Parameters/TestRpc.TestRpcHandlerLatencyMetric/SSL_UnixSocket (49 ms)
[ RUN      ] Parameters/TestRpc.TimedOutOnResponseMetricServiceQueue/SSL_UnixSocket
I20260924 10:35:19.538480  7703 acceptor_pool.cc:254] collecting diagnostics on the listening RPC socket unix:/tmp/dist-test-taskI6h4BE/test-tmp/rpc-test-b1df4873079e4c058495cd3bc3712bad.sock every 8 connection(s)
I20260924 10:35:19.538520  7702 acceptor_pool.cc:254] collecting diagnostics on the listening RPC socket unix:/tmp/dist-test-taskI6h4BE/test-tmp/rpc-test-b1df4873079e4c058495cd3bc3712bad.sock every 8 connection(s)
W20260924 10:35:19.596010  7704 rpcz_store.cc:267] Call kudu.rpc_test.CalculatorService.Sleep from unix:<unnamed> (request call id 2) took 20 ms (client timeout 20 ms). Trace:
W20260924 10:35:19.596089  7704 rpcz_store.cc:269] 0924 10:35:19.575760 (+     0us) service_pool.cc:170] Inserting onto call queue
0924 10:35:19.595972 (+ 20212us) service_pool.cc:214] Skipping call since client already timed out
0924 10:35:19.595997 (+    25us) inbound_call.cc:173] Queueing failure response
Metrics: {}
[       OK ] Parameters/TestRpc.TimedOutOnResponseMetricServiceQueue/SSL_UnixSocket (65 ms)
[ RUN      ] Parameters/TestRpc.RpcPendingConnectionsMetric/SSL_UnixSocket
I20260924 10:35:19.600215  7725 acceptor_pool.cc:254] collecting diagnostics on the listening RPC socket 0.0.0.0:35089 every 8 connection(s)
I20260924 10:35:19.600296  7726 acceptor_pool.cc:254] collecting diagnostics on the listening RPC socket 0.0.0.0:35089 every 8 connection(s)
W20260924 10:35:19.601279  7721 negotiation.cc:337] Failed RPC negotiation. Trace:
0924 10:35:19.600937 (+     0us) reactor.cc:625] Submitting negotiation task for server connection from 127.0.0.1:41466 (local address 127.0.0.1:35089)
0924 10:35:19.601023 (+    86us) server_negotiation.cc:206] Beginning negotiation
0924 10:35:19.601026 (+     3us) server_negotiation.cc:399] Waiting for connection header
0924 10:35:19.601100 (+    74us) negotiation.cc:327] Negotiation complete: Network error: Server connection negotiation failed: server connection from 127.0.0.1:41466: BlockingRecv error: recv got EOF from 127.0.0.1:41466 (error 108)
Metrics: {"server-negotiator.queue_time_us":28}
[       OK ] Parameters/TestRpc.RpcPendingConnectionsMetric/SSL_UnixSocket (14 ms)
[ RUN      ] Parameters/TestRpc.TestRpcContextClientDeadline/SSL_UnixSocket
I20260924 10:35:19.637902  7741 acceptor_pool.cc:254] collecting diagnostics on the listening RPC socket unix:/tmp/dist-test-taskI6h4BE/test-tmp/rpc-test-f7bece0c2a384970a7cf1cc734247fcb.sock every 8 connection(s)
I20260924 10:35:19.637929  7742 acceptor_pool.cc:254] collecting diagnostics on the listening RPC socket unix:/tmp/dist-test-taskI6h4BE/test-tmp/rpc-test-f7bece0c2a384970a7cf1cc734247fcb.sock every 8 connection(s)
W20260924 10:35:19.675239  7738 connection.cc:196] Error closing socket: Network error: TlsSocket::Close: Broken pipe
[       OK ] Parameters/TestRpc.TestRpcContextClientDeadline/SSL_UnixSocket (64 ms)
[ RUN      ] Parameters/TestRpc.TestApplicationFeatureFlagUnsupportedServer/SSL_UnixSocket
I20260924 10:35:19.691413  7766 acceptor_pool.cc:254] collecting diagnostics on the listening RPC socket unix:/tmp/dist-test-taskI6h4BE/test-tmp/rpc-test-6d45e9b1b0584ed482bf7512882deafa.sock every 8 connection(s)
I20260924 10:35:19.691450  7767 acceptor_pool.cc:254] collecting diagnostics on the listening RPC socket unix:/tmp/dist-test-taskI6h4BE/test-tmp/rpc-test-6d45e9b1b0584ed482bf7512882deafa.sock every 8 connection(s)
[       OK ] Parameters/TestRpc.TestApplicationFeatureFlagUnsupportedServer/SSL_UnixSocket (30 ms)
[ RUN      ] Parameters/TestRpc.TestCancellationAsync/SSL_UnixSocket
I20260924 10:35:19.736533  7792 acceptor_pool.cc:254] collecting diagnostics on the listening RPC socket unix:/tmp/dist-test-taskI6h4BE/test-tmp/rpc-test-cf7e3b8f3f08402298341d100fcea7e3.sock every 8 connection(s)
I20260924 10:35:19.736651  7791 acceptor_pool.cc:254] collecting diagnostics on the listening RPC socket unix:/tmp/dist-test-taskI6h4BE/test-tmp/rpc-test-cf7e3b8f3f08402298341d100fcea7e3.sock every 8 connection(s)
I20260924 10:35:19.736773  7359 rpc-test.cc:1716] Connecting to unix:/tmp/dist-test-taskI6h4BE/test-tmp/rpc-test-cf7e3b8f3f08402298341d100fcea7e3.sock
I20260924 10:35:19.761916  7359 test_util.cc:268] Using random seed: 671574009
I20260924 10:35:19.782636  7795 rpc-test-base.h:240] got call: sleep_micros: 500 pattern: 4294967295 num_repetitions: 2097152 sidecar_idx: 0
I20260924 10:35:19.799646  7794 rpc-test-base.h:240] got call: sleep_micros: 500 pattern: 4294967295 num_repetitions: 2097152 sidecar_idx: 0
I20260924 10:35:19.815091  7795 rpc-test-base.h:240] got call: sleep_micros: 500 pattern: 4294967295 num_repetitions: 2097152 sidecar_idx: 0
I20260924 10:35:19.830183  7794 rpc-test-base.h:240] got call: sleep_micros: 500 pattern: 4294967295 num_repetitions: 2097152 sidecar_idx: 0
I20260924 10:35:19.845490  7795 rpc-test-base.h:240] got call: sleep_micros: 500 pattern: 4294967295 num_repetitions: 2097152 sidecar_idx: 0
I20260924 10:35:19.861058  7794 rpc-test-base.h:240] got call: sleep_micros: 500 pattern: 4294967295 num_repetitions: 2097152 sidecar_idx: 0
I20260924 10:35:19.876814  7795 rpc-test-base.h:240] got call: sleep_micros: 500 pattern: 4294967295 num_repetitions: 2097152 sidecar_idx: 0
W20260924 10:35:19.878508  7788 connection.cc:196] Error closing socket: Network error: TlsSocket::Close: Broken pipe
W20260924 10:35:19.885170  7788 connection.cc:441] server connection from unix:<unnamed> torn down before Call kudu.rpc.GenericCalculatorService.SleepWithSidecar from unix:<unnamed> (request call id 8) could send its response
W20260924 10:35:19.895049  7788 connection.cc:441] server connection from unix:<unnamed> torn down before Call kudu.rpc.GenericCalculatorService.SleepWithSidecar from unix:<unnamed> (request call id 9) could send its response
[       OK ] Parameters/TestRpc.TestCancellationAsync/SSL_UnixSocket (189 ms)
[ RUN      ] Parameters/TestRpc.TestPerformanceBySocketType/SSL_UnixSocket
I20260924 10:35:19.914059  7816 acceptor_pool.cc:254] collecting diagnostics on the listening RPC socket unix:/tmp/dist-test-taskI6h4BE/test-tmp/rpc-test-029a6bf823b248e5a5f45dcbd84c7581.sock every 8 connection(s)
I20260924 10:35:19.914083  7817 acceptor_pool.cc:254] collecting diagnostics on the listening RPC socket unix:/tmp/dist-test-taskI6h4BE/test-tmp/rpc-test-029a6bf823b248e5a5f45dcbd84c7581.sock every 8 connection(s)
I20260924 10:35:19.914397  7359 rpc-test.cc:1846] Connecting to unix:/tmp/dist-test-taskI6h4BE/test-tmp/rpc-test-029a6bf823b248e5a5f45dcbd84c7581.sock
I20260924 10:35:21.336783  7359 rpc-test.cc:1859] Sending 1024MB via ssl-enabled unix socket: real 1.402s	user 1.837s	sys 0.739s
I20260924 10:35:22.728169  7359 rpc-test.cc:1859] Sending 1024MB via ssl-enabled unix socket: real 1.391s	user 1.787s	sys 0.780s
I20260924 10:35:24.157985  7359 rpc-test.cc:1859] Sending 1024MB via ssl-enabled unix socket: real 1.430s	user 1.713s	sys 0.919s
I20260924 10:35:25.539775  7359 rpc-test.cc:1859] Sending 1024MB via ssl-enabled unix socket: real 1.382s	user 1.761s	sys 0.779s
I20260924 10:35:26.970971  7359 rpc-test.cc:1859] Sending 1024MB via ssl-enabled unix socket: real 1.431s	user 1.804s	sys 0.833s
[       OK ] Parameters/TestRpc.TestPerformanceBySocketType/SSL_UnixSocket (7076 ms)
[----------] 20 tests from Parameters/TestRpc (28824 ms total)

[----------] 1 test from Parameters/TestRpcSocketTxRxQueue
[ RUN      ] Parameters/TestRpcSocketTxRxQueue.AcceptorRxQueueSizeMetric/0
I20260924 10:35:26.979372  7841 acceptor_pool.cc:254] collecting diagnostics on the listening RPC socket 0.0.0.0:35885 every 1 connection(s)
I20260924 10:35:26.979427  7842 acceptor_pool.cc:254] collecting diagnostics on the listening RPC socket 0.0.0.0:35885 every 1 connection(s)
W20260924 10:35:26.980286  7837 negotiation.cc:337] Failed RPC negotiation. Trace:
0924 10:35:26.980040 (+     0us) reactor.cc:625] Submitting negotiation task for server connection from 127.0.0.1:33858 (local address 127.0.0.1:35885)
0924 10:35:26.980138 (+    98us) server_negotiation.cc:206] Beginning negotiation
0924 10:35:26.980141 (+     3us) server_negotiation.cc:399] Waiting for connection header
0924 10:35:26.980221 (+    80us) negotiation.cc:327] Negotiation complete: Network error: Server connection negotiation failed: server connection from 127.0.0.1:33858: BlockingRecv error: recv got EOF from 127.0.0.1:33858 (error 108)
Metrics: {"server-negotiator.queue_time_us":36}
[       OK ] Parameters/TestRpcSocketTxRxQueue.AcceptorRxQueueSizeMetric/0 (9 ms)
[----------] 1 test from Parameters/TestRpcSocketTxRxQueue (9 ms total)

[----------] Global test environment tear-down
[==========] 21 tests from 2 test suites ran. (28833 ms total)
[  PASSED  ] 20 tests.
[  FAILED  ] 1 test, listed below:
[  FAILED  ] Parameters/TestRpc.TestCallWithChainCertAndChainCA/SSL_UnixSocket, where GetParam() = (true, true)

 1 FAILED TEST