Diagnosed failure

Parameters/TestRpc.TestCallWithChainCertAndChainCA/SSL_TCP: /data0/somelongdirectorytoavoidrpathissues/src/kudu/src/kudu/rpc/rpc-test.cc:270: Failure
Failed
Bad status: Runtime error: could not verify certificate chain (error with cert: subject=CN = localhost, ST = sadfjas, C = AS, emailAddress = sdflkdsajf, O = lskdfjlsad, OU = sldfkja, issuer=C = AS, ST = ASDfkjdhf, L = lskdjf, O = saldfja, OU = skdjf, CN = localhost, emailAddress = sadjflkadsj): : certificate has expired
Google Test trace:
/data0/somelongdirectorytoavoidrpathissues/src/kudu/src/kudu/rpc/rpc-test.cc:267: Connecting to 0.0.0.0:40747
I20260925 16:49:47.201025  2321 test_util.cc:175] -----------------------------------------------
I20260925 16:49:47.201210  2321 test_util.cc:176] Had fatal failures, leaving test files at /tmp/dist-test-taskW090mf/test-tmp/rpc-test.5.Parameters_TestRpc.TestCallWithChainCertAndChainCA_SSL_TCP.1790354985899756-2321-0

Full log

Note: This is test shard 6 of 8.
[==========] Running 21 tests from 2 test suites.
[----------] Global test environment set-up.
[----------] 20 tests from Parameters/TestRpc
[ RUN      ] Parameters/TestRpc.TestMessengerCreateDestroy/SSL_TCP
WARNING: Logging before InitGoogleLogging() is written to STDERR
I20260925 16:49:46.003108  2321 rpc-test.cc:169] started messenger TestCreateDestroy
[       OK ] Parameters/TestRpc.TestMessengerCreateDestroy/SSL_TCP (1105 ms)
[ RUN      ] Parameters/TestRpc.TestNegotiationDeadlock/SSL_TCP
I20260925 16:49:47.090129  2343 acceptor_pool.cc:254] collecting diagnostics on the listening RPC socket 0.0.0.0:46165 every 8 connection(s)
I20260925 16:49:47.091720  2344 acceptor_pool.cc:254] collecting diagnostics on the listening RPC socket 0.0.0.0:46165 every 8 connection(s)
[       OK ] Parameters/TestRpc.TestNegotiationDeadlock/SSL_TCP (89 ms)
[ RUN      ] Parameters/TestRpc.TestCallWithChainCertAndChainCA/SSL_TCP
I20260925 16:49:47.172093  2359 acceptor_pool.cc:254] collecting diagnostics on the listening RPC socket 0.0.0.0:40747 every 8 connection(s)
I20260925 16:49:47.174319  2360 acceptor_pool.cc:254] collecting diagnostics on the listening RPC socket 0.0.0.0:40747 every 8 connection(s)
/data0/somelongdirectorytoavoidrpathissues/src/kudu/src/kudu/rpc/rpc-test.cc:270: Failure
Failed
Bad status: Runtime error: could not verify certificate chain (error with cert: subject=CN = localhost, ST = sadfjas, C = AS, emailAddress = sdflkdsajf, O = lskdfjlsad, OU = sldfkja, issuer=C = AS, ST = ASDfkjdhf, L = lskdjf, O = saldfja, OU = skdjf, CN = localhost, emailAddress = sadjflkadsj): : certificate has expired
Google Test trace:
/data0/somelongdirectorytoavoidrpathissues/src/kudu/src/kudu/rpc/rpc-test.cc:267: Connecting to 0.0.0.0:40747
I20260925 16:49:47.201025  2321 test_util.cc:175] -----------------------------------------------
I20260925 16:49:47.201210  2321 test_util.cc:176] Had fatal failures, leaving test files at /tmp/dist-test-taskW090mf/test-tmp/rpc-test.5.Parameters_TestRpc.TestCallWithChainCertAndChainCA_SSL_TCP.1790354985899756-2321-0
[  FAILED  ] Parameters/TestRpc.TestCallWithChainCertAndChainCA/SSL_TCP, where GetParam() = (true, false) (54 ms)
[ RUN      ] Parameters/TestRpc.TestCallWithPasswordProtectedKey/SSL_TCP
I20260925 16:49:47.225441  2384 acceptor_pool.cc:254] collecting diagnostics on the listening RPC socket 0.0.0.0:44851 every 8 connection(s)
I20260925 16:49:47.226133  2385 acceptor_pool.cc:254] collecting diagnostics on the listening RPC socket 0.0.0.0:44851 every 8 connection(s)
[       OK ] Parameters/TestRpc.TestCallWithPasswordProtectedKey/SSL_TCP (71 ms)
[ RUN      ] Parameters/TestRpc.TestCallToBadServer/SSL_TCP
I20260925 16:49:47.287410  2321 rpc-test.cc:394] Status: Network error: Client connection negotiation failed: client connection to 0.0.0.0:0: connect: Connection refused (error 111)
I20260925 16:49:47.288544  2321 rpc-test.cc:394] Status: Network error: Client connection negotiation failed: client connection to 0.0.0.0:0: connect: Connection refused (error 111)
I20260925 16:49:47.289796  2321 rpc-test.cc:394] Status: Network error: Client connection negotiation failed: client connection to 0.0.0.0:0: connect: Connection refused (error 111)
I20260925 16:49:47.290982  2321 rpc-test.cc:394] Status: Network error: Client connection negotiation failed: client connection to 0.0.0.0:0: connect: Connection refused (error 111)
I20260925 16:49:47.292104  2321 rpc-test.cc:394] Status: Network error: Client connection negotiation failed: client connection to 0.0.0.0:0: connect: Connection refused (error 111)
[       OK ] Parameters/TestRpc.TestCallToBadServer/SSL_TCP (22 ms)
[ RUN      ] Parameters/TestRpc.TestWrongService/SSL_TCP
I20260925 16:49:47.319597  2419 acceptor_pool.cc:254] collecting diagnostics on the listening RPC socket 0.0.0.0:41967 every 8 connection(s)
I20260925 16:49:47.320341  2420 acceptor_pool.cc:254] collecting diagnostics on the listening RPC socket 0.0.0.0:41967 every 8 connection(s)
I20260925 16:49:47.355875  2418 messenger.cc:345] service WrongServiceName not registered on TestServer
[       OK ] Parameters/TestRpc.TestWrongService/SSL_TCP (69 ms)
[ RUN      ] Parameters/TestRpc.TestConnectionKeepalive/SSL_TCP
I20260925 16:49:47.389077  2442 acceptor_pool.cc:254] collecting diagnostics on the listening RPC socket 0.0.0.0:41229 every 8 connection(s)
I20260925 16:49:47.389798  2443 acceptor_pool.cc:254] collecting diagnostics on the listening RPC socket 0.0.0.0:41229 every 8 connection(s)
I20260925 16:49:47.392912  2321 rpc-test.cc:488] Connecting to 0.0.0.0:41229
[       OK ] Parameters/TestRpc.TestConnectionKeepalive/SSL_TCP (1078 ms)
[ RUN      ] Parameters/TestRpc.TestClientConnectionMetrics/SSL_TCP
I20260925 16:49:48.481237  2467 acceptor_pool.cc:254] collecting diagnostics on the listening RPC socket 0.0.0.0:39965 every 8 connection(s)
I20260925 16:49:48.482028  2468 acceptor_pool.cc:254] collecting diagnostics on the listening RPC socket 0.0.0.0:39965 every 8 connection(s)
I20260925 16:49:48.485162  2321 rpc-test.cc:569] Connecting to 0.0.0.0:39965
[       OK ] Parameters/TestRpc.TestClientConnectionMetrics/SSL_TCP (114115 ms)
[ RUN      ] Parameters/TestRpc.TestCredentialsPolicy/SSL_TCP
I20260925 16:51:42.590304  2501 acceptor_pool.cc:254] collecting diagnostics on the listening RPC socket 0.0.0.0:42159 every 8 connection(s)
I20260925 16:51:42.591044  2502 acceptor_pool.cc:254] collecting diagnostics on the listening RPC socket 0.0.0.0:42159 every 8 connection(s)
I20260925 16:51:42.594094  2321 rpc-test.cc:700] Connecting to 0.0.0.0:42159
[       OK ] Parameters/TestRpc.TestCredentialsPolicy/SSL_TCP (103 ms)
[ RUN      ] Parameters/TestRpc.TestCallLongerThanKeepalive/SSL_TCP
I20260925 16:51:42.695716  2526 acceptor_pool.cc:254] collecting diagnostics on the listening RPC socket 0.0.0.0:33063 every 8 connection(s)
I20260925 16:51:42.696419  2527 acceptor_pool.cc:254] collecting diagnostics on the listening RPC socket 0.0.0.0:33063 every 8 connection(s)
I20260925 16:51:42.737983  2530 rpc-test-base.h:222] got call: sleep_micros: 3000000 deferred: true
I20260925 16:51:45.742210  2530 rpcz_store.cc:275] Call kudu.rpc.GenericCalculatorService.Sleep from 127.0.0.1:51382 (request call id 0) took 3004 ms. Trace:
I20260925 16:51:45.742646  2530 rpcz_store.cc:276] 0925 16:51:42.737733 (+     0us) service_pool.cc:170] Inserting onto call queue
0925 16:51:42.737839 (+   106us) service_pool.cc:227] Handling call
0925 16:51:45.742150 (+3004311us) inbound_call.cc:173] Queueing success response
Metrics: {}
[       OK ] Parameters/TestRpc.TestCallLongerThanKeepalive/SSL_TCP (3089 ms)
[ RUN      ] Parameters/TestRpc.TestRpcSidecar/SSL_TCP
I20260925 16:51:45.779404  2551 acceptor_pool.cc:254] collecting diagnostics on the listening RPC socket 0.0.0.0:35241 every 8 connection(s)
I20260925 16:51:45.780233  2552 acceptor_pool.cc:254] collecting diagnostics on the listening RPC socket 0.0.0.0:35241 every 8 connection(s)
[       OK ] Parameters/TestRpc.TestRpcSidecar/SSL_TCP (569 ms)
[ RUN      ] Parameters/TestRpc.TestRpcSidecarLimits/SSL_TCP
I20260925 16:52:02.574175  2578 acceptor_pool.cc:254] collecting diagnostics on the listening RPC socket 0.0.0.0:40013 every 8 connection(s)
I20260925 16:52:02.574965  2579 acceptor_pool.cc:254] collecting diagnostics on the listening RPC socket 0.0.0.0:40013 every 8 connection(s)
W20260925 16:52:02.613606  2321 serialization.cc:72] Serialized kudu.rpc_test.PushStringsRequestPB (2147483654 bytes) is larger than the maximum configured RPC message size (52428800 bytes). Sending anyway, but peer may reject the data.
W20260925 16:52:02.623799  2575 connection.cc:535] server connection from 127.0.0.1:45082 recv error: Network error: RPC frame had a length of 2147483714, but we only support messages up to 52428800 bytes long.
W20260925 16:52:02.624138  2575 connection.cc:158] shutting down server connection from 127.0.0.1:45082 with pending inbound data: 4/2147483714 bytes received; last active 0 ns ago: status Network error: RPC frame had a length of 2147483714, but we only support messages up to 52428800 bytes long.
W20260925 16:52:02.624856  2591 connection.cc:698] client connection to 0.0.0.0:40013 send error: Network error: failed to write to TLS socket: Connection reset by peer
W20260925 16:52:02.625389  2591 connection.cc:196] Error closing socket: Network error: TlsSocket::Close: Success
[       OK ] Parameters/TestRpc.TestRpcSidecarLimits/SSL_TCP (17006 ms)
[ RUN      ] Parameters/TestRpc.TestCallTimeoutDoesntAffectNegotiation/SSL_TCP
I20260925 16:52:03.354183  2603 acceptor_pool.cc:254] collecting diagnostics on the listening RPC socket 0.0.0.0:43417 every 8 connection(s)
I20260925 16:52:03.354934  2604 acceptor_pool.cc:254] collecting diagnostics on the listening RPC socket 0.0.0.0:43417 every 8 connection(s)
W20260925 16:52:03.391744  2599 negotiation.cc:266] Injecting 500ms delay in negotiation
I20260925 16:52:03.441283  2321 rpc-test-base.h:595] status: Timed out: connection negotiation to 0.0.0.0:43417 for RPC Sleep timed out after 0.050s (ON_OUTBOUND_QUEUE), seconds elapsed: 0.0505621
[       OK ] Parameters/TestRpc.TestCallTimeoutDoesntAffectNegotiation/SSL_TCP (579 ms)
[ RUN      ] Parameters/TestRpc.TestRpcHandlerLatencyMetric/SSL_TCP
I20260925 16:52:03.935070  2628 acceptor_pool.cc:254] collecting diagnostics on the listening RPC socket 0.0.0.0:41007 every 8 connection(s)
I20260925 16:52:03.935760  2629 acceptor_pool.cc:254] collecting diagnostics on the listening RPC socket 0.0.0.0:41007 every 8 connection(s)
I20260925 16:52:03.996546  2321 rpc-test.cc:1236] Sleep() min lat: 21644
I20260925 16:52:03.996740  2321 rpc-test.cc:1237] Sleep() mean lat: 21644
I20260925 16:52:03.996868  2321 rpc-test.cc:1238] Sleep() max lat: 21644
I20260925 16:52:03.996985  2321 rpc-test.cc:1239] Sleep() #calls: 1
[       OK ] Parameters/TestRpc.TestRpcHandlerLatencyMetric/SSL_TCP (96 ms)
[ RUN      ] Parameters/TestRpc.TimedOutOnResponseMetricServiceQueue/SSL_TCP
I20260925 16:52:04.022840  2654 acceptor_pool.cc:254] collecting diagnostics on the listening RPC socket 0.0.0.0:44759 every 8 connection(s)
I20260925 16:52:04.023777  2655 acceptor_pool.cc:254] collecting diagnostics on the listening RPC socket 0.0.0.0:44759 every 8 connection(s)
W20260925 16:52:04.100355  2656 rpcz_store.cc:267] Call kudu.rpc_test.CalculatorService.Sleep from 127.0.0.1:56808 (request call id 2) took 20 ms (client timeout 20 ms). Trace:
W20260925 16:52:04.100782  2656 rpcz_store.cc:269] 0925 16:52:04.079909 (+     0us) service_pool.cc:170] Inserting onto call queue
0925 16:52:04.100201 (+ 20292us) service_pool.cc:214] Skipping call since client already timed out
0925 16:52:04.100293 (+    92us) inbound_call.cc:173] Queueing failure response
Metrics: {}
[       OK ] Parameters/TestRpc.TimedOutOnResponseMetricServiceQueue/SSL_TCP (102 ms)
[ RUN      ] Parameters/TestRpc.RpcPendingConnectionsMetric/SSL_TCP
I20260925 16:52:04.117597  2677 acceptor_pool.cc:254] collecting diagnostics on the listening RPC socket 0.0.0.0:44413 every 8 connection(s)
I20260925 16:52:04.118356  2678 acceptor_pool.cc:254] collecting diagnostics on the listening RPC socket 0.0.0.0:44413 every 8 connection(s)
W20260925 16:52:04.132824  2673 negotiation.cc:337] Failed RPC negotiation. Trace:
0925 16:52:04.131151 (+     0us) reactor.cc:625] Submitting negotiation task for server connection from 127.0.0.1:40778 (local address 127.0.0.1:44413)
0925 16:52:04.131879 (+   728us) server_negotiation.cc:206] Beginning negotiation
0925 16:52:04.131914 (+    35us) server_negotiation.cc:399] Waiting for connection header
0925 16:52:04.132267 (+   353us) negotiation.cc:327] Negotiation complete: Network error: Server connection negotiation failed: server connection from 127.0.0.1:40778: BlockingRecv error: recv got EOF from 127.0.0.1:40778 (error 108)
Metrics: {"server-negotiator.queue_time_us":130}
[       OK ] Parameters/TestRpc.RpcPendingConnectionsMetric/SSL_TCP (37 ms)
[ RUN      ] Parameters/TestRpc.TestRpcContextClientDeadline/SSL_TCP
I20260925 16:52:04.167958  2693 acceptor_pool.cc:254] collecting diagnostics on the listening RPC socket 0.0.0.0:35789 every 8 connection(s)
I20260925 16:52:04.168699  2694 acceptor_pool.cc:254] collecting diagnostics on the listening RPC socket 0.0.0.0:35789 every 8 connection(s)
[       OK ] Parameters/TestRpc.TestRpcContextClientDeadline/SSL_TCP (93 ms)
[ RUN      ] Parameters/TestRpc.TestApplicationFeatureFlagUnsupportedServer/SSL_TCP
I20260925 16:52:04.264264  2718 acceptor_pool.cc:254] collecting diagnostics on the listening RPC socket 0.0.0.0:42301 every 8 connection(s)
I20260925 16:52:04.265015  2719 acceptor_pool.cc:254] collecting diagnostics on the listening RPC socket 0.0.0.0:42301 every 8 connection(s)
[       OK ] Parameters/TestRpc.TestApplicationFeatureFlagUnsupportedServer/SSL_TCP (61 ms)
[ RUN      ] Parameters/TestRpc.TestCancellationAsync/SSL_TCP
I20260925 16:52:04.321024  2743 acceptor_pool.cc:254] collecting diagnostics on the listening RPC socket 0.0.0.0:42313 every 8 connection(s)
I20260925 16:52:04.321753  2744 acceptor_pool.cc:254] collecting diagnostics on the listening RPC socket 0.0.0.0:42313 every 8 connection(s)
I20260925 16:52:04.324806  2321 rpc-test.cc:1716] Connecting to 0.0.0.0:42313
I20260925 16:52:04.337174  2321 test_util.cc:268] Using random seed: -1993000449
I20260925 16:52:04.566684  2747 rpc-test-base.h:240] got call: sleep_micros: 500 pattern: 4294967295 num_repetitions: 2097152 sidecar_idx: 0
I20260925 16:52:04.752136  2746 rpc-test-base.h:240] got call: sleep_micros: 500 pattern: 4294967295 num_repetitions: 2097152 sidecar_idx: 0
I20260925 16:52:04.939779  2746 rpc-test-base.h:240] got call: sleep_micros: 500 pattern: 4294967295 num_repetitions: 2097152 sidecar_idx: 0
I20260925 16:52:05.120558  2746 rpc-test-base.h:240] got call: sleep_micros: 500 pattern: 4294967295 num_repetitions: 2097152 sidecar_idx: 0
I20260925 16:52:05.296365  2746 rpc-test-base.h:240] got call: sleep_micros: 500 pattern: 4294967295 num_repetitions: 2097152 sidecar_idx: 0
I20260925 16:52:05.476452  2746 rpc-test-base.h:240] got call: sleep_micros: 500 pattern: 4294967295 num_repetitions: 2097152 sidecar_idx: 0
I20260925 16:52:05.651348  2746 rpc-test-base.h:240] got call: sleep_micros: 500 pattern: 4294967295 num_repetitions: 2097152 sidecar_idx: 0
I20260925 16:52:05.838235  2746 rpc-test-base.h:240] got call: sleep_micros: 500 pattern: 4294967295 num_repetitions: 2097152 sidecar_idx: 0
W20260925 16:52:05.996622  2740 connection.cc:196] Error closing socket: Network error: TlsSocket::Close: Broken pipe
W20260925 16:52:05.997018  2740 connection.cc:441] server connection from 127.0.0.1:51318 torn down before Call kudu.rpc.GenericCalculatorService.SleepWithSidecar from 127.0.0.1:51318 (request call id 8) could send its response
[       OK ] Parameters/TestRpc.TestCancellationAsync/SSL_TCP (1704 ms)
[ RUN      ] Parameters/TestRpc.TestPerformanceBySocketType/SSL_TCP
I20260925 16:52:06.107686  2768 acceptor_pool.cc:254] collecting diagnostics on the listening RPC socket 0.0.0.0:41265 every 8 connection(s)
I20260925 16:52:06.108490  2769 acceptor_pool.cc:254] collecting diagnostics on the listening RPC socket 0.0.0.0:41265 every 8 connection(s)
I20260925 16:52:06.111711  2321 rpc-test.cc:1846] Connecting to 0.0.0.0:41265
I20260925 16:52:23.821941  2321 rpc-test.cc:1859] Sending 1024MB via ssl-enabled tcp socket: real 17.655s	user 14.850s	sys 10.143s
I20260925 16:52:41.428121  2321 rpc-test.cc:1859] Sending 1024MB via ssl-enabled tcp socket: real 17.606s	user 15.132s	sys 9.839s
I20260925 16:52:59.855167  2321 rpc-test.cc:1859] Sending 1024MB via ssl-enabled tcp socket: real 18.427s	user 15.861s	sys 10.375s
I20260925 16:53:18.302172  2321 rpc-test.cc:1859] Sending 1024MB via ssl-enabled tcp socket: real 18.446s	user 15.994s	sys 10.248s
I20260925 16:53:36.769304  2321 rpc-test.cc:1859] Sending 1024MB via ssl-enabled tcp socket: real 18.467s	user 15.419s	sys 10.749s
[       OK ] Parameters/TestRpc.TestPerformanceBySocketType/SSL_TCP (90781 ms)
[----------] 20 tests from Parameters/TestRpc (230837 ms total)

[----------] 1 test from Parameters/TestRpcSocketTxRxQueue
[ RUN      ] Parameters/TestRpcSocketTxRxQueue.OverCapacity/0
W20260925 16:53:37.226253  2813 negotiation.cc:337] Failed RPC negotiation. Trace:
0925 16:53:36.815002 (+     0us) reactor.cc:625] Submitting negotiation task for client connection to 0.0.0.0:42791 (local address 127.0.0.1:35554)
0925 16:53:36.815517 (+   515us) negotiation.cc:107] Waiting for socket to connect
0925 16:53:36.815544 (+    27us) client_negotiation.cc:174] Beginning negotiation
0925 16:53:36.815717 (+   173us) client_negotiation.cc:252] Sending NEGOTIATE NegotiatePB request
0925 16:53:37.225071 (+409354us) negotiation.cc:327] Negotiation complete: Network error: Client connection negotiation failed: client connection to 0.0.0.0:42791: BlockingRecv error: recv error from unknown peer: Transport endpoint is not connected (error 107)
Metrics: {"client-negotiator.queue_time_us":133}
W20260925 16:53:37.226349  2804 negotiation.cc:337] Failed RPC negotiation. Trace:
0925 16:53:36.808047 (+     0us) reactor.cc:625] Submitting negotiation task for client connection to 0.0.0.0:42791 (local address 127.0.0.1:35548)
0925 16:53:36.808604 (+   557us) negotiation.cc:107] Waiting for socket to connect
0925 16:53:36.808632 (+    28us) client_negotiation.cc:174] Beginning negotiation
0925 16:53:36.808821 (+   189us) client_negotiation.cc:252] Sending NEGOTIATE NegotiatePB request
0925 16:53:37.225100 (+416279us) negotiation.cc:327] Negotiation complete: Network error: Client connection negotiation failed: client connection to 0.0.0.0:42791: BlockingRecv error: recv error from unknown peer: Transport endpoint is not connected (error 107)
Metrics: {"client-negotiator.queue_time_us":160}
W20260925 16:53:37.230170  2840 negotiation.cc:337] Failed RPC negotiation. Trace:
0925 16:53:36.851199 (+     0us) reactor.cc:625] Submitting negotiation task for client connection to 0.0.0.0:42791 (local address 127.0.0.1:35584)
0925 16:53:36.851798 (+   599us) negotiation.cc:107] Waiting for socket to connect
0925 16:53:36.851828 (+    30us) client_negotiation.cc:174] Beginning negotiation
0925 16:53:36.852024 (+   196us) client_negotiation.cc:252] Sending NEGOTIATE NegotiatePB request
0925 16:53:37.226704 (+374680us) negotiation.cc:327] Negotiation complete: Network error: Client connection negotiation failed: client connection to 0.0.0.0:42791: BlockingRecv error: recv error from unknown peer: Transport endpoint is not connected (error 107)
Metrics: {"client-negotiator.queue_time_us":167}
W20260925 16:53:37.231226  2831 negotiation.cc:337] Failed RPC negotiation. Trace:
0925 16:53:36.838615 (+     0us) reactor.cc:625] Submitting negotiation task for client connection to 0.0.0.0:42791 (local address 127.0.0.1:35570)
0925 16:53:36.839213 (+   598us) negotiation.cc:107] Waiting for socket to connect
0925 16:53:36.839244 (+    31us) client_negotiation.cc:174] Beginning negotiation
0925 16:53:36.839447 (+   203us) client_negotiation.cc:252] Sending NEGOTIATE NegotiatePB request
0925 16:53:37.230033 (+390586us) negotiation.cc:327] Negotiation complete: Network error: Client connection negotiation failed: client connection to 0.0.0.0:42791: BlockingRecv error: recv error from unknown peer: Transport endpoint is not connected (error 107)
Metrics: {"client-negotiator.queue_time_us":183}
W20260925 16:53:37.231495  2795 negotiation.cc:337] Failed RPC negotiation. Trace:
0925 16:53:36.801219 (+     0us) reactor.cc:625] Submitting negotiation task for client connection to 0.0.0.0:42791 (local address 127.0.0.1:35532)
0925 16:53:36.801898 (+   679us) negotiation.cc:107] Waiting for socket to connect
0925 16:53:36.801928 (+    30us) client_negotiation.cc:174] Beginning negotiation
0925 16:53:36.802298 (+   370us) client_negotiation.cc:252] Sending NEGOTIATE NegotiatePB request
0925 16:53:37.225091 (+422793us) negotiation.cc:327] Negotiation complete: Network error: Client connection negotiation failed: client connection to 0.0.0.0:42791: BlockingRecv error: recv error from unknown peer: Transport endpoint is not connected (error 107)
Metrics: {"client-negotiator.queue_time_us":141}
W20260925 16:53:37.231601  2822 negotiation.cc:337] Failed RPC negotiation. Trace:
0925 16:53:36.826527 (+     0us) reactor.cc:625] Submitting negotiation task for client connection to 0.0.0.0:42791 (local address 127.0.0.1:35562)
0925 16:53:36.827112 (+   585us) negotiation.cc:107] Waiting for socket to connect
0925 16:53:36.827148 (+    36us) client_negotiation.cc:174] Beginning negotiation
0925 16:53:36.827330 (+   182us) client_negotiation.cc:252] Sending NEGOTIATE NegotiatePB request
0925 16:53:37.225071 (+397741us) negotiation.cc:327] Negotiation complete: Network error: Client connection negotiation failed: client connection to 0.0.0.0:42791: BlockingRecv error: recv error from unknown peer: Transport endpoint is not connected (error 107)
Metrics: {"client-negotiator.queue_time_us":143}
[       OK ] Parameters/TestRpcSocketTxRxQueue.OverCapacity/0 (1221 ms)
[----------] 1 test from Parameters/TestRpcSocketTxRxQueue (1221 ms total)

[----------] Global test environment tear-down
[==========] 21 tests from 2 test suites ran. (232059 ms total)
[  PASSED  ] 20 tests.
[  FAILED  ] 1 test, listed below:
[  FAILED  ] Parameters/TestRpc.TestCallWithChainCertAndChainCA/SSL_TCP, where GetParam() = (true, false)

 1 FAILED TEST