Diagnosed failure

Parameters/TestRpc.TestCallWithChainCertAndChainCA/SSL_UnixSocket: /data0/somelongdirectorytoavoidrpathissues/src/kudu/src/kudu/rpc/rpc-test.cc:270: Failure
Failed
Bad status: Runtime error: could not verify certificate chain (error with cert: subject=CN = localhost, ST = sadfjas, C = AS, emailAddress = sdflkdsajf, O = lskdfjlsad, OU = sldfkja, issuer=C = AS, ST = ASDfkjdhf, L = lskdjf, O = saldfja, OU = skdjf, CN = localhost, emailAddress = sadjflkadsj): : certificate has expired
Google Test trace:
/data0/somelongdirectorytoavoidrpathissues/src/kudu/src/kudu/rpc/rpc-test.cc:267: Connecting to unix:/tmp/dist-test-taskKteUZ6/test-tmp/rpc-test-8ab7442bcab6494db88e7870cce72411.sock
I20260925 19:02:03.741700   383 test_util.cc:175] -----------------------------------------------
I20260925 19:02:03.741747   383 test_util.cc:176] Had fatal failures, leaving test files at /tmp/dist-test-taskKteUZ6/test-tmp/rpc-test.6.Parameters_TestRpc.TestCallWithChainCertAndChainCA_SSL_UnixSocket.1790362923675685-383-0

Full log

Note: This is test shard 7 of 8.
[==========] Running 21 tests from 2 test suites.
[----------] Global test environment set-up.
[----------] 20 tests from Parameters/TestRpc
[ RUN      ] Parameters/TestRpc.TestMessengerCreateDestroy/SSL_UnixSocket
WARNING: Logging before InitGoogleLogging() is written to STDERR
I20260925 19:02:03.706912   383 rpc-test.cc:169] started messenger TestCreateDestroy
[       OK ] Parameters/TestRpc.TestMessengerCreateDestroy/SSL_UnixSocket (29 ms)
[ RUN      ] Parameters/TestRpc.TestNegotiationDeadlock/SSL_UnixSocket
I20260925 19:02:03.718142   404 acceptor_pool.cc:254] collecting diagnostics on the listening RPC socket unix:/tmp/dist-test-taskKteUZ6/test-tmp/rpc-test-7890570e684b46049204ac6f5849f486.sock every 8 connection(s)
I20260925 19:02:03.718142   403 acceptor_pool.cc:254] collecting diagnostics on the listening RPC socket unix:/tmp/dist-test-taskKteUZ6/test-tmp/rpc-test-7890570e684b46049204ac6f5849f486.sock every 8 connection(s)
[       OK ] Parameters/TestRpc.TestNegotiationDeadlock/SSL_UnixSocket (16 ms)
[ RUN      ] Parameters/TestRpc.TestCallWithChainCertAndChainCA/SSL_UnixSocket
I20260925 19:02:03.737932   420 acceptor_pool.cc:254] collecting diagnostics on the listening RPC socket unix:/tmp/dist-test-taskKteUZ6/test-tmp/rpc-test-8ab7442bcab6494db88e7870cce72411.sock every 8 connection(s)
I20260925 19:02:03.737922   419 acceptor_pool.cc:254] collecting diagnostics on the listening RPC socket unix:/tmp/dist-test-taskKteUZ6/test-tmp/rpc-test-8ab7442bcab6494db88e7870cce72411.sock every 8 connection(s)
/data0/somelongdirectorytoavoidrpathissues/src/kudu/src/kudu/rpc/rpc-test.cc:270: Failure
Failed
Bad status: Runtime error: could not verify certificate chain (error with cert: subject=CN = localhost, ST = sadfjas, C = AS, emailAddress = sdflkdsajf, O = lskdfjlsad, OU = sldfkja, issuer=C = AS, ST = ASDfkjdhf, L = lskdjf, O = saldfja, OU = skdjf, CN = localhost, emailAddress = sadjflkadsj): : certificate has expired
Google Test trace:
/data0/somelongdirectorytoavoidrpathissues/src/kudu/src/kudu/rpc/rpc-test.cc:267: Connecting to unix:/tmp/dist-test-taskKteUZ6/test-tmp/rpc-test-8ab7442bcab6494db88e7870cce72411.sock
I20260925 19:02:03.741700   383 test_util.cc:175] -----------------------------------------------
I20260925 19:02:03.741747   383 test_util.cc:176] Had fatal failures, leaving test files at /tmp/dist-test-taskKteUZ6/test-tmp/rpc-test.6.Parameters_TestRpc.TestCallWithChainCertAndChainCA_SSL_UnixSocket.1790362923675685-383-0
[  FAILED  ] Parameters/TestRpc.TestCallWithChainCertAndChainCA/SSL_UnixSocket, where GetParam() = (true, true) (17 ms)
[ RUN      ] Parameters/TestRpc.TestCallWithPasswordProtectedKey/SSL_UnixSocket
I20260925 19:02:03.756983   444 acceptor_pool.cc:254] collecting diagnostics on the listening RPC socket unix:/tmp/dist-test-taskKteUZ6/test-tmp/rpc-test-71dbadcd85874a0e9ef35b2398f6fffc.sock every 8 connection(s)
I20260925 19:02:03.757031   445 acceptor_pool.cc:254] collecting diagnostics on the listening RPC socket unix:/tmp/dist-test-taskKteUZ6/test-tmp/rpc-test-71dbadcd85874a0e9ef35b2398f6fffc.sock every 8 connection(s)
W20260925 19:02:03.767537   441 connection.cc:196] Error closing socket: Network error: TlsSocket::Close: Broken pipe
[       OK ] Parameters/TestRpc.TestCallWithPasswordProtectedKey/SSL_UnixSocket (27 ms)
[ RUN      ] Parameters/TestRpc.TestCallToBadServer/SSL_UnixSocket
I20260925 19:02:03.774251   383 rpc-test.cc:394] Status: Network error: Client connection negotiation failed: client connection to 0.0.0.0:0: connect: Connection refused (error 111)
I20260925 19:02:03.774503   383 rpc-test.cc:394] Status: Network error: Client connection negotiation failed: client connection to 0.0.0.0:0: connect: Connection refused (error 111)
I20260925 19:02:03.774693   383 rpc-test.cc:394] Status: Network error: Client connection negotiation failed: client connection to 0.0.0.0:0: connect: Connection refused (error 111)
I20260925 19:02:03.774876   383 rpc-test.cc:394] Status: Network error: Client connection negotiation failed: client connection to 0.0.0.0:0: connect: Connection refused (error 111)
I20260925 19:02:03.775058   383 rpc-test.cc:394] Status: Network error: Client connection negotiation failed: client connection to 0.0.0.0:0: connect: Connection refused (error 111)
[       OK ] Parameters/TestRpc.TestCallToBadServer/SSL_UnixSocket (6 ms)
[ RUN      ] Parameters/TestRpc.TestWrongService/SSL_UnixSocket
I20260925 19:02:03.782743   479 acceptor_pool.cc:254] collecting diagnostics on the listening RPC socket unix:/tmp/dist-test-taskKteUZ6/test-tmp/rpc-test-46414efde325448287aecf26445ac95d.sock every 8 connection(s)
I20260925 19:02:03.782760   480 acceptor_pool.cc:254] collecting diagnostics on the listening RPC socket unix:/tmp/dist-test-taskKteUZ6/test-tmp/rpc-test-46414efde325448287aecf26445ac95d.sock every 8 connection(s)
I20260925 19:02:03.794710   476 messenger.cc:345] service WrongServiceName not registered on TestServer
[       OK ] Parameters/TestRpc.TestWrongService/SSL_UnixSocket (20 ms)
[ RUN      ] Parameters/TestRpc.TestConnectionKeepalive/SSL_UnixSocket
I20260925 19:02:03.830207   503 acceptor_pool.cc:254] collecting diagnostics on the listening RPC socket unix:/tmp/dist-test-taskKteUZ6/test-tmp/rpc-test-c80103e66d7645608599d8a079d35ae3.sock every 8 connection(s)
I20260925 19:02:03.830133   502 acceptor_pool.cc:254] collecting diagnostics on the listening RPC socket unix:/tmp/dist-test-taskKteUZ6/test-tmp/rpc-test-c80103e66d7645608599d8a079d35ae3.sock every 8 connection(s)
I20260925 19:02:03.830360   383 rpc-test.cc:488] Connecting to unix:/tmp/dist-test-taskKteUZ6/test-tmp/rpc-test-c80103e66d7645608599d8a079d35ae3.sock
W20260925 19:02:04.297892   515 connection.cc:196] Error closing socket: Network error: TlsSocket::Close: Broken pipe
[       OK ] Parameters/TestRpc.TestConnectionKeepalive/SSL_UnixSocket (1052 ms)
[ RUN      ] Parameters/TestRpc.TestClientConnectionMetrics/SSL_UnixSocket
I20260925 19:02:04.865968   527 acceptor_pool.cc:254] collecting diagnostics on the listening RPC socket unix:/tmp/dist-test-taskKteUZ6/test-tmp/rpc-test-f15bfdc451414394b1e87dbd221cec16.sock every 8 connection(s)
I20260925 19:02:04.866019   528 acceptor_pool.cc:254] collecting diagnostics on the listening RPC socket unix:/tmp/dist-test-taskKteUZ6/test-tmp/rpc-test-f15bfdc451414394b1e87dbd221cec16.sock every 8 connection(s)
I20260925 19:02:04.866217   383 rpc-test.cc:569] Connecting to unix:/tmp/dist-test-taskKteUZ6/test-tmp/rpc-test-f15bfdc451414394b1e87dbd221cec16.sock
W20260925 19:02:13.221143   524 connection.cc:196] Error closing socket: Network error: TlsSocket::Close: Broken pipe
[       OK ] Parameters/TestRpc.TestClientConnectionMetrics/SSL_UnixSocket (8373 ms)
[ RUN      ] Parameters/TestRpc.TestCredentialsPolicy/SSL_UnixSocket
I20260925 19:02:13.234283   550 acceptor_pool.cc:254] collecting diagnostics on the listening RPC socket unix:/tmp/dist-test-taskKteUZ6/test-tmp/rpc-test-f2307149618e4ddf8a29d7b32fdc58ba.sock every 8 connection(s)
I20260925 19:02:13.234349   551 acceptor_pool.cc:254] collecting diagnostics on the listening RPC socket unix:/tmp/dist-test-taskKteUZ6/test-tmp/rpc-test-f2307149618e4ddf8a29d7b32fdc58ba.sock every 8 connection(s)
I20260925 19:02:13.234493   383 rpc-test.cc:700] Connecting to unix:/tmp/dist-test-taskKteUZ6/test-tmp/rpc-test-f2307149618e4ddf8a29d7b32fdc58ba.sock
W20260925 19:02:13.263410   549 connection.cc:196] Error closing socket: Network error: TlsSocket::Close: Broken pipe
[       OK ] Parameters/TestRpc.TestCredentialsPolicy/SSL_UnixSocket (45 ms)
[ RUN      ] Parameters/TestRpc.TestCallLongerThanKeepalive/SSL_UnixSocket
I20260925 19:02:13.280514   575 acceptor_pool.cc:254] collecting diagnostics on the listening RPC socket unix:/tmp/dist-test-taskKteUZ6/test-tmp/rpc-test-e8cc2d0746b5489c855edfbf736f35ae.sock every 8 connection(s)
I20260925 19:02:13.280560   576 acceptor_pool.cc:254] collecting diagnostics on the listening RPC socket unix:/tmp/dist-test-taskKteUZ6/test-tmp/rpc-test-e8cc2d0746b5489c855edfbf736f35ae.sock every 8 connection(s)
I20260925 19:02:13.291671   579 rpc-test-base.h:222] got call: sleep_micros: 3000000 deferred: true
I20260925 19:02:16.292377   579 rpcz_store.cc:275] Call kudu.rpc.GenericCalculatorService.Sleep from unix:<unnamed> (request call id 0) took 3000 ms. Trace:
I20260925 19:02:16.292511   579 rpcz_store.cc:276] 0925 19:02:13.291635 (+     0us) service_pool.cc:170] Inserting onto call queue
0925 19:02:13.291656 (+    21us) service_pool.cc:227] Handling call
0925 19:02:16.292362 (+3000706us) inbound_call.cc:173] Queueing success response
Metrics: {}
[       OK ] Parameters/TestRpc.TestCallLongerThanKeepalive/SSL_UnixSocket (3026 ms)
[ RUN      ] Parameters/TestRpc.TestRpcSidecar/SSL_UnixSocket
I20260925 19:02:16.303946   600 acceptor_pool.cc:254] collecting diagnostics on the listening RPC socket unix:/tmp/dist-test-taskKteUZ6/test-tmp/rpc-test-6c34cc78bf424c71b3c5442e9b500695.sock every 8 connection(s)
I20260925 19:02:16.304072   601 acceptor_pool.cc:254] collecting diagnostics on the listening RPC socket unix:/tmp/dist-test-taskKteUZ6/test-tmp/rpc-test-6c34cc78bf424c71b3c5442e9b500695.sock every 8 connection(s)
W20260925 19:02:16.351001   597 connection.cc:196] Error closing socket: Network error: TlsSocket::Close: Broken pipe
[       OK ] Parameters/TestRpc.TestRpcSidecar/SSL_UnixSocket (57 ms)
[ RUN      ] Parameters/TestRpc.TestRpcSidecarLimits/SSL_UnixSocket
I20260925 19:02:18.065480   625 acceptor_pool.cc:254] collecting diagnostics on the listening RPC socket unix:/tmp/dist-test-taskKteUZ6/test-tmp/rpc-test-f036c14a3e314cc58bac43fb58d345e2.sock every 8 connection(s)
I20260925 19:02:18.065531   626 acceptor_pool.cc:254] collecting diagnostics on the listening RPC socket unix:/tmp/dist-test-taskKteUZ6/test-tmp/rpc-test-f036c14a3e314cc58bac43fb58d345e2.sock every 8 connection(s)
W20260925 19:02:18.076807   383 serialization.cc:72] Serialized kudu.rpc_test.PushStringsRequestPB (2147483654 bytes) is larger than the maximum configured RPC message size (52428800 bytes). Sending anyway, but peer may reject the data.
W20260925 19:02:18.079989   622 connection.cc:535] server connection from unix:<unnamed> recv error: Network error: RPC frame had a length of 2147483714, but we only support messages up to 52428800 bytes long.
W20260925 19:02:18.080062   622 connection.cc:158] shutting down server connection from unix:<unnamed> with pending inbound data: 4/2147483714 bytes received; last active 0 ns ago: status Network error: RPC frame had a length of 2147483714, but we only support messages up to 52428800 bytes long.
W20260925 19:02:18.080197   638 connection.cc:698] client connection to unix:/tmp/dist-test-taskKteUZ6/test-tmp/rpc-test-f036c14a3e314cc58bac43fb58d345e2.sock send error: Network error: failed to write to TLS socket: Broken pipe
W20260925 19:02:18.080346   638 connection.cc:196] Error closing socket: Network error: TlsSocket::Close: Success
I20260925 19:02:18.117739   650 acceptor_pool.cc:254] collecting diagnostics on the listening RPC socket unix:/tmp/dist-test-taskKteUZ6/test-tmp/rpc-test-f036c14a3e314cc58bac43fb58d345e2.sock every 8 connection(s)
I20260925 19:02:18.117743   651 acceptor_pool.cc:254] collecting diagnostics on the listening RPC socket unix:/tmp/dist-test-taskKteUZ6/test-tmp/rpc-test-f036c14a3e314cc58bac43fb58d345e2.sock every 8 connection(s)
W20260925 19:02:22.362928   647 connection.cc:577] server connection from unix:<unnamed>: received bad data: 'Corruption: Invalid packet: message had a length of 2147483710, but we only support messages up to 2147483647 bytes
'
W20260925 19:02:22.363201   663 connection.cc:196] Error closing socket: Network error: TlsSocket::Close: Broken pipe
[       OK ] Parameters/TestRpc.TestRpcSidecarLimits/SSL_UnixSocket (6012 ms)
[ RUN      ] Parameters/TestRpc.TestCallTimeoutDoesntAffectNegotiation/SSL_UnixSocket
I20260925 19:02:22.382931   675 acceptor_pool.cc:254] collecting diagnostics on the listening RPC socket unix:/tmp/dist-test-taskKteUZ6/test-tmp/rpc-test-d70726fff5e240fe9903b72acbe25725.sock every 8 connection(s)
I20260925 19:02:22.382961   676 acceptor_pool.cc:254] collecting diagnostics on the listening RPC socket unix:/tmp/dist-test-taskKteUZ6/test-tmp/rpc-test-d70726fff5e240fe9903b72acbe25725.sock every 8 connection(s)
W20260925 19:02:22.396270   671 negotiation.cc:266] Injecting 500ms delay in negotiation
I20260925 19:02:22.446545   383 rpc-test-base.h:595] status: Timed out: connection negotiation to unix:/tmp/dist-test-taskKteUZ6/test-tmp/rpc-test-d70726fff5e240fe9903b72acbe25725.sock for RPC Sleep timed out after 0.050s (ON_OUTBOUND_QUEUE), seconds elapsed: 0.050591
[       OK ] Parameters/TestRpc.TestCallTimeoutDoesntAffectNegotiation/SSL_UnixSocket (536 ms)
[ RUN      ] Parameters/TestRpc.TestRpcHandlerLatencyMetric/SSL_UnixSocket
I20260925 19:02:22.927171   700 acceptor_pool.cc:254] collecting diagnostics on the listening RPC socket unix:/tmp/dist-test-taskKteUZ6/test-tmp/rpc-test-b25fbbaa4bc54eb091e43e65a0168efc.sock every 8 connection(s)
I20260925 19:02:22.927214   701 acceptor_pool.cc:254] collecting diagnostics on the listening RPC socket unix:/tmp/dist-test-taskKteUZ6/test-tmp/rpc-test-b25fbbaa4bc54eb091e43e65a0168efc.sock every 8 connection(s)
I20260925 19:02:22.978001   383 rpc-test.cc:1236] Sleep() min lat: 20280
I20260925 19:02:22.978068   383 rpc-test.cc:1237] Sleep() mean lat: 20280
I20260925 19:02:22.978093   383 rpc-test.cc:1238] Sleep() max lat: 20280
I20260925 19:02:22.978106   383 rpc-test.cc:1239] Sleep() #calls: 1
W20260925 19:02:22.978811   697 connection.cc:196] Error closing socket: Network error: TlsSocket::Close: Broken pipe
[       OK ] Parameters/TestRpc.TestRpcHandlerLatencyMetric/SSL_UnixSocket (78 ms)
[ RUN      ] Parameters/TestRpc.TimedOutOnResponseMetricServiceQueue/SSL_UnixSocket
I20260925 19:02:22.997717   726 acceptor_pool.cc:254] collecting diagnostics on the listening RPC socket unix:/tmp/dist-test-taskKteUZ6/test-tmp/rpc-test-8665c4bac1a44e478590fcaa483a279e.sock every 8 connection(s)
I20260925 19:02:22.997776   727 acceptor_pool.cc:254] collecting diagnostics on the listening RPC socket unix:/tmp/dist-test-taskKteUZ6/test-tmp/rpc-test-8665c4bac1a44e478590fcaa483a279e.sock every 8 connection(s)
W20260925 19:02:23.051973   728 rpcz_store.cc:267] Call kudu.rpc_test.CalculatorService.Sleep from unix:<unnamed> (request call id 2) took 20 ms (client timeout 20 ms). Trace:
W20260925 19:02:23.052237   728 rpcz_store.cc:269] 0925 19:02:23.031659 (+     0us) service_pool.cc:170] Inserting onto call queue
0925 19:02:23.051946 (+ 20287us) service_pool.cc:214] Skipping call since client already timed out
0925 19:02:23.051955 (+     9us) inbound_call.cc:173] Queueing failure response
Metrics: {}
W20260925 19:02:23.052742   723 connection.cc:196] Error closing socket: Network error: TlsSocket::Close: Broken pipe
[       OK ] Parameters/TestRpc.TimedOutOnResponseMetricServiceQueue/SSL_UnixSocket (73 ms)
[ RUN      ] Parameters/TestRpc.RpcPendingConnectionsMetric/SSL_UnixSocket
I20260925 19:02:23.055650   749 acceptor_pool.cc:254] collecting diagnostics on the listening RPC socket 0.0.0.0:46021 every 8 connection(s)
I20260925 19:02:23.055753   750 acceptor_pool.cc:254] collecting diagnostics on the listening RPC socket 0.0.0.0:46021 every 8 connection(s)
W20260925 19:02:23.064453   745 negotiation.cc:337] Failed RPC negotiation. Trace:
0925 19:02:23.064144 (+     0us) reactor.cc:625] Submitting negotiation task for server connection from 127.0.0.1:35868 (local address 127.0.0.1:46021)
0925 19:02:23.064246 (+   102us) server_negotiation.cc:206] Beginning negotiation
0925 19:02:23.064248 (+     2us) server_negotiation.cc:399] Waiting for connection header
0925 19:02:23.064351 (+   103us) negotiation.cc:327] Negotiation complete: Network error: Server connection negotiation failed: server connection from 127.0.0.1:35868: BlockingRecv error: recv got EOF from 127.0.0.1:35868 (error 108)
Metrics: {"server-negotiator.queue_time_us":56}
[       OK ] Parameters/TestRpc.RpcPendingConnectionsMetric/SSL_UnixSocket (21 ms)
[ RUN      ] Parameters/TestRpc.TestRpcContextClientDeadline/SSL_UnixSocket
I20260925 19:02:23.091217   765 acceptor_pool.cc:254] collecting diagnostics on the listening RPC socket unix:/tmp/dist-test-taskKteUZ6/test-tmp/rpc-test-7af7ef47d2e348d4b58d80b37a3b65b7.sock every 8 connection(s)
I20260925 19:02:23.091243   766 acceptor_pool.cc:254] collecting diagnostics on the listening RPC socket unix:/tmp/dist-test-taskKteUZ6/test-tmp/rpc-test-7af7ef47d2e348d4b58d80b37a3b65b7.sock every 8 connection(s)
[       OK ] Parameters/TestRpc.TestRpcContextClientDeadline/SSL_UnixSocket (50 ms)
[ RUN      ] Parameters/TestRpc.TestApplicationFeatureFlagUnsupportedServer/SSL_UnixSocket
I20260925 19:02:23.138389   790 acceptor_pool.cc:254] collecting diagnostics on the listening RPC socket unix:/tmp/dist-test-taskKteUZ6/test-tmp/rpc-test-c31d29a921934ad28b0c28a0a401422f.sock every 8 connection(s)
I20260925 19:02:23.138427   791 acceptor_pool.cc:254] collecting diagnostics on the listening RPC socket unix:/tmp/dist-test-taskKteUZ6/test-tmp/rpc-test-c31d29a921934ad28b0c28a0a401422f.sock every 8 connection(s)
[       OK ] Parameters/TestRpc.TestApplicationFeatureFlagUnsupportedServer/SSL_UnixSocket (44 ms)
[ RUN      ] Parameters/TestRpc.TestCancellationAsync/SSL_UnixSocket
I20260925 19:02:23.190352   815 acceptor_pool.cc:254] collecting diagnostics on the listening RPC socket unix:/tmp/dist-test-taskKteUZ6/test-tmp/rpc-test-eae89b8b96574e83a0ed5eab21224b93.sock every 8 connection(s)
I20260925 19:02:23.190420   816 acceptor_pool.cc:254] collecting diagnostics on the listening RPC socket unix:/tmp/dist-test-taskKteUZ6/test-tmp/rpc-test-eae89b8b96574e83a0ed5eab21224b93.sock every 8 connection(s)
I20260925 19:02:23.190569   383 rpc-test.cc:1716] Connecting to unix:/tmp/dist-test-taskKteUZ6/test-tmp/rpc-test-eae89b8b96574e83a0ed5eab21224b93.sock
I20260925 19:02:23.209406   383 test_util.cc:268] Using random seed: 1530904506
I20260925 19:02:23.223628   819 rpc-test-base.h:240] got call: sleep_micros: 500 pattern: 4294967295 num_repetitions: 2097152 sidecar_idx: 0
I20260925 19:02:23.234103   819 rpc-test-base.h:240] got call: sleep_micros: 500 pattern: 4294967295 num_repetitions: 2097152 sidecar_idx: 0
I20260925 19:02:23.244226   819 rpc-test-base.h:240] got call: sleep_micros: 500 pattern: 4294967295 num_repetitions: 2097152 sidecar_idx: 0
I20260925 19:02:23.254429   819 rpc-test-base.h:240] got call: sleep_micros: 500 pattern: 4294967295 num_repetitions: 2097152 sidecar_idx: 0
I20260925 19:02:23.264671   819 rpc-test-base.h:240] got call: sleep_micros: 500 pattern: 4294967295 num_repetitions: 2097152 sidecar_idx: 0
I20260925 19:02:23.274935   819 rpc-test-base.h:240] got call: sleep_micros: 500 pattern: 4294967295 num_repetitions: 2097152 sidecar_idx: 0
I20260925 19:02:23.285403   819 rpc-test-base.h:240] got call: sleep_micros: 500 pattern: 4294967295 num_repetitions: 2097152 sidecar_idx: 0
I20260925 19:02:23.295838   819 rpc-test-base.h:240] got call: sleep_micros: 500 pattern: 4294967295 num_repetitions: 2097152 sidecar_idx: 0
W20260925 19:02:23.297327   812 connection.cc:196] Error closing socket: Network error: TlsSocket::Close: Broken pipe
W20260925 19:02:23.299170   812 connection.cc:441] server connection from unix:<unnamed> torn down before Call kudu.rpc.GenericCalculatorService.SleepWithSidecar from unix:<unnamed> (request call id 9) could send its response
[       OK ] Parameters/TestRpc.TestCancellationAsync/SSL_UnixSocket (129 ms)
[ RUN      ] Parameters/TestRpc.TestPerformanceBySocketType/SSL_UnixSocket
I20260925 19:02:23.315623   840 acceptor_pool.cc:254] collecting diagnostics on the listening RPC socket unix:/tmp/dist-test-taskKteUZ6/test-tmp/rpc-test-a80e6a8d646846f6a299e1423800593a.sock every 8 connection(s)
I20260925 19:02:23.315678   841 acceptor_pool.cc:254] collecting diagnostics on the listening RPC socket unix:/tmp/dist-test-taskKteUZ6/test-tmp/rpc-test-a80e6a8d646846f6a299e1423800593a.sock every 8 connection(s)
I20260925 19:02:23.315843   383 rpc-test.cc:1846] Connecting to unix:/tmp/dist-test-taskKteUZ6/test-tmp/rpc-test-a80e6a8d646846f6a299e1423800593a.sock
I20260925 19:02:24.560441   383 rpc-test.cc:1859] Sending 1024MB via ssl-enabled unix socket: real 1.233s	user 1.351s	sys 0.871s
I20260925 19:02:25.788154   383 rpc-test.cc:1859] Sending 1024MB via ssl-enabled unix socket: real 1.228s	user 1.244s	sys 0.969s
I20260925 19:02:27.072396   383 rpc-test.cc:1859] Sending 1024MB via ssl-enabled unix socket: real 1.284s	user 1.410s	sys 0.914s
I20260925 19:02:28.310421   383 rpc-test.cc:1859] Sending 1024MB via ssl-enabled unix socket: real 1.238s	user 1.376s	sys 0.847s
I20260925 19:02:29.525650   383 rpc-test.cc:1859] Sending 1024MB via ssl-enabled unix socket: real 1.215s	user 1.357s	sys 0.839s
W20260925 19:02:29.526358   837 connection.cc:196] Error closing socket: Network error: TlsSocket::Close: Broken pipe
[       OK ] Parameters/TestRpc.TestPerformanceBySocketType/SSL_UnixSocket (6227 ms)
[----------] 20 tests from Parameters/TestRpc (25849 ms total)

[----------] 1 test from Parameters/TestRpcSocketTxRxQueue
[ RUN      ] Parameters/TestRpcSocketTxRxQueue.AcceptorRxQueueSizeMetric/0
I20260925 19:02:29.534478   865 acceptor_pool.cc:254] collecting diagnostics on the listening RPC socket 0.0.0.0:44513 every 1 connection(s)
I20260925 19:02:29.534535   866 acceptor_pool.cc:254] collecting diagnostics on the listening RPC socket 0.0.0.0:44513 every 1 connection(s)
W20260925 19:02:29.535077   861 negotiation.cc:337] Failed RPC negotiation. Trace:
0925 19:02:29.534931 (+     0us) reactor.cc:625] Submitting negotiation task for server connection from 127.0.0.1:38224 (local address 127.0.0.1:44513)
0925 19:02:29.534996 (+    65us) server_negotiation.cc:206] Beginning negotiation
0925 19:02:29.534998 (+     2us) server_negotiation.cc:399] Waiting for connection header
0925 19:02:29.535051 (+    53us) negotiation.cc:327] Negotiation complete: Network error: Server connection negotiation failed: server connection from 127.0.0.1:38224: BlockingRecv error: recv got EOF from 127.0.0.1:38224 (error 108)
Metrics: {"server-negotiator.queue_time_us":38}
[       OK ] Parameters/TestRpcSocketTxRxQueue.AcceptorRxQueueSizeMetric/0 (9 ms)
[----------] 1 test from Parameters/TestRpcSocketTxRxQueue (9 ms total)

[----------] Global test environment tear-down
[==========] 21 tests from 2 test suites ran. (25859 ms total)
[  PASSED  ] 20 tests.
[  FAILED  ] 1 test, listed below:
[  FAILED  ] Parameters/TestRpc.TestCallWithChainCertAndChainCA/SSL_UnixSocket, where GetParam() = (true, true)

 1 FAILED TEST