Diagnosed failure

Parameters/TestRpc.TestCallWithChainCertAndChainCA/SSL_TCP: /data0/somelongdirectorytoavoidrpathissues/src/kudu/src/kudu/rpc/rpc-test.cc:270: Failure
Failed
Bad status: Runtime error: could not verify certificate chain (error with cert: subject=CN = localhost, ST = sadfjas, C = AS, emailAddress = sdflkdsajf, O = lskdfjlsad, OU = sldfkja, issuer=C = AS, ST = ASDfkjdhf, L = lskdjf, O = saldfja, OU = skdjf, CN = localhost, emailAddress = sadjflkadsj): : certificate has expired
Google Test trace:
/data0/somelongdirectorytoavoidrpathissues/src/kudu/src/kudu/rpc/rpc-test.cc:267: Connecting to 0.0.0.0:40981
I20260926 06:57:47.541461   383 test_util.cc:175] -----------------------------------------------
I20260926 06:57:47.541508   383 test_util.cc:176] Had fatal failures, leaving test files at /tmp/dist-test-taskz30EIw/test-tmp/rpc-test.5.Parameters_TestRpc.TestCallWithChainCertAndChainCA_SSL_TCP.1790405867487068-383-0

Full log

Note: This is test shard 6 of 8.
[==========] Running 21 tests from 2 test suites.
[----------] Global test environment set-up.
[----------] 20 tests from Parameters/TestRpc
[ RUN      ] Parameters/TestRpc.TestMessengerCreateDestroy/SSL_TCP
WARNING: Logging before InitGoogleLogging() is written to STDERR
I20260926 06:57:47.504837   383 rpc-test.cc:169] started messenger TestCreateDestroy
[       OK ] Parameters/TestRpc.TestMessengerCreateDestroy/SSL_TCP (16 ms)
[ RUN      ] Parameters/TestRpc.TestNegotiationDeadlock/SSL_TCP
I20260926 06:57:47.523041   403 acceptor_pool.cc:254] collecting diagnostics on the listening RPC socket 0.0.0.0:39127 every 8 connection(s)
I20260926 06:57:47.523051   404 acceptor_pool.cc:254] collecting diagnostics on the listening RPC socket 0.0.0.0:39127 every 8 connection(s)
[       OK ] Parameters/TestRpc.TestNegotiationDeadlock/SSL_TCP (24 ms)
[ RUN      ] Parameters/TestRpc.TestCallWithChainCertAndChainCA/SSL_TCP
I20260926 06:57:47.537433   419 acceptor_pool.cc:254] collecting diagnostics on the listening RPC socket 0.0.0.0:40981 every 8 connection(s)
I20260926 06:57:47.537482   420 acceptor_pool.cc:254] collecting diagnostics on the listening RPC socket 0.0.0.0:40981 every 8 connection(s)
/data0/somelongdirectorytoavoidrpathissues/src/kudu/src/kudu/rpc/rpc-test.cc:270: Failure
Failed
Bad status: Runtime error: could not verify certificate chain (error with cert: subject=CN = localhost, ST = sadfjas, C = AS, emailAddress = sdflkdsajf, O = lskdfjlsad, OU = sldfkja, issuer=C = AS, ST = ASDfkjdhf, L = lskdjf, O = saldfja, OU = skdjf, CN = localhost, emailAddress = sadjflkadsj): : certificate has expired
Google Test trace:
/data0/somelongdirectorytoavoidrpathissues/src/kudu/src/kudu/rpc/rpc-test.cc:267: Connecting to 0.0.0.0:40981
I20260926 06:57:47.541461   383 test_util.cc:175] -----------------------------------------------
I20260926 06:57:47.541508   383 test_util.cc:176] Had fatal failures, leaving test files at /tmp/dist-test-taskz30EIw/test-tmp/rpc-test.5.Parameters_TestRpc.TestCallWithChainCertAndChainCA_SSL_TCP.1790405867487068-383-0
[  FAILED  ] Parameters/TestRpc.TestCallWithChainCertAndChainCA/SSL_TCP, where GetParam() = (true, false) (10 ms)
[ RUN      ] Parameters/TestRpc.TestCallWithPasswordProtectedKey/SSL_TCP
I20260926 06:57:47.557292   445 acceptor_pool.cc:254] collecting diagnostics on the listening RPC socket 0.0.0.0:35439 every 8 connection(s)
I20260926 06:57:47.557292   444 acceptor_pool.cc:254] collecting diagnostics on the listening RPC socket 0.0.0.0:35439 every 8 connection(s)
[       OK ] Parameters/TestRpc.TestCallWithPasswordProtectedKey/SSL_TCP (29 ms)
[ RUN      ] Parameters/TestRpc.TestCallToBadServer/SSL_TCP
I20260926 06:57:47.611330   383 rpc-test.cc:394] Status: Network error: Client connection negotiation failed: client connection to 0.0.0.0:0: connect: Connection refused (error 111)
I20260926 06:57:47.611646   383 rpc-test.cc:394] Status: Network error: Client connection negotiation failed: client connection to 0.0.0.0:0: connect: Connection refused (error 111)
I20260926 06:57:47.611938   383 rpc-test.cc:394] Status: Network error: Client connection negotiation failed: client connection to 0.0.0.0:0: connect: Connection refused (error 111)
I20260926 06:57:47.612155   383 rpc-test.cc:394] Status: Network error: Client connection negotiation failed: client connection to 0.0.0.0:0: connect: Connection refused (error 111)
I20260926 06:57:47.612349   383 rpc-test.cc:394] Status: Network error: Client connection negotiation failed: client connection to 0.0.0.0:0: connect: Connection refused (error 111)
[       OK ] Parameters/TestRpc.TestCallToBadServer/SSL_TCP (41 ms)
[ RUN      ] Parameters/TestRpc.TestWrongService/SSL_TCP
I20260926 06:57:47.617966   479 acceptor_pool.cc:254] collecting diagnostics on the listening RPC socket 0.0.0.0:33607 every 8 connection(s)
I20260926 06:57:47.618010   480 acceptor_pool.cc:254] collecting diagnostics on the listening RPC socket 0.0.0.0:33607 every 8 connection(s)
I20260926 06:57:47.642501   477 messenger.cc:345] service WrongServiceName not registered on TestServer
[       OK ] Parameters/TestRpc.TestWrongService/SSL_TCP (31 ms)
[ RUN      ] Parameters/TestRpc.TestConnectionKeepalive/SSL_TCP
I20260926 06:57:47.653559   502 acceptor_pool.cc:254] collecting diagnostics on the listening RPC socket 0.0.0.0:34233 every 8 connection(s)
I20260926 06:57:47.653614   503 acceptor_pool.cc:254] collecting diagnostics on the listening RPC socket 0.0.0.0:34233 every 8 connection(s)
I20260926 06:57:47.653779   383 rpc-test.cc:488] Connecting to 0.0.0.0:34233
[       OK ] Parameters/TestRpc.TestConnectionKeepalive/SSL_TCP (1046 ms)
[ RUN      ] Parameters/TestRpc.TestClientConnectionMetrics/SSL_TCP
I20260926 06:57:48.713258   528 acceptor_pool.cc:254] collecting diagnostics on the listening RPC socket 0.0.0.0:46833 every 8 connection(s)
I20260926 06:57:48.713260   527 acceptor_pool.cc:254] collecting diagnostics on the listening RPC socket 0.0.0.0:46833 every 8 connection(s)
I20260926 06:57:48.713423   383 rpc-test.cc:569] Connecting to 0.0.0.0:46833
[       OK ] Parameters/TestRpc.TestClientConnectionMetrics/SSL_TCP (11124 ms)
[ RUN      ] Parameters/TestRpc.TestCredentialsPolicy/SSL_TCP
I20260926 06:57:59.836836   550 acceptor_pool.cc:254] collecting diagnostics on the listening RPC socket 0.0.0.0:41301 every 8 connection(s)
I20260926 06:57:59.836886   551 acceptor_pool.cc:254] collecting diagnostics on the listening RPC socket 0.0.0.0:41301 every 8 connection(s)
I20260926 06:57:59.837045   383 rpc-test.cc:700] Connecting to 0.0.0.0:41301
[       OK ] Parameters/TestRpc.TestCredentialsPolicy/SSL_TCP (62 ms)
[ RUN      ] Parameters/TestRpc.TestCallLongerThanKeepalive/SSL_TCP
I20260926 06:57:59.885756   575 acceptor_pool.cc:254] collecting diagnostics on the listening RPC socket 0.0.0.0:39435 every 8 connection(s)
I20260926 06:57:59.885797   576 acceptor_pool.cc:254] collecting diagnostics on the listening RPC socket 0.0.0.0:39435 every 8 connection(s)
I20260926 06:57:59.899842   579 rpc-test-base.h:222] got call: sleep_micros: 3000000 deferred: true
I20260926 06:58:02.900539   579 rpcz_store.cc:275] Call kudu.rpc.GenericCalculatorService.Sleep from 127.0.0.1:54966 (request call id 0) took 3000 ms. Trace:
I20260926 06:58:02.900671   579 rpcz_store.cc:276] 0926 06:57:59.899806 (+     0us) service_pool.cc:170] Inserting onto call queue
0926 06:57:59.899827 (+    21us) service_pool.cc:227] Handling call
0926 06:58:02.900522 (+3000695us) inbound_call.cc:173] Queueing success response
Metrics: {}
[       OK ] Parameters/TestRpc.TestCallLongerThanKeepalive/SSL_TCP (3025 ms)
[ RUN      ] Parameters/TestRpc.TestRpcSidecar/SSL_TCP
I20260926 06:58:02.908725   600 acceptor_pool.cc:254] collecting diagnostics on the listening RPC socket 0.0.0.0:33315 every 8 connection(s)
I20260926 06:58:02.908789   601 acceptor_pool.cc:254] collecting diagnostics on the listening RPC socket 0.0.0.0:33315 every 8 connection(s)
[       OK ] Parameters/TestRpc.TestRpcSidecar/SSL_TCP (59 ms)
[ RUN      ] Parameters/TestRpc.TestRpcSidecarLimits/SSL_TCP
I20260926 06:58:04.728969   626 acceptor_pool.cc:254] collecting diagnostics on the listening RPC socket 0.0.0.0:46361 every 8 connection(s)
I20260926 06:58:04.728963   625 acceptor_pool.cc:254] collecting diagnostics on the listening RPC socket 0.0.0.0:46361 every 8 connection(s)
W20260926 06:58:04.740861   383 serialization.cc:72] Serialized kudu.rpc_test.PushStringsRequestPB (2147483654 bytes) is larger than the maximum configured RPC message size (52428800 bytes). Sending anyway, but peer may reject the data.
W20260926 06:58:04.744765   624 connection.cc:535] server connection from 127.0.0.1:43112 recv error: Network error: RPC frame had a length of 2147483714, but we only support messages up to 52428800 bytes long.
W20260926 06:58:04.744855   624 connection.cc:158] shutting down server connection from 127.0.0.1:43112 with pending inbound data: 4/2147483714 bytes received; last active 0 ns ago: status Network error: RPC frame had a length of 2147483714, but we only support messages up to 52428800 bytes long.
W20260926 06:58:04.745105   638 connection.cc:698] client connection to 0.0.0.0:46361 send error: Network error: failed to write to TLS socket: Connection reset by peer
W20260926 06:58:04.745211   638 connection.cc:196] Error closing socket: Network error: TlsSocket::Close: Success
I20260926 06:58:04.756199   650 acceptor_pool.cc:254] collecting diagnostics on the listening RPC socket 0.0.0.0:46473 every 8 connection(s)
I20260926 06:58:04.756207   651 acceptor_pool.cc:254] collecting diagnostics on the listening RPC socket 0.0.0.0:46473 every 8 connection(s)
W20260926 06:58:08.797348   649 connection.cc:577] server connection from 127.0.0.1:55048: received bad data: 'Corruption: Invalid packet: message had a length of 2147483710, but we only support messages up to 2147483647 bytes
'
[       OK ] Parameters/TestRpc.TestRpcSidecarLimits/SSL_TCP (5836 ms)
[ RUN      ] Parameters/TestRpc.TestCallTimeoutDoesntAffectNegotiation/SSL_TCP
I20260926 06:58:08.837292   675 acceptor_pool.cc:254] collecting diagnostics on the listening RPC socket 0.0.0.0:46017 every 8 connection(s)
I20260926 06:58:08.837335   676 acceptor_pool.cc:254] collecting diagnostics on the listening RPC socket 0.0.0.0:46017 every 8 connection(s)
W20260926 06:58:08.843818   671 negotiation.cc:266] Injecting 500ms delay in negotiation
I20260926 06:58:08.894167   383 rpc-test-base.h:595] status: Timed out: connection negotiation to 0.0.0.0:46017 for RPC Sleep timed out after 0.050s (ON_OUTBOUND_QUEUE), seconds elapsed: 0.0507497
[       OK ] Parameters/TestRpc.TestCallTimeoutDoesntAffectNegotiation/SSL_TCP (549 ms)
[ RUN      ] Parameters/TestRpc.TestRpcHandlerLatencyMetric/SSL_TCP
I20260926 06:58:09.353916   700 acceptor_pool.cc:254] collecting diagnostics on the listening RPC socket 0.0.0.0:46037 every 8 connection(s)
I20260926 06:58:09.354007   701 acceptor_pool.cc:254] collecting diagnostics on the listening RPC socket 0.0.0.0:46037 every 8 connection(s)
I20260926 06:58:09.384404   383 rpc-test.cc:1236] Sleep() min lat: 20340
I20260926 06:58:09.384493   383 rpc-test.cc:1237] Sleep() mean lat: 20340
I20260926 06:58:09.384529   383 rpc-test.cc:1238] Sleep() max lat: 20340
I20260926 06:58:09.384552   383 rpc-test.cc:1239] Sleep() #calls: 1
[       OK ] Parameters/TestRpc.TestRpcHandlerLatencyMetric/SSL_TCP (37 ms)
[ RUN      ] Parameters/TestRpc.TimedOutOnResponseMetricServiceQueue/SSL_TCP
I20260926 06:58:09.402410   727 acceptor_pool.cc:254] collecting diagnostics on the listening RPC socket 0.0.0.0:45871 every 8 connection(s)
I20260926 06:58:09.402383   726 acceptor_pool.cc:254] collecting diagnostics on the listening RPC socket 0.0.0.0:45871 every 8 connection(s)
W20260926 06:58:09.459802   728 rpcz_store.cc:267] Call kudu.rpc_test.CalculatorService.Sleep from 127.0.0.1:44654 (request call id 2) took 20 ms (client timeout 20 ms). Trace:
W20260926 06:58:09.459894   728 rpcz_store.cc:269] 0926 06:58:09.439449 (+     0us) service_pool.cc:170] Inserting onto call queue
0926 06:58:09.459698 (+ 20249us) service_pool.cc:214] Skipping call since client already timed out
0926 06:58:09.459707 (+     9us) inbound_call.cc:173] Queueing failure response
Metrics: {}
[       OK ] Parameters/TestRpc.TimedOutOnResponseMetricServiceQueue/SSL_TCP (75 ms)
[ RUN      ] Parameters/TestRpc.RpcPendingConnectionsMetric/SSL_TCP
I20260926 06:58:09.463291   749 acceptor_pool.cc:254] collecting diagnostics on the listening RPC socket 0.0.0.0:38263 every 8 connection(s)
I20260926 06:58:09.463352   750 acceptor_pool.cc:254] collecting diagnostics on the listening RPC socket 0.0.0.0:38263 every 8 connection(s)
W20260926 06:58:09.472788   745 negotiation.cc:337] Failed RPC negotiation. Trace:
0926 06:58:09.472501 (+     0us) reactor.cc:625] Submitting negotiation task for server connection from 127.0.0.1:41812 (local address 127.0.0.1:38263)
0926 06:58:09.472578 (+    77us) server_negotiation.cc:206] Beginning negotiation
0926 06:58:09.472580 (+     2us) server_negotiation.cc:399] Waiting for connection header
0926 06:58:09.472686 (+   106us) negotiation.cc:327] Negotiation complete: Network error: Server connection negotiation failed: server connection from 127.0.0.1:41812: BlockingRecv error: recv got EOF from 127.0.0.1:41812 (error 108)
Metrics: {"server-negotiator.queue_time_us":35}
[       OK ] Parameters/TestRpc.RpcPendingConnectionsMetric/SSL_TCP (22 ms)
[ RUN      ] Parameters/TestRpc.TestRpcContextClientDeadline/SSL_TCP
I20260926 06:58:09.494786   765 acceptor_pool.cc:254] collecting diagnostics on the listening RPC socket 0.0.0.0:35377 every 8 connection(s)
I20260926 06:58:09.494835   766 acceptor_pool.cc:254] collecting diagnostics on the listening RPC socket 0.0.0.0:35377 every 8 connection(s)
[       OK ] Parameters/TestRpc.TestRpcContextClientDeadline/SSL_TCP (61 ms)
[ RUN      ] Parameters/TestRpc.TestApplicationFeatureFlagUnsupportedServer/SSL_TCP
I20260926 06:58:09.563032   790 acceptor_pool.cc:254] collecting diagnostics on the listening RPC socket 0.0.0.0:33405 every 8 connection(s)
I20260926 06:58:09.563045   791 acceptor_pool.cc:254] collecting diagnostics on the listening RPC socket 0.0.0.0:33405 every 8 connection(s)
[       OK ] Parameters/TestRpc.TestApplicationFeatureFlagUnsupportedServer/SSL_TCP (43 ms)
[ RUN      ] Parameters/TestRpc.TestCancellationAsync/SSL_TCP
I20260926 06:58:09.616683   816 acceptor_pool.cc:254] collecting diagnostics on the listening RPC socket 0.0.0.0:45811 every 8 connection(s)
I20260926 06:58:09.616690   815 acceptor_pool.cc:254] collecting diagnostics on the listening RPC socket 0.0.0.0:45811 every 8 connection(s)
I20260926 06:58:09.616849   383 rpc-test.cc:1716] Connecting to 0.0.0.0:45811
I20260926 06:58:09.636310   383 test_util.cc:268] Using random seed: 1527658451
I20260926 06:58:09.655583   819 rpc-test-base.h:240] got call: sleep_micros: 500 pattern: 4294967295 num_repetitions: 2097152 sidecar_idx: 0
I20260926 06:58:09.671088   819 rpc-test-base.h:240] got call: sleep_micros: 500 pattern: 4294967295 num_repetitions: 2097152 sidecar_idx: 0
I20260926 06:58:09.688630   819 rpc-test-base.h:240] got call: sleep_micros: 500 pattern: 4294967295 num_repetitions: 2097152 sidecar_idx: 0
I20260926 06:58:09.708213   819 rpc-test-base.h:240] got call: sleep_micros: 500 pattern: 4294967295 num_repetitions: 2097152 sidecar_idx: 0
I20260926 06:58:09.722929   819 rpc-test-base.h:240] got call: sleep_micros: 500 pattern: 4294967295 num_repetitions: 2097152 sidecar_idx: 0
I20260926 06:58:09.735435   819 rpc-test-base.h:240] got call: sleep_micros: 500 pattern: 4294967295 num_repetitions: 2097152 sidecar_idx: 0
I20260926 06:58:09.748718   819 rpc-test-base.h:240] got call: sleep_micros: 500 pattern: 4294967295 num_repetitions: 2097152 sidecar_idx: 0
W20260926 06:58:09.752054   812 connection.cc:441] server connection from 127.0.0.1:38194 torn down before Call kudu.rpc.GenericCalculatorService.SleepWithSidecar from 127.0.0.1:38194 (request call id 9) could send its response
[       OK ] Parameters/TestRpc.TestCancellationAsync/SSL_TCP (164 ms)
[ RUN      ] Parameters/TestRpc.TestPerformanceBySocketType/SSL_TCP
I20260926 06:58:09.764392   840 acceptor_pool.cc:254] collecting diagnostics on the listening RPC socket 0.0.0.0:38041 every 8 connection(s)
I20260926 06:58:09.764463   841 acceptor_pool.cc:254] collecting diagnostics on the listening RPC socket 0.0.0.0:38041 every 8 connection(s)
I20260926 06:58:09.764642   383 rpc-test.cc:1846] Connecting to 0.0.0.0:38041
I20260926 06:58:11.429770   383 rpc-test.cc:1859] Sending 1024MB via ssl-enabled tcp socket: real 1.657s	user 1.391s	sys 1.549s
I20260926 06:58:13.048839   383 rpc-test.cc:1859] Sending 1024MB via ssl-enabled tcp socket: real 1.619s	user 1.452s	sys 1.430s
I20260926 06:58:14.705513   383 rpc-test.cc:1859] Sending 1024MB via ssl-enabled tcp socket: real 1.657s	user 1.409s	sys 1.500s
I20260926 06:58:16.314034   383 rpc-test.cc:1859] Sending 1024MB via ssl-enabled tcp socket: real 1.608s	user 1.373s	sys 1.472s
I20260926 06:58:17.902402   383 rpc-test.cc:1859] Sending 1024MB via ssl-enabled tcp socket: real 1.588s	user 1.411s	sys 1.425s
[       OK ] Parameters/TestRpc.TestPerformanceBySocketType/SSL_TCP (8151 ms)
[----------] 20 tests from Parameters/TestRpc (30414 ms total)

[----------] 1 test from Parameters/TestRpcSocketTxRxQueue
[ RUN      ] Parameters/TestRpcSocketTxRxQueue.OverCapacity/0
W20260926 06:58:18.170588   884 negotiation.cc:337] Failed RPC negotiation. Trace:
0926 06:58:17.908775 (+     0us) reactor.cc:625] Submitting negotiation task for client connection to 0.0.0.0:44931 (local address 127.0.0.1:48906)
0926 06:58:17.908831 (+    56us) negotiation.cc:107] Waiting for socket to connect
0926 06:58:17.908841 (+    10us) client_negotiation.cc:174] Beginning negotiation
0926 06:58:17.908883 (+    42us) client_negotiation.cc:252] Sending NEGOTIATE NegotiatePB request
0926 06:58:18.170476 (+261593us) negotiation.cc:327] Negotiation complete: Network error: Client connection negotiation failed: client connection to 0.0.0.0:44931: BlockingRecv error: recv error from unknown peer: Transport endpoint is not connected (error 107)
Metrics: {"client-negotiator.queue_time_us":35}
W20260926 06:58:18.170707   875 negotiation.cc:337] Failed RPC negotiation. Trace:
0926 06:58:17.907913 (+     0us) reactor.cc:625] Submitting negotiation task for client connection to 0.0.0.0:44931 (local address 127.0.0.1:48898)
0926 06:58:17.907976 (+    63us) negotiation.cc:107] Waiting for socket to connect
0926 06:58:17.907986 (+    10us) client_negotiation.cc:174] Beginning negotiation
0926 06:58:17.908036 (+    50us) client_negotiation.cc:252] Sending NEGOTIATE NegotiatePB request
0926 06:58:18.170570 (+262534us) negotiation.cc:327] Negotiation complete: Network error: Client connection negotiation failed: client connection to 0.0.0.0:44931: BlockingRecv error: recv error from unknown peer: Transport endpoint is not connected (error 107)
Metrics: {"client-negotiator.queue_time_us":38}
W20260926 06:58:18.170825   902 negotiation.cc:337] Failed RPC negotiation. Trace:
0926 06:58:17.910706 (+     0us) reactor.cc:625] Submitting negotiation task for client connection to 0.0.0.0:44931 (local address 127.0.0.1:48922)
0926 06:58:17.910750 (+    44us) negotiation.cc:107] Waiting for socket to connect
0926 06:58:17.910760 (+    10us) client_negotiation.cc:174] Beginning negotiation
0926 06:58:17.910806 (+    46us) client_negotiation.cc:252] Sending NEGOTIATE NegotiatePB request
0926 06:58:18.170748 (+259942us) negotiation.cc:327] Negotiation complete: Network error: Client connection negotiation failed: client connection to 0.0.0.0:44931: BlockingRecv error: recv error from unknown peer: Transport endpoint is not connected (error 107)
Metrics: {"client-negotiator.queue_time_us":21}
W20260926 06:58:18.170707   866 negotiation.cc:337] Failed RPC negotiation. Trace:
0926 06:58:17.906880 (+     0us) reactor.cc:625] Submitting negotiation task for client connection to 0.0.0.0:44931 (local address 127.0.0.1:48882)
0926 06:58:17.906952 (+    72us) negotiation.cc:107] Waiting for socket to connect
0926 06:58:17.906962 (+    10us) client_negotiation.cc:174] Beginning negotiation
0926 06:58:17.907010 (+    48us) client_negotiation.cc:252] Sending NEGOTIATE NegotiatePB request
0926 06:58:18.170551 (+263541us) negotiation.cc:327] Negotiation complete: Network error: Client connection negotiation failed: client connection to 0.0.0.0:44931: BlockingRecv error: recv error from unknown peer: Transport endpoint is not connected (error 107)
Metrics: {"client-negotiator.queue_time_us":49}
W20260926 06:58:18.170907   893 negotiation.cc:337] Failed RPC negotiation. Trace:
0926 06:58:17.909733 (+     0us) reactor.cc:625] Submitting negotiation task for client connection to 0.0.0.0:44931 (local address 127.0.0.1:48908)
0926 06:58:17.909804 (+    71us) negotiation.cc:107] Waiting for socket to connect
0926 06:58:17.909814 (+    10us) client_negotiation.cc:174] Beginning negotiation
0926 06:58:17.909880 (+    66us) client_negotiation.cc:252] Sending NEGOTIATE NegotiatePB request
0926 06:58:18.170841 (+260961us) negotiation.cc:327] Negotiation complete: Network error: Client connection negotiation failed: client connection to 0.0.0.0:44931: BlockingRecv error: recv error from unknown peer: Transport endpoint is not connected (error 107)
Metrics: {"client-negotiator.queue_time_us":48}
W20260926 06:58:18.170588   857 negotiation.cc:337] Failed RPC negotiation. Trace:
0926 06:58:17.905995 (+     0us) reactor.cc:625] Submitting negotiation task for client connection to 0.0.0.0:44931 (local address 127.0.0.1:48878)
0926 06:58:17.906037 (+    42us) negotiation.cc:107] Waiting for socket to connect
0926 06:58:17.906047 (+    10us) client_negotiation.cc:174] Beginning negotiation
0926 06:58:17.906101 (+    54us) client_negotiation.cc:252] Sending NEGOTIATE NegotiatePB request
0926 06:58:18.170445 (+264344us) negotiation.cc:327] Negotiation complete: Network error: Client connection negotiation failed: client connection to 0.0.0.0:44931: BlockingRecv error: recv error from unknown peer: Transport endpoint is not connected (error 107)
Metrics: {"client-negotiator.queue_time_us":17}
[       OK ] Parameters/TestRpcSocketTxRxQueue.OverCapacity/0 (1027 ms)
[----------] 1 test from Parameters/TestRpcSocketTxRxQueue (1027 ms total)

[----------] Global test environment tear-down
[==========] 21 tests from 2 test suites ran. (31442 ms total)
[  PASSED  ] 20 tests.
[  FAILED  ] 1 test, listed below:
[  FAILED  ] Parameters/TestRpc.TestCallWithChainCertAndChainCA/SSL_TCP, where GetParam() = (true, false)

 1 FAILED TEST