Diagnosed failure

Parameters/TestRpc.TestCallWithChainCertAndChainCA/SSL_TCP: /data0/somelongdirectorytoavoidrpathissues/src/kudu/src/kudu/rpc/rpc-test.cc:270: Failure
Failed
Bad status: Runtime error: could not verify certificate chain (error with cert: subject=CN = localhost, ST = sadfjas, C = AS, emailAddress = sdflkdsajf, O = lskdfjlsad, OU = sldfkja, issuer=C = AS, ST = ASDfkjdhf, L = lskdjf, O = saldfja, OU = skdjf, CN = localhost, emailAddress = sadjflkadsj): : certificate has expired
Google Test trace:
/data0/somelongdirectorytoavoidrpathissues/src/kudu/src/kudu/rpc/rpc-test.cc:267: Connecting to 0.0.0.0:40709
I20260924 09:58:51.443993 17713 test_util.cc:175] -----------------------------------------------
I20260924 09:58:51.444082 17713 test_util.cc:176] Had fatal failures, leaving test files at /tmp/dist-test-taskA9l4UW/test-tmp/rpc-test.5.Parameters_TestRpc.TestCallWithChainCertAndChainCA_SSL_TCP.1790243931316782-17713-0

Full log

Note: This is test shard 6 of 8.
[==========] Running 21 tests from 2 test suites.
[----------] Global test environment set-up.
[----------] 20 tests from Parameters/TestRpc
[ RUN      ] Parameters/TestRpc.TestMessengerCreateDestroy/SSL_TCP
WARNING: Logging before InitGoogleLogging() is written to STDERR
I20260924 09:58:51.371670 17713 rpc-test.cc:169] started messenger TestCreateDestroy
[       OK ] Parameters/TestRpc.TestMessengerCreateDestroy/SSL_TCP (38 ms)
[ RUN      ] Parameters/TestRpc.TestNegotiationDeadlock/SSL_TCP
I20260924 09:58:51.382789 17733 acceptor_pool.cc:254] collecting diagnostics on the listening RPC socket 0.0.0.0:33183 every 8 connection(s)
I20260924 09:58:51.383121 17734 acceptor_pool.cc:254] collecting diagnostics on the listening RPC socket 0.0.0.0:33183 every 8 connection(s)
[       OK ] Parameters/TestRpc.TestNegotiationDeadlock/SSL_TCP (26 ms)
[ RUN      ] Parameters/TestRpc.TestCallWithChainCertAndChainCA/SSL_TCP
I20260924 09:58:51.433461 17749 acceptor_pool.cc:254] collecting diagnostics on the listening RPC socket 0.0.0.0:40709 every 8 connection(s)
I20260924 09:58:51.433751 17750 acceptor_pool.cc:254] collecting diagnostics on the listening RPC socket 0.0.0.0:40709 every 8 connection(s)
/data0/somelongdirectorytoavoidrpathissues/src/kudu/src/kudu/rpc/rpc-test.cc:270: Failure
Failed
Bad status: Runtime error: could not verify certificate chain (error with cert: subject=CN = localhost, ST = sadfjas, C = AS, emailAddress = sdflkdsajf, O = lskdfjlsad, OU = sldfkja, issuer=C = AS, ST = ASDfkjdhf, L = lskdjf, O = saldfja, OU = skdjf, CN = localhost, emailAddress = sadjflkadsj): : certificate has expired
Google Test trace:
/data0/somelongdirectorytoavoidrpathissues/src/kudu/src/kudu/rpc/rpc-test.cc:267: Connecting to 0.0.0.0:40709
I20260924 09:58:51.443993 17713 test_util.cc:175] -----------------------------------------------
I20260924 09:58:51.444082 17713 test_util.cc:176] Had fatal failures, leaving test files at /tmp/dist-test-taskA9l4UW/test-tmp/rpc-test.5.Parameters_TestRpc.TestCallWithChainCertAndChainCA_SSL_TCP.1790243931316782-17713-0
[  FAILED  ] Parameters/TestRpc.TestCallWithChainCertAndChainCA/SSL_TCP, where GetParam() = (true, false) (43 ms)
[ RUN      ] Parameters/TestRpc.TestCallWithPasswordProtectedKey/SSL_TCP
I20260924 09:58:51.477571 17774 acceptor_pool.cc:254] collecting diagnostics on the listening RPC socket 0.0.0.0:42563 every 8 connection(s)
I20260924 09:58:51.477803 17775 acceptor_pool.cc:254] collecting diagnostics on the listening RPC socket 0.0.0.0:42563 every 8 connection(s)
[       OK ] Parameters/TestRpc.TestCallWithPasswordProtectedKey/SSL_TCP (70 ms)
[ RUN      ] Parameters/TestRpc.TestCallToBadServer/SSL_TCP
I20260924 09:58:51.531507 17713 rpc-test.cc:394] Status: Network error: Client connection negotiation failed: client connection to 0.0.0.0:0: connect: Connection refused (error 111)
I20260924 09:58:51.532148 17713 rpc-test.cc:394] Status: Network error: Client connection negotiation failed: client connection to 0.0.0.0:0: connect: Connection refused (error 111)
I20260924 09:58:51.532634 17713 rpc-test.cc:394] Status: Network error: Client connection negotiation failed: client connection to 0.0.0.0:0: connect: Connection refused (error 111)
I20260924 09:58:51.533097 17713 rpc-test.cc:394] Status: Network error: Client connection negotiation failed: client connection to 0.0.0.0:0: connect: Connection refused (error 111)
I20260924 09:58:51.533651 17713 rpc-test.cc:394] Status: Network error: Client connection negotiation failed: client connection to 0.0.0.0:0: connect: Connection refused (error 111)
[       OK ] Parameters/TestRpc.TestCallToBadServer/SSL_TCP (20 ms)
[ RUN      ] Parameters/TestRpc.TestWrongService/SSL_TCP
I20260924 09:58:51.554953 17809 acceptor_pool.cc:254] collecting diagnostics on the listening RPC socket 0.0.0.0:37827 every 8 connection(s)
I20260924 09:58:51.555179 17810 acceptor_pool.cc:254] collecting diagnostics on the listening RPC socket 0.0.0.0:37827 every 8 connection(s)
I20260924 09:58:51.579887 17806 messenger.cc:345] service WrongServiceName not registered on TestServer
[       OK ] Parameters/TestRpc.TestWrongService/SSL_TCP (48 ms)
[ RUN      ] Parameters/TestRpc.TestConnectionKeepalive/SSL_TCP
I20260924 09:58:51.597482 17832 acceptor_pool.cc:254] collecting diagnostics on the listening RPC socket 0.0.0.0:38129 every 8 connection(s)
I20260924 09:58:51.597703 17833 acceptor_pool.cc:254] collecting diagnostics on the listening RPC socket 0.0.0.0:38129 every 8 connection(s)
I20260924 09:58:51.598486 17713 rpc-test.cc:488] Connecting to 0.0.0.0:38129
[       OK ] Parameters/TestRpc.TestConnectionKeepalive/SSL_TCP (1041 ms)
[ RUN      ] Parameters/TestRpc.TestClientConnectionMetrics/SSL_TCP
I20260924 09:58:52.638301 17857 acceptor_pool.cc:254] collecting diagnostics on the listening RPC socket 0.0.0.0:41387 every 8 connection(s)
I20260924 09:58:52.638540 17858 acceptor_pool.cc:254] collecting diagnostics on the listening RPC socket 0.0.0.0:41387 every 8 connection(s)
I20260924 09:58:52.639437 17713 rpc-test.cc:569] Connecting to 0.0.0.0:41387
[       OK ] Parameters/TestRpc.TestClientConnectionMetrics/SSL_TCP (18564 ms)
[ RUN      ] Parameters/TestRpc.TestCredentialsPolicy/SSL_TCP
I20260924 09:59:11.200711 17880 acceptor_pool.cc:254] collecting diagnostics on the listening RPC socket 0.0.0.0:42059 every 8 connection(s)
I20260924 09:59:11.200909 17881 acceptor_pool.cc:254] collecting diagnostics on the listening RPC socket 0.0.0.0:42059 every 8 connection(s)
I20260924 09:59:11.201792 17713 rpc-test.cc:700] Connecting to 0.0.0.0:42059
[       OK ] Parameters/TestRpc.TestCredentialsPolicy/SSL_TCP (55 ms)
[ RUN      ] Parameters/TestRpc.TestCallLongerThanKeepalive/SSL_TCP
I20260924 09:59:11.260495 17905 acceptor_pool.cc:254] collecting diagnostics on the listening RPC socket 0.0.0.0:46871 every 8 connection(s)
I20260924 09:59:11.260740 17906 acceptor_pool.cc:254] collecting diagnostics on the listening RPC socket 0.0.0.0:46871 every 8 connection(s)
I20260924 09:59:11.274305 17909 rpc-test-base.h:222] got call: sleep_micros: 3000000 deferred: true
I20260924 09:59:14.275978 17909 rpcz_store.cc:275] Call kudu.rpc.GenericCalculatorService.Sleep from 127.0.0.1:34210 (request call id 0) took 3001 ms. Trace:
I20260924 09:59:14.276149 17909 rpcz_store.cc:276] 0924 09:59:11.274208 (+     0us) service_pool.cc:170] Inserting onto call queue
0924 09:59:11.274264 (+    56us) service_pool.cc:227] Handling call
0924 09:59:14.275927 (+3001663us) inbound_call.cc:173] Queueing success response
Metrics: {}
[       OK ] Parameters/TestRpc.TestCallLongerThanKeepalive/SSL_TCP (3036 ms)
[ RUN      ] Parameters/TestRpc.TestRpcSidecar/SSL_TCP
I20260924 09:59:14.300314 17930 acceptor_pool.cc:254] collecting diagnostics on the listening RPC socket 0.0.0.0:45317 every 8 connection(s)
I20260924 09:59:14.300524 17931 acceptor_pool.cc:254] collecting diagnostics on the listening RPC socket 0.0.0.0:45317 every 8 connection(s)
[       OK ] Parameters/TestRpc.TestRpcSidecar/SSL_TCP (120 ms)
[ RUN      ] Parameters/TestRpc.TestRpcSidecarLimits/SSL_TCP
I20260924 09:59:16.337278 17955 acceptor_pool.cc:254] collecting diagnostics on the listening RPC socket 0.0.0.0:42207 every 8 connection(s)
I20260924 09:59:16.337513 17956 acceptor_pool.cc:254] collecting diagnostics on the listening RPC socket 0.0.0.0:42207 every 8 connection(s)
W20260924 09:59:16.350456 17713 serialization.cc:72] Serialized kudu.rpc_test.PushStringsRequestPB (2147483654 bytes) is larger than the maximum configured RPC message size (52428800 bytes). Sending anyway, but peer may reject the data.
W20260924 09:59:16.356518 17954 connection.cc:535] server connection from 127.0.0.1:36524 recv error: Network error: RPC frame had a length of 2147483714, but we only support messages up to 52428800 bytes long.
W20260924 09:59:16.356664 17954 connection.cc:158] shutting down server connection from 127.0.0.1:36524 with pending inbound data: 4/2147483714 bytes received; last active 0 ns ago: status Network error: RPC frame had a length of 2147483714, but we only support messages up to 52428800 bytes long.
W20260924 09:59:16.357184 17968 connection.cc:196] Error closing socket: Network error: TlsSocket::Close: Connection reset by peer
I20260924 09:59:16.378682 17980 acceptor_pool.cc:254] collecting diagnostics on the listening RPC socket 0.0.0.0:41301 every 8 connection(s)
I20260924 09:59:16.379680 17981 acceptor_pool.cc:254] collecting diagnostics on the listening RPC socket 0.0.0.0:41301 every 8 connection(s)
W20260924 09:59:21.011683 17978 connection.cc:577] server connection from 127.0.0.1:59326: received bad data: 'Corruption: Invalid packet: message had a length of 2147483710, but we only support messages up to 2147483647 bytes
'
[       OK ] Parameters/TestRpc.TestRpcSidecarLimits/SSL_TCP (7039 ms)
[ RUN      ] Parameters/TestRpc.TestCallTimeoutDoesntAffectNegotiation/SSL_TCP
I20260924 09:59:21.462563 18005 acceptor_pool.cc:254] collecting diagnostics on the listening RPC socket 0.0.0.0:44743 every 8 connection(s)
I20260924 09:59:21.462788 18006 acceptor_pool.cc:254] collecting diagnostics on the listening RPC socket 0.0.0.0:44743 every 8 connection(s)
W20260924 09:59:21.480959 18001 negotiation.cc:266] Injecting 500ms delay in negotiation
I20260924 09:59:21.531477 17713 rpc-test-base.h:595] status: Timed out: connection negotiation to 0.0.0.0:44743 for RPC Sleep timed out after 0.050s (ON_OUTBOUND_QUEUE), seconds elapsed: 0.0511705
[       OK ] Parameters/TestRpc.TestCallTimeoutDoesntAffectNegotiation/SSL_TCP (549 ms)
[ RUN      ] Parameters/TestRpc.TestRpcHandlerLatencyMetric/SSL_TCP
I20260924 09:59:22.004951 18030 acceptor_pool.cc:254] collecting diagnostics on the listening RPC socket 0.0.0.0:36369 every 8 connection(s)
I20260924 09:59:22.005173 18031 acceptor_pool.cc:254] collecting diagnostics on the listening RPC socket 0.0.0.0:36369 every 8 connection(s)
I20260924 09:59:22.057716 17713 rpc-test.cc:1236] Sleep() min lat: 20691
I20260924 09:59:22.057821 17713 rpc-test.cc:1237] Sleep() mean lat: 20691
I20260924 09:59:22.057874 17713 rpc-test.cc:1238] Sleep() max lat: 20691
I20260924 09:59:22.057906 17713 rpc-test.cc:1239] Sleep() #calls: 1
[       OK ] Parameters/TestRpc.TestRpcHandlerLatencyMetric/SSL_TCP (71 ms)
[ RUN      ] Parameters/TestRpc.TimedOutOnResponseMetricServiceQueue/SSL_TCP
I20260924 09:59:22.091349 18056 acceptor_pool.cc:254] collecting diagnostics on the listening RPC socket 0.0.0.0:42841 every 8 connection(s)
I20260924 09:59:22.091589 18057 acceptor_pool.cc:254] collecting diagnostics on the listening RPC socket 0.0.0.0:42841 every 8 connection(s)
W20260924 09:59:22.153959 18058 rpcz_store.cc:267] Call kudu.rpc_test.CalculatorService.Sleep from 127.0.0.1:36046 (request call id 2) took 20 ms (client timeout 20 ms). Trace:
W20260924 09:59:22.154161 18058 rpcz_store.cc:269] 0924 09:59:22.133445 (+     0us) service_pool.cc:170] Inserting onto call queue
0924 09:59:22.153850 (+ 20405us) service_pool.cc:214] Skipping call since client already timed out
0924 09:59:22.153919 (+    69us) inbound_call.cc:173] Queueing failure response
Metrics: {}
[       OK ] Parameters/TestRpc.TimedOutOnResponseMetricServiceQueue/SSL_TCP (95 ms)
[ RUN      ] Parameters/TestRpc.RpcPendingConnectionsMetric/SSL_TCP
I20260924 09:59:22.163075 18079 acceptor_pool.cc:254] collecting diagnostics on the listening RPC socket 0.0.0.0:45279 every 8 connection(s)
I20260924 09:59:22.163312 18080 acceptor_pool.cc:254] collecting diagnostics on the listening RPC socket 0.0.0.0:45279 every 8 connection(s)
W20260924 09:59:22.165235 18075 negotiation.cc:337] Failed RPC negotiation. Trace:
0924 09:59:22.164647 (+     0us) reactor.cc:625] Submitting negotiation task for server connection from 127.0.0.1:56980 (local address 127.0.0.1:45279)
0924 09:59:22.164788 (+   141us) server_negotiation.cc:206] Beginning negotiation
0924 09:59:22.164792 (+     4us) server_negotiation.cc:399] Waiting for connection header
0924 09:59:22.164922 (+   130us) negotiation.cc:327] Negotiation complete: Network error: Server connection negotiation failed: server connection from 127.0.0.1:56980: BlockingRecv error: recv got EOF from 127.0.0.1:56980 (error 108)
Metrics: {"server-negotiator.queue_time_us":46}
[       OK ] Parameters/TestRpc.RpcPendingConnectionsMetric/SSL_TCP (18 ms)
[ RUN      ] Parameters/TestRpc.TestRpcContextClientDeadline/SSL_TCP
I20260924 09:59:22.195025 18095 acceptor_pool.cc:254] collecting diagnostics on the listening RPC socket 0.0.0.0:34223 every 8 connection(s)
I20260924 09:59:22.195259 18096 acceptor_pool.cc:254] collecting diagnostics on the listening RPC socket 0.0.0.0:34223 every 8 connection(s)
[       OK ] Parameters/TestRpc.TestRpcContextClientDeadline/SSL_TCP (78 ms)
[ RUN      ] Parameters/TestRpc.TestApplicationFeatureFlagUnsupportedServer/SSL_TCP
I20260924 09:59:22.292865 18120 acceptor_pool.cc:254] collecting diagnostics on the listening RPC socket 0.0.0.0:43417 every 8 connection(s)
I20260924 09:59:22.293112 18121 acceptor_pool.cc:254] collecting diagnostics on the listening RPC socket 0.0.0.0:43417 every 8 connection(s)
[       OK ] Parameters/TestRpc.TestApplicationFeatureFlagUnsupportedServer/SSL_TCP (65 ms)
[ RUN      ] Parameters/TestRpc.TestCancellationAsync/SSL_TCP
I20260924 09:59:22.334779 18145 acceptor_pool.cc:254] collecting diagnostics on the listening RPC socket 0.0.0.0:46001 every 8 connection(s)
I20260924 09:59:22.335000 18146 acceptor_pool.cc:254] collecting diagnostics on the listening RPC socket 0.0.0.0:46001 every 8 connection(s)
I20260924 09:59:22.335913 17713 rpc-test.cc:1716] Connecting to 0.0.0.0:46001
I20260924 09:59:22.349637 17713 test_util.cc:268] Using random seed: -1485838297
I20260924 09:59:22.383857 18149 rpc-test-base.h:240] got call: sleep_micros: 500 pattern: 4294967295 num_repetitions: 2097152 sidecar_idx: 0
I20260924 09:59:22.409762 18148 rpc-test-base.h:240] got call: sleep_micros: 500 pattern: 4294967295 num_repetitions: 2097152 sidecar_idx: 0
I20260924 09:59:22.434695 18147 rpc-test-base.h:240] got call: sleep_micros: 500 pattern: 4294967295 num_repetitions: 2097152 sidecar_idx: 0
I20260924 09:59:22.462484 18149 rpc-test-base.h:240] got call: sleep_micros: 500 pattern: 4294967295 num_repetitions: 2097152 sidecar_idx: 0
I20260924 09:59:22.492681 18148 rpc-test-base.h:240] got call: sleep_micros: 500 pattern: 4294967295 num_repetitions: 2097152 sidecar_idx: 0
W20260924 09:59:22.519948 18143 connection.cc:196] Error closing socket: Network error: TlsSocket::Close: Broken pipe
W20260924 09:59:22.522218 18143 connection.cc:441] server connection from 127.0.0.1:36226 torn down before Call kudu.rpc.GenericCalculatorService.SleepWithSidecar from 127.0.0.1:36226 (request call id 7) could send its response
W20260924 09:59:22.531594 18143 connection.cc:441] server connection from 127.0.0.1:36226 torn down before Call kudu.rpc.GenericCalculatorService.SleepWithSidecar from 127.0.0.1:36226 (request call id 8) could send its response
[       OK ] Parameters/TestRpc.TestCancellationAsync/SSL_TCP (212 ms)
[ RUN      ] Parameters/TestRpc.TestPerformanceBySocketType/SSL_TCP
I20260924 09:59:22.555636 18170 acceptor_pool.cc:254] collecting diagnostics on the listening RPC socket 0.0.0.0:45039 every 8 connection(s)
I20260924 09:59:22.555888 18171 acceptor_pool.cc:254] collecting diagnostics on the listening RPC socket 0.0.0.0:45039 every 8 connection(s)
I20260924 09:59:22.556752 17713 rpc-test.cc:1846] Connecting to 0.0.0.0:45039
I20260924 09:59:25.388942 17713 rpc-test.cc:1859] Sending 1024MB via ssl-enabled tcp socket: real 2.821s	user 2.702s	sys 1.944s
I20260924 09:59:28.206738 17713 rpc-test.cc:1859] Sending 1024MB via ssl-enabled tcp socket: real 2.818s	user 2.712s	sys 1.900s
I20260924 09:59:31.052428 17713 rpc-test.cc:1859] Sending 1024MB via ssl-enabled tcp socket: real 2.846s	user 2.896s	sys 1.820s
I20260924 09:59:33.887158 17713 rpc-test.cc:1859] Sending 1024MB via ssl-enabled tcp socket: real 2.835s	user 2.648s	sys 1.991s
I20260924 09:59:36.701339 17713 rpc-test.cc:1859] Sending 1024MB via ssl-enabled tcp socket: real 2.814s	user 2.593s	sys 2.067s
[       OK ] Parameters/TestRpc.TestPerformanceBySocketType/SSL_TCP (14173 ms)
[----------] 20 tests from Parameters/TestRpc (45371 ms total)

[----------] 1 test from Parameters/TestRpcSocketTxRxQueue
[ RUN      ] Parameters/TestRpcSocketTxRxQueue.OverCapacity/0
W20260924 09:59:37.009806 18214 negotiation.cc:337] Failed RPC negotiation. Trace:
0924 09:59:36.727460 (+     0us) reactor.cc:625] Submitting negotiation task for client connection to 0.0.0.0:41773 (local address 127.0.0.1:55676)
0924 09:59:36.727600 (+   140us) negotiation.cc:107] Waiting for socket to connect
0924 09:59:36.727617 (+    17us) client_negotiation.cc:174] Beginning negotiation
0924 09:59:36.727714 (+    97us) client_negotiation.cc:252] Sending NEGOTIATE NegotiatePB request
0924 09:59:37.009359 (+281645us) negotiation.cc:327] Negotiation complete: Network error: Client connection negotiation failed: client connection to 0.0.0.0:41773: BlockingRecv error: recv error from unknown peer: Transport endpoint is not connected (error 107)
Metrics: {"client-negotiator.queue_time_us":33}
W20260924 09:59:37.009992 18223 negotiation.cc:337] Failed RPC negotiation. Trace:
0924 09:59:36.730000 (+     0us) reactor.cc:625] Submitting negotiation task for client connection to 0.0.0.0:41773 (local address 127.0.0.1:55690)
0924 09:59:36.730165 (+   165us) negotiation.cc:107] Waiting for socket to connect
0924 09:59:36.730181 (+    16us) client_negotiation.cc:174] Beginning negotiation
0924 09:59:36.730278 (+    97us) client_negotiation.cc:252] Sending NEGOTIATE NegotiatePB request
0924 09:59:37.009666 (+279388us) negotiation.cc:327] Negotiation complete: Network error: Client connection negotiation failed: client connection to 0.0.0.0:41773: BlockingRecv error: recv error from unknown peer: Transport endpoint is not connected (error 107)
Metrics: {"client-negotiator.queue_time_us":47}
W20260924 09:59:37.010078 18187 negotiation.cc:337] Failed RPC negotiation. Trace:
0924 09:59:36.720644 (+     0us) reactor.cc:625] Submitting negotiation task for client connection to 0.0.0.0:41773 (local address 127.0.0.1:55654)
0924 09:59:36.720800 (+   156us) negotiation.cc:107] Waiting for socket to connect
0924 09:59:36.720815 (+    15us) client_negotiation.cc:174] Beginning negotiation
0924 09:59:36.720922 (+   107us) client_negotiation.cc:252] Sending NEGOTIATE NegotiatePB request
0924 09:59:37.009443 (+288521us) negotiation.cc:327] Negotiation complete: Network error: Client connection negotiation failed: client connection to 0.0.0.0:41773: BlockingRecv error: recv error from unknown peer: Transport endpoint is not connected (error 107)
Metrics: {"client-negotiator.queue_time_us":42}
W20260924 09:59:37.009852 18232 negotiation.cc:337] Failed RPC negotiation. Trace:
0924 09:59:36.732654 (+     0us) reactor.cc:625] Submitting negotiation task for client connection to 0.0.0.0:41773 (local address 127.0.0.1:55692)
0924 09:59:36.732799 (+   145us) negotiation.cc:107] Waiting for socket to connect
0924 09:59:36.732814 (+    15us) client_negotiation.cc:174] Beginning negotiation
0924 09:59:36.732910 (+    96us) client_negotiation.cc:252] Sending NEGOTIATE NegotiatePB request
0924 09:59:37.009604 (+276694us) negotiation.cc:327] Negotiation complete: Network error: Client connection negotiation failed: client connection to 0.0.0.0:41773: BlockingRecv error: recv error from unknown peer: Transport endpoint is not connected (error 107)
Metrics: {"client-negotiator.queue_time_us":41}
W20260924 09:59:37.009817 18196 negotiation.cc:337] Failed RPC negotiation. Trace:
0924 09:59:36.722964 (+     0us) reactor.cc:625] Submitting negotiation task for client connection to 0.0.0.0:41773 (local address 127.0.0.1:55656)
0924 09:59:36.723115 (+   151us) negotiation.cc:107] Waiting for socket to connect
0924 09:59:36.723132 (+    17us) client_negotiation.cc:174] Beginning negotiation
0924 09:59:36.723226 (+    94us) client_negotiation.cc:252] Sending NEGOTIATE NegotiatePB request
0924 09:59:37.009375 (+286149us) negotiation.cc:327] Negotiation complete: Network error: Client connection negotiation failed: client connection to 0.0.0.0:41773: BlockingRecv error: recv error from unknown peer: Transport endpoint is not connected (error 107)
Metrics: {"client-negotiator.queue_time_us":43}
W20260924 09:59:37.010797 18205 negotiation.cc:337] Failed RPC negotiation. Trace:
0924 09:59:36.725102 (+     0us) reactor.cc:625] Submitting negotiation task for client connection to 0.0.0.0:41773 (local address 127.0.0.1:55672)
0924 09:59:36.725255 (+   153us) negotiation.cc:107] Waiting for socket to connect
0924 09:59:36.725273 (+    18us) client_negotiation.cc:174] Beginning negotiation
0924 09:59:36.725380 (+   107us) client_negotiation.cc:252] Sending NEGOTIATE NegotiatePB request
0924 09:59:37.009378 (+283998us) negotiation.cc:327] Negotiation complete: Network error: Client connection negotiation failed: client connection to 0.0.0.0:41773: BlockingRecv error: recv error from unknown peer: Transport endpoint is not connected (error 107)
Metrics: {"client-negotiator.queue_time_us":30}
[       OK ] Parameters/TestRpcSocketTxRxQueue.OverCapacity/0 (1067 ms)
[----------] 1 test from Parameters/TestRpcSocketTxRxQueue (1067 ms total)

[----------] Global test environment tear-down
[==========] 21 tests from 2 test suites ran. (46441 ms total)
[  PASSED  ] 20 tests.
[  FAILED  ] 1 test, listed below:
[  FAILED  ] Parameters/TestRpc.TestCallWithChainCertAndChainCA/SSL_TCP, where GetParam() = (true, false)

 1 FAILED TEST