Diagnosed failure
Parameters/TestRpc.TestCallWithChainCertAndChainCA/SSL_UnixSocket: /data0/somelongdirectorytoavoidrpathissues/src/kudu/src/kudu/rpc/rpc-test.cc:270: Failure
Failed
Bad status: Runtime error: could not verify certificate chain (error with cert: subject=CN = localhost, ST = sadfjas, C = AS, emailAddress = sdflkdsajf, O = lskdfjlsad, OU = sldfkja, issuer=C = AS, ST = ASDfkjdhf, L = lskdjf, O = saldfja, OU = skdjf, CN = localhost, emailAddress = sadjflkadsj): : certificate has expired
Google Test trace:
/data0/somelongdirectorytoavoidrpathissues/src/kudu/src/kudu/rpc/rpc-test.cc:267: Connecting to unix:/tmp/dist-test-taskyGY3z4/test-tmp/rpc-test-13868da3541b4b70964db9d18a619eaf.sock
I20260929 11:25:53.089612 5493 test_util.cc:175] -----------------------------------------------
I20260929 11:25:53.089707 5493 test_util.cc:176] Had fatal failures, leaving test files at /tmp/dist-test-taskyGY3z4/test-tmp/rpc-test.6.Parameters_TestRpc.TestCallWithChainCertAndChainCA_SSL_UnixSocket.1790681152955479-5493-0
Full log
Note: This is test shard 7 of 8.
[==========] Running 21 tests from 2 test suites.
[----------] Global test environment set-up.
[----------] 20 tests from Parameters/TestRpc
[ RUN ] Parameters/TestRpc.TestMessengerCreateDestroy/SSL_UnixSocket
WARNING: Logging before InitGoogleLogging() is written to STDERR
I20260929 11:25:53.009534 5493 rpc-test.cc:169] started messenger TestCreateDestroy
[ OK ] Parameters/TestRpc.TestMessengerCreateDestroy/SSL_UnixSocket (37 ms)
[ RUN ] Parameters/TestRpc.TestNegotiationDeadlock/SSL_UnixSocket
I20260929 11:25:53.041615 5513 acceptor_pool.cc:254] collecting diagnostics on the listening RPC socket unix:/tmp/dist-test-taskyGY3z4/test-tmp/rpc-test-cb856e0999f144efb486e42a366b77d8.sock every 8 connection(s)
I20260929 11:25:53.041970 5514 acceptor_pool.cc:254] collecting diagnostics on the listening RPC socket unix:/tmp/dist-test-taskyGY3z4/test-tmp/rpc-test-cb856e0999f144efb486e42a366b77d8.sock every 8 connection(s)
[ OK ] Parameters/TestRpc.TestNegotiationDeadlock/SSL_UnixSocket (48 ms)
[ RUN ] Parameters/TestRpc.TestCallWithChainCertAndChainCA/SSL_UnixSocket
I20260929 11:25:53.077653 5529 acceptor_pool.cc:254] collecting diagnostics on the listening RPC socket unix:/tmp/dist-test-taskyGY3z4/test-tmp/rpc-test-13868da3541b4b70964db9d18a619eaf.sock every 8 connection(s)
I20260929 11:25:53.078001 5530 acceptor_pool.cc:254] collecting diagnostics on the listening RPC socket unix:/tmp/dist-test-taskyGY3z4/test-tmp/rpc-test-13868da3541b4b70964db9d18a619eaf.sock every 8 connection(s)
/data0/somelongdirectorytoavoidrpathissues/src/kudu/src/kudu/rpc/rpc-test.cc:270: Failure
Failed
Bad status: Runtime error: could not verify certificate chain (error with cert: subject=CN = localhost, ST = sadfjas, C = AS, emailAddress = sdflkdsajf, O = lskdfjlsad, OU = sldfkja, issuer=C = AS, ST = ASDfkjdhf, L = lskdjf, O = saldfja, OU = skdjf, CN = localhost, emailAddress = sadjflkadsj): : certificate has expired
Google Test trace:
/data0/somelongdirectorytoavoidrpathissues/src/kudu/src/kudu/rpc/rpc-test.cc:267: Connecting to unix:/tmp/dist-test-taskyGY3z4/test-tmp/rpc-test-13868da3541b4b70964db9d18a619eaf.sock
I20260929 11:25:53.089612 5493 test_util.cc:175] -----------------------------------------------
I20260929 11:25:53.089707 5493 test_util.cc:176] Had fatal failures, leaving test files at /tmp/dist-test-taskyGY3z4/test-tmp/rpc-test.6.Parameters_TestRpc.TestCallWithChainCertAndChainCA_SSL_UnixSocket.1790681152955479-5493-0
[ FAILED ] Parameters/TestRpc.TestCallWithChainCertAndChainCA/SSL_UnixSocket, where GetParam() = (true, true) (27 ms)
[ RUN ] Parameters/TestRpc.TestCallWithPasswordProtectedKey/SSL_UnixSocket
I20260929 11:25:53.106032 5554 acceptor_pool.cc:254] collecting diagnostics on the listening RPC socket unix:/tmp/dist-test-taskyGY3z4/test-tmp/rpc-test-90df06982b554073b0f18ea0f70a3f55.sock every 8 connection(s)
I20260929 11:25:53.106328 5555 acceptor_pool.cc:254] collecting diagnostics on the listening RPC socket unix:/tmp/dist-test-taskyGY3z4/test-tmp/rpc-test-90df06982b554073b0f18ea0f70a3f55.sock every 8 connection(s)
W20260929 11:25:53.137413 5551 connection.cc:196] Error closing socket: Network error: TlsSocket::Close: Broken pipe
[ OK ] Parameters/TestRpc.TestCallWithPasswordProtectedKey/SSL_UnixSocket (51 ms)
[ RUN ] Parameters/TestRpc.TestCallToBadServer/SSL_UnixSocket
I20260929 11:25:53.160887 5493 rpc-test.cc:394] Status: Network error: Client connection negotiation failed: client connection to 0.0.0.0:0: connect: Connection refused (error 111)
I20260929 11:25:53.161523 5493 rpc-test.cc:394] Status: Network error: Client connection negotiation failed: client connection to 0.0.0.0:0: connect: Connection refused (error 111)
I20260929 11:25:53.162104 5493 rpc-test.cc:394] Status: Network error: Client connection negotiation failed: client connection to 0.0.0.0:0: connect: Connection refused (error 111)
I20260929 11:25:53.162616 5493 rpc-test.cc:394] Status: Network error: Client connection negotiation failed: client connection to 0.0.0.0:0: connect: Connection refused (error 111)
I20260929 11:25:53.163189 5493 rpc-test.cc:394] Status: Network error: Client connection negotiation failed: client connection to 0.0.0.0:0: connect: Connection refused (error 111)
[ OK ] Parameters/TestRpc.TestCallToBadServer/SSL_UnixSocket (23 ms)
[ RUN ] Parameters/TestRpc.TestWrongService/SSL_UnixSocket
I20260929 11:25:53.179239 5589 acceptor_pool.cc:254] collecting diagnostics on the listening RPC socket unix:/tmp/dist-test-taskyGY3z4/test-tmp/rpc-test-1e95ddeeff0c43d68f1f7860521a1d30.sock every 8 connection(s)
I20260929 11:25:53.179452 5590 acceptor_pool.cc:254] collecting diagnostics on the listening RPC socket unix:/tmp/dist-test-taskyGY3z4/test-tmp/rpc-test-1e95ddeeff0c43d68f1f7860521a1d30.sock every 8 connection(s)
I20260929 11:25:53.203547 5586 messenger.cc:345] service WrongServiceName not registered on TestServer
W20260929 11:25:53.205075 5586 connection.cc:196] Error closing socket: Network error: TlsSocket::Close: Broken pipe
[ OK ] Parameters/TestRpc.TestWrongService/SSL_UnixSocket (43 ms)
[ RUN ] Parameters/TestRpc.TestConnectionKeepalive/SSL_UnixSocket
I20260929 11:25:53.228766 5612 acceptor_pool.cc:254] collecting diagnostics on the listening RPC socket unix:/tmp/dist-test-taskyGY3z4/test-tmp/rpc-test-e5792efcedbe4d8193fad6bb404733a5.sock every 8 connection(s)
I20260929 11:25:53.229013 5613 acceptor_pool.cc:254] collecting diagnostics on the listening RPC socket unix:/tmp/dist-test-taskyGY3z4/test-tmp/rpc-test-e5792efcedbe4d8193fad6bb404733a5.sock every 8 connection(s)
I20260929 11:25:53.230283 5493 rpc-test.cc:488] Connecting to unix:/tmp/dist-test-taskyGY3z4/test-tmp/rpc-test-e5792efcedbe4d8193fad6bb404733a5.sock
W20260929 11:25:53.712309 5625 connection.cc:196] Error closing socket: Network error: TlsSocket::Close: Broken pipe
[ OK ] Parameters/TestRpc.TestConnectionKeepalive/SSL_UnixSocket (1056 ms)
[ RUN ] Parameters/TestRpc.TestClientConnectionMetrics/SSL_UnixSocket
I20260929 11:25:54.278368 5637 acceptor_pool.cc:254] collecting diagnostics on the listening RPC socket unix:/tmp/dist-test-taskyGY3z4/test-tmp/rpc-test-74ad9a64aa6847cd9a87f91e4862a421.sock every 8 connection(s)
I20260929 11:25:54.278601 5638 acceptor_pool.cc:254] collecting diagnostics on the listening RPC socket unix:/tmp/dist-test-taskyGY3z4/test-tmp/rpc-test-74ad9a64aa6847cd9a87f91e4862a421.sock every 8 connection(s)
I20260929 11:25:54.279548 5493 rpc-test.cc:569] Connecting to unix:/tmp/dist-test-taskyGY3z4/test-tmp/rpc-test-74ad9a64aa6847cd9a87f91e4862a421.sock
W20260929 11:26:15.583563 5634 connection.cc:196] Error closing socket: Network error: TlsSocket::Close: Broken pipe
[ OK ] Parameters/TestRpc.TestClientConnectionMetrics/SSL_UnixSocket (21324 ms)
[ RUN ] Parameters/TestRpc.TestCredentialsPolicy/SSL_UnixSocket
I20260929 11:26:15.625859 5660 acceptor_pool.cc:254] collecting diagnostics on the listening RPC socket unix:/tmp/dist-test-taskyGY3z4/test-tmp/rpc-test-423925398de442c6b2b6745552f9b8d7.sock every 8 connection(s)
I20260929 11:26:15.626152 5661 acceptor_pool.cc:254] collecting diagnostics on the listening RPC socket unix:/tmp/dist-test-taskyGY3z4/test-tmp/rpc-test-423925398de442c6b2b6745552f9b8d7.sock every 8 connection(s)
I20260929 11:26:15.627154 5493 rpc-test.cc:700] Connecting to unix:/tmp/dist-test-taskyGY3z4/test-tmp/rpc-test-423925398de442c6b2b6745552f9b8d7.sock
W20260929 11:26:15.650273 5659 connection.cc:196] Error closing socket: Network error: TlsSocket::Close: Broken pipe
[ OK ] Parameters/TestRpc.TestCredentialsPolicy/SSL_UnixSocket (70 ms)
[ RUN ] Parameters/TestRpc.TestCallLongerThanKeepalive/SSL_UnixSocket
I20260929 11:26:15.671285 5685 acceptor_pool.cc:254] collecting diagnostics on the listening RPC socket unix:/tmp/dist-test-taskyGY3z4/test-tmp/rpc-test-fa81db5fcc2745f4a0514091f2a0afd8.sock every 8 connection(s)
I20260929 11:26:15.671535 5686 acceptor_pool.cc:254] collecting diagnostics on the listening RPC socket unix:/tmp/dist-test-taskyGY3z4/test-tmp/rpc-test-fa81db5fcc2745f4a0514091f2a0afd8.sock every 8 connection(s)
I20260929 11:26:15.694519 5689 rpc-test-base.h:222] got call: sleep_micros: 3000000 deferred: true
I20260929 11:26:18.696318 5689 rpcz_store.cc:275] Call kudu.rpc.GenericCalculatorService.Sleep from unix:<unnamed> (request call id 0) took 3001 ms. Trace:
I20260929 11:26:18.696532 5689 rpcz_store.cc:276] 0929 11:26:15.694405 (+ 0us) service_pool.cc:170] Inserting onto call queue
0929 11:26:15.694475 (+ 70us) service_pool.cc:227] Handling call
0929 11:26:18.696268 (+3001793us) inbound_call.cc:173] Queueing success response
Metrics: {}
[ OK ] Parameters/TestRpc.TestCallLongerThanKeepalive/SSL_UnixSocket (3041 ms)
[ RUN ] Parameters/TestRpc.TestRpcSidecar/SSL_UnixSocket
I20260929 11:26:18.714802 5710 acceptor_pool.cc:254] collecting diagnostics on the listening RPC socket unix:/tmp/dist-test-taskyGY3z4/test-tmp/rpc-test-840045ab40f5425fae3187843e3cc7db.sock every 8 connection(s)
I20260929 11:26:18.715051 5711 acceptor_pool.cc:254] collecting diagnostics on the listening RPC socket unix:/tmp/dist-test-taskyGY3z4/test-tmp/rpc-test-840045ab40f5425fae3187843e3cc7db.sock every 8 connection(s)
W20260929 11:26:18.818387 5707 connection.cc:196] Error closing socket: Network error: TlsSocket::Close: Broken pipe
[ OK ] Parameters/TestRpc.TestRpcSidecar/SSL_UnixSocket (118 ms)
[ RUN ] Parameters/TestRpc.TestRpcSidecarLimits/SSL_UnixSocket
I20260929 11:26:20.859171 5735 acceptor_pool.cc:254] collecting diagnostics on the listening RPC socket unix:/tmp/dist-test-taskyGY3z4/test-tmp/rpc-test-bbcd5fdae1b04b8db482483e6e5479bd.sock every 8 connection(s)
I20260929 11:26:20.859473 5736 acceptor_pool.cc:254] collecting diagnostics on the listening RPC socket unix:/tmp/dist-test-taskyGY3z4/test-tmp/rpc-test-bbcd5fdae1b04b8db482483e6e5479bd.sock every 8 connection(s)
W20260929 11:26:20.876199 5493 serialization.cc:72] Serialized kudu.rpc_test.PushStringsRequestPB (2147483654 bytes) is larger than the maximum configured RPC message size (52428800 bytes). Sending anyway, but peer may reject the data.
W20260929 11:26:20.883636 5732 connection.cc:535] server connection from unix:<unnamed> recv error: Network error: RPC frame had a length of 2147483714, but we only support messages up to 52428800 bytes long.
W20260929 11:26:20.883821 5732 connection.cc:158] shutting down server connection from unix:<unnamed> with pending inbound data: 4/2147483714 bytes received; last active 0 ns ago: status Network error: RPC frame had a length of 2147483714, but we only support messages up to 52428800 bytes long.
W20260929 11:26:20.884307 5748 connection.cc:196] Error closing socket: Network error: TlsSocket::Close: Broken pipe
I20260929 11:26:20.912774 5760 acceptor_pool.cc:254] collecting diagnostics on the listening RPC socket unix:/tmp/dist-test-taskyGY3z4/test-tmp/rpc-test-bbcd5fdae1b04b8db482483e6e5479bd.sock every 8 connection(s)
I20260929 11:26:20.913511 5761 acceptor_pool.cc:254] collecting diagnostics on the listening RPC socket unix:/tmp/dist-test-taskyGY3z4/test-tmp/rpc-test-bbcd5fdae1b04b8db482483e6e5479bd.sock every 8 connection(s)
W20260929 11:26:26.783975 5757 connection.cc:577] server connection from unix:<unnamed>: received bad data: 'Corruption: Invalid packet: message had a length of 2147483710, but we only support messages up to 2147483647 bytes
'
W20260929 11:26:26.784693 5773 connection.cc:196] Error closing socket: Network error: TlsSocket::Close: Broken pipe
[ OK ] Parameters/TestRpc.TestRpcSidecarLimits/SSL_UnixSocket (8435 ms)
[ RUN ] Parameters/TestRpc.TestCallTimeoutDoesntAffectNegotiation/SSL_UnixSocket
I20260929 11:26:27.285640 5785 acceptor_pool.cc:254] collecting diagnostics on the listening RPC socket unix:/tmp/dist-test-taskyGY3z4/test-tmp/rpc-test-0f605f64b48c49549a6ff06bbafddb05.sock every 8 connection(s)
I20260929 11:26:27.285944 5786 acceptor_pool.cc:254] collecting diagnostics on the listening RPC socket unix:/tmp/dist-test-taskyGY3z4/test-tmp/rpc-test-0f605f64b48c49549a6ff06bbafddb05.sock every 8 connection(s)
W20260929 11:26:27.327111 5781 negotiation.cc:266] Injecting 500ms delay in negotiation
I20260929 11:26:27.377488 5493 rpc-test-base.h:595] status: Timed out: connection negotiation to unix:/tmp/dist-test-taskyGY3z4/test-tmp/rpc-test-0f605f64b48c49549a6ff06bbafddb05.sock for RPC Sleep timed out after 0.050s (ON_OUTBOUND_QUEUE), seconds elapsed: 0.0509809
[ OK ] Parameters/TestRpc.TestCallTimeoutDoesntAffectNegotiation/SSL_UnixSocket (579 ms)
[ RUN ] Parameters/TestRpc.TestRpcHandlerLatencyMetric/SSL_UnixSocket
I20260929 11:26:27.864442 5810 acceptor_pool.cc:254] collecting diagnostics on the listening RPC socket unix:/tmp/dist-test-taskyGY3z4/test-tmp/rpc-test-6b005b21226743d99e971db672df0674.sock every 8 connection(s)
I20260929 11:26:27.864684 5811 acceptor_pool.cc:254] collecting diagnostics on the listening RPC socket unix:/tmp/dist-test-taskyGY3z4/test-tmp/rpc-test-6b005b21226743d99e971db672df0674.sock every 8 connection(s)
I20260929 11:26:27.918138 5493 rpc-test.cc:1236] Sleep() min lat: 20650
I20260929 11:26:27.918291 5493 rpc-test.cc:1237] Sleep() mean lat: 20650
I20260929 11:26:27.918352 5493 rpc-test.cc:1238] Sleep() max lat: 20650
I20260929 11:26:27.918372 5493 rpc-test.cc:1239] Sleep() #calls: 1
[ OK ] Parameters/TestRpc.TestRpcHandlerLatencyMetric/SSL_UnixSocket (85 ms)
[ RUN ] Parameters/TestRpc.TimedOutOnResponseMetricServiceQueue/SSL_UnixSocket
I20260929 11:26:27.952567 5836 acceptor_pool.cc:254] collecting diagnostics on the listening RPC socket unix:/tmp/dist-test-taskyGY3z4/test-tmp/rpc-test-a061ccbdcca14c16a77e92b5baea117f.sock every 8 connection(s)
I20260929 11:26:27.952806 5837 acceptor_pool.cc:254] collecting diagnostics on the listening RPC socket unix:/tmp/dist-test-taskyGY3z4/test-tmp/rpc-test-a061ccbdcca14c16a77e92b5baea117f.sock every 8 connection(s)
W20260929 11:26:28.013010 5838 rpcz_store.cc:267] Call kudu.rpc_test.CalculatorService.Sleep from unix:<unnamed> (request call id 2) took 20 ms (client timeout 20 ms). Trace:
W20260929 11:26:28.013190 5838 rpcz_store.cc:269] 0929 11:26:27.992656 (+ 0us) service_pool.cc:170] Inserting onto call queue
0929 11:26:28.012930 (+ 20274us) service_pool.cc:214] Skipping call since client already timed out
0929 11:26:28.012990 (+ 60us) inbound_call.cc:173] Queueing failure response
Metrics: {}
W20260929 11:26:28.014385 5833 connection.cc:196] Error closing socket: Network error: TlsSocket::Close: Broken pipe
[ OK ] Parameters/TestRpc.TimedOutOnResponseMetricServiceQueue/SSL_UnixSocket (95 ms)
[ RUN ] Parameters/TestRpc.RpcPendingConnectionsMetric/SSL_UnixSocket
I20260929 11:26:28.023905 5859 acceptor_pool.cc:254] collecting diagnostics on the listening RPC socket 0.0.0.0:37099 every 8 connection(s)
I20260929 11:26:28.024142 5860 acceptor_pool.cc:254] collecting diagnostics on the listening RPC socket 0.0.0.0:37099 every 8 connection(s)
W20260929 11:26:28.026336 5855 negotiation.cc:337] Failed RPC negotiation. Trace:
0929 11:26:28.025593 (+ 0us) reactor.cc:625] Submitting negotiation task for server connection from 127.0.0.1:52990 (local address 127.0.0.1:37099)
0929 11:26:28.025778 (+ 185us) server_negotiation.cc:206] Beginning negotiation
0929 11:26:28.025782 (+ 4us) server_negotiation.cc:399] Waiting for connection header
0929 11:26:28.025938 (+ 156us) negotiation.cc:327] Negotiation complete: Network error: Server connection negotiation failed: server connection from 127.0.0.1:52990: BlockingRecv error: recv got EOF from 127.0.0.1:52990 (error 108)
Metrics: {"server-negotiator.queue_time_us":58}
[ OK ] Parameters/TestRpc.RpcPendingConnectionsMetric/SSL_UnixSocket (19 ms)
[ RUN ] Parameters/TestRpc.TestRpcContextClientDeadline/SSL_UnixSocket
I20260929 11:26:28.049692 5875 acceptor_pool.cc:254] collecting diagnostics on the listening RPC socket unix:/tmp/dist-test-taskyGY3z4/test-tmp/rpc-test-d9c5d30d080047b6b0dd8147e04c8bd7.sock every 8 connection(s)
I20260929 11:26:28.049875 5876 acceptor_pool.cc:254] collecting diagnostics on the listening RPC socket unix:/tmp/dist-test-taskyGY3z4/test-tmp/rpc-test-d9c5d30d080047b6b0dd8147e04c8bd7.sock every 8 connection(s)
[ OK ] Parameters/TestRpc.TestRpcContextClientDeadline/SSL_UnixSocket (60 ms)
[ RUN ] Parameters/TestRpc.TestApplicationFeatureFlagUnsupportedServer/SSL_UnixSocket
I20260929 11:26:28.122402 5900 acceptor_pool.cc:254] collecting diagnostics on the listening RPC socket unix:/tmp/dist-test-taskyGY3z4/test-tmp/rpc-test-7379430b0e4c444bba4a1323d7d465ce.sock every 8 connection(s)
I20260929 11:26:28.122605 5901 acceptor_pool.cc:254] collecting diagnostics on the listening RPC socket unix:/tmp/dist-test-taskyGY3z4/test-tmp/rpc-test-7379430b0e4c444bba4a1323d7d465ce.sock every 8 connection(s)
[ OK ] Parameters/TestRpc.TestApplicationFeatureFlagUnsupportedServer/SSL_UnixSocket (52 ms)
[ RUN ] Parameters/TestRpc.TestCancellationAsync/SSL_UnixSocket
I20260929 11:26:28.175427 5925 acceptor_pool.cc:254] collecting diagnostics on the listening RPC socket unix:/tmp/dist-test-taskyGY3z4/test-tmp/rpc-test-c88956b3e89c49a5975bb8c333e3a0a2.sock every 8 connection(s)
I20260929 11:26:28.175705 5926 acceptor_pool.cc:254] collecting diagnostics on the listening RPC socket unix:/tmp/dist-test-taskyGY3z4/test-tmp/rpc-test-c88956b3e89c49a5975bb8c333e3a0a2.sock every 8 connection(s)
I20260929 11:26:28.176535 5493 rpc-test.cc:1716] Connecting to unix:/tmp/dist-test-taskyGY3z4/test-tmp/rpc-test-c88956b3e89c49a5975bb8c333e3a0a2.sock
I20260929 11:26:28.190415 5493 test_util.cc:268] Using random seed: 1948305594
I20260929 11:26:28.226723 5929 rpc-test-base.h:240] got call: sleep_micros: 500 pattern: 4294967295 num_repetitions: 2097152 sidecar_idx: 0
I20260929 11:26:28.246939 5928 rpc-test-base.h:240] got call: sleep_micros: 500 pattern: 4294967295 num_repetitions: 2097152 sidecar_idx: 0
I20260929 11:26:28.276054 5927 rpc-test-base.h:240] got call: sleep_micros: 500 pattern: 4294967295 num_repetitions: 2097152 sidecar_idx: 0
I20260929 11:26:28.315230 5927 rpc-test-base.h:240] got call: sleep_micros: 500 pattern: 4294967295 num_repetitions: 2097152 sidecar_idx: 0
I20260929 11:26:28.341653 5928 rpc-test-base.h:240] got call: sleep_micros: 500 pattern: 4294967295 num_repetitions: 2097152 sidecar_idx: 0
I20260929 11:26:28.369948 5927 rpc-test-base.h:240] got call: sleep_micros: 500 pattern: 4294967295 num_repetitions: 2097152 sidecar_idx: 0
I20260929 11:26:28.398712 5929 rpc-test-base.h:240] got call: sleep_micros: 500 pattern: 4294967295 num_repetitions: 2097152 sidecar_idx: 0
W20260929 11:26:28.404217 5922 connection.cc:196] Error closing socket: Network error: TlsSocket::Close: Broken pipe
W20260929 11:26:28.429669 5922 connection.cc:441] server connection from unix:<unnamed> torn down before Call kudu.rpc.GenericCalculatorService.SleepWithSidecar from unix:<unnamed> (request call id 8) could send its response
W20260929 11:26:28.445794 5922 connection.cc:441] server connection from unix:<unnamed> torn down before Call kudu.rpc.GenericCalculatorService.SleepWithSidecar from unix:<unnamed> (request call id 9) could send its response
[ OK ] Parameters/TestRpc.TestCancellationAsync/SSL_UnixSocket (296 ms)
[ RUN ] Parameters/TestRpc.TestPerformanceBySocketType/SSL_UnixSocket
I20260929 11:26:28.487813 5950 acceptor_pool.cc:254] collecting diagnostics on the listening RPC socket unix:/tmp/dist-test-taskyGY3z4/test-tmp/rpc-test-182aac650f4e49019921a7029a66919e.sock every 8 connection(s)
I20260929 11:26:28.488027 5951 acceptor_pool.cc:254] collecting diagnostics on the listening RPC socket unix:/tmp/dist-test-taskyGY3z4/test-tmp/rpc-test-182aac650f4e49019921a7029a66919e.sock every 8 connection(s)
I20260929 11:26:28.488920 5493 rpc-test.cc:1846] Connecting to unix:/tmp/dist-test-taskyGY3z4/test-tmp/rpc-test-182aac650f4e49019921a7029a66919e.sock
I20260929 11:26:31.830878 5493 rpc-test.cc:1859] Sending 1024MB via ssl-enabled unix socket: real 3.321s user 3.325s sys 2.304s
I20260929 11:26:35.024712 5493 rpc-test.cc:1859] Sending 1024MB via ssl-enabled unix socket: real 3.194s user 3.149s sys 2.239s
I20260929 11:26:38.265027 5493 rpc-test.cc:1859] Sending 1024MB via ssl-enabled unix socket: real 3.240s user 3.220s sys 2.273s
I20260929 11:26:41.457469 5493 rpc-test.cc:1859] Sending 1024MB via ssl-enabled unix socket: real 3.192s user 3.165s sys 2.198s
I20260929 11:26:44.711911 5493 rpc-test.cc:1859] Sending 1024MB via ssl-enabled unix socket: real 3.254s user 3.123s sys 2.352s
W20260929 11:26:44.714335 5947 connection.cc:196] Error closing socket: Network error: TlsSocket::Close: Broken pipe
[ OK ] Parameters/TestRpc.TestPerformanceBySocketType/SSL_UnixSocket (16271 ms)
[----------] 20 tests from Parameters/TestRpc (51745 ms total)
[----------] 1 test from Parameters/TestRpcSocketTxRxQueue
[ RUN ] Parameters/TestRpcSocketTxRxQueue.AcceptorRxQueueSizeMetric/0
I20260929 11:26:44.725564 5975 acceptor_pool.cc:254] collecting diagnostics on the listening RPC socket 0.0.0.0:35391 every 1 connection(s)
I20260929 11:26:44.725823 5976 acceptor_pool.cc:254] collecting diagnostics on the listening RPC socket 0.0.0.0:35391 every 1 connection(s)
W20260929 11:26:44.727556 5971 negotiation.cc:337] Failed RPC negotiation. Trace:
0929 11:26:44.727152 (+ 0us) reactor.cc:625] Submitting negotiation task for server connection from 127.0.0.1:35988 (local address 127.0.0.1:35391)
0929 11:26:44.727314 (+ 162us) server_negotiation.cc:206] Beginning negotiation
0929 11:26:44.727318 (+ 4us) server_negotiation.cc:399] Waiting for connection header
0929 11:26:44.727445 (+ 127us) negotiation.cc:327] Negotiation complete: Network error: Server connection negotiation failed: server connection from 127.0.0.1:35988: BlockingRecv error: recv got EOF from 127.0.0.1:35988 (error 108)
Metrics: {"server-negotiator.queue_time_us":54}
[ OK ] Parameters/TestRpcSocketTxRxQueue.AcceptorRxQueueSizeMetric/0 (11 ms)
[----------] 1 test from Parameters/TestRpcSocketTxRxQueue (11 ms total)
[----------] Global test environment tear-down
[==========] 21 tests from 2 test suites ran. (51756 ms total)
[ PASSED ] 20 tests.
[ FAILED ] 1 test, listed below:
[ FAILED ] Parameters/TestRpc.TestCallWithChainCertAndChainCA/SSL_UnixSocket, where GetParam() = (true, true)
1 FAILED TEST