Diagnosed failure

Parameters/TestRpc.TestCallWithChainCertAndChainCA/SSL_TCP: /data0/somelongdirectorytoavoidrpathissues/src/kudu/src/kudu/rpc/rpc-test.cc:270: Failure
Failed
Bad status: Runtime error: could not verify certificate chain (error with cert: subject=CN = localhost, ST = sadfjas, C = AS, emailAddress = sdflkdsajf, O = lskdfjlsad, OU = sldfkja, issuer=C = AS, ST = ASDfkjdhf, L = lskdjf, O = saldfja, OU = skdjf, CN = localhost, emailAddress = sadjflkadsj): : certificate has expired
Google Test trace:
/data0/somelongdirectorytoavoidrpathissues/src/kudu/src/kudu/rpc/rpc-test.cc:267: Connecting to 0.0.0.0:38799
I20260927 18:37:57.892377 17894 test_util.cc:175] -----------------------------------------------
I20260927 18:37:57.892436 17894 test_util.cc:176] Had fatal failures, leaving test files at /tmp/dist-test-taskIaJNF1/test-tmp/rpc-test.5.Parameters_TestRpc.TestCallWithChainCertAndChainCA_SSL_TCP.1790534277798485-17894-0

Full log

Note: This is test shard 6 of 8.
[==========] Running 21 tests from 2 test suites.
[----------] Global test environment set-up.
[----------] 20 tests from Parameters/TestRpc
[ RUN      ] Parameters/TestRpc.TestMessengerCreateDestroy/SSL_TCP
WARNING: Logging before InitGoogleLogging() is written to STDERR
I20260927 18:37:57.826658 17894 rpc-test.cc:169] started messenger TestCreateDestroy
[       OK ] Parameters/TestRpc.TestMessengerCreateDestroy/SSL_TCP (23 ms)
[ RUN      ] Parameters/TestRpc.TestNegotiationDeadlock/SSL_TCP
I20260927 18:37:57.857925 17915 acceptor_pool.cc:254] collecting diagnostics on the listening RPC socket 0.0.0.0:46425 every 8 connection(s)
I20260927 18:37:57.857925 17914 acceptor_pool.cc:254] collecting diagnostics on the listening RPC socket 0.0.0.0:46425 every 8 connection(s)
[       OK ] Parameters/TestRpc.TestNegotiationDeadlock/SSL_TCP (40 ms)
[ RUN      ] Parameters/TestRpc.TestCallWithChainCertAndChainCA/SSL_TCP
I20260927 18:37:57.886907 17930 acceptor_pool.cc:254] collecting diagnostics on the listening RPC socket 0.0.0.0:38799 every 8 connection(s)
I20260927 18:37:57.886922 17931 acceptor_pool.cc:254] collecting diagnostics on the listening RPC socket 0.0.0.0:38799 every 8 connection(s)
/data0/somelongdirectorytoavoidrpathissues/src/kudu/src/kudu/rpc/rpc-test.cc:270: Failure
Failed
Bad status: Runtime error: could not verify certificate chain (error with cert: subject=CN = localhost, ST = sadfjas, C = AS, emailAddress = sdflkdsajf, O = lskdfjlsad, OU = sldfkja, issuer=C = AS, ST = ASDfkjdhf, L = lskdjf, O = saldfja, OU = skdjf, CN = localhost, emailAddress = sadjflkadsj): : certificate has expired
Google Test trace:
/data0/somelongdirectorytoavoidrpathissues/src/kudu/src/kudu/rpc/rpc-test.cc:267: Connecting to 0.0.0.0:38799
I20260927 18:37:57.892377 17894 test_util.cc:175] -----------------------------------------------
I20260927 18:37:57.892436 17894 test_util.cc:176] Had fatal failures, leaving test files at /tmp/dist-test-taskIaJNF1/test-tmp/rpc-test.5.Parameters_TestRpc.TestCallWithChainCertAndChainCA_SSL_TCP.1790534277798485-17894-0
[  FAILED  ] Parameters/TestRpc.TestCallWithChainCertAndChainCA/SSL_TCP, where GetParam() = (true, false) (22 ms)
[ RUN      ] Parameters/TestRpc.TestCallWithPasswordProtectedKey/SSL_TCP
I20260927 18:37:57.897542 17955 acceptor_pool.cc:254] collecting diagnostics on the listening RPC socket 0.0.0.0:43229 every 8 connection(s)
I20260927 18:37:57.897565 17956 acceptor_pool.cc:254] collecting diagnostics on the listening RPC socket 0.0.0.0:43229 every 8 connection(s)
[       OK ] Parameters/TestRpc.TestCallWithPasswordProtectedKey/SSL_TCP (20 ms)
[ RUN      ] Parameters/TestRpc.TestCallToBadServer/SSL_TCP
I20260927 18:37:57.926569 17894 rpc-test.cc:394] Status: Network error: Client connection negotiation failed: client connection to 0.0.0.0:0: connect: Connection refused (error 111)
I20260927 18:37:57.927042 17894 rpc-test.cc:394] Status: Network error: Client connection negotiation failed: client connection to 0.0.0.0:0: connect: Connection refused (error 111)
I20260927 18:37:57.927484 17894 rpc-test.cc:394] Status: Network error: Client connection negotiation failed: client connection to 0.0.0.0:0: connect: Connection refused (error 111)
I20260927 18:37:57.927877 17894 rpc-test.cc:394] Status: Network error: Client connection negotiation failed: client connection to 0.0.0.0:0: connect: Connection refused (error 111)
I20260927 18:37:57.928294 17894 rpc-test.cc:394] Status: Network error: Client connection negotiation failed: client connection to 0.0.0.0:0: connect: Connection refused (error 111)
[       OK ] Parameters/TestRpc.TestCallToBadServer/SSL_TCP (16 ms)
[ RUN      ] Parameters/TestRpc.TestWrongService/SSL_TCP
I20260927 18:37:57.939875 17990 acceptor_pool.cc:254] collecting diagnostics on the listening RPC socket 0.0.0.0:36955 every 8 connection(s)
I20260927 18:37:57.939905 17991 acceptor_pool.cc:254] collecting diagnostics on the listening RPC socket 0.0.0.0:36955 every 8 connection(s)
I20260927 18:37:57.955408 17989 messenger.cc:345] service WrongServiceName not registered on TestServer
[       OK ] Parameters/TestRpc.TestWrongService/SSL_TCP (28 ms)
[ RUN      ] Parameters/TestRpc.TestConnectionKeepalive/SSL_TCP
I20260927 18:37:57.963001 18013 acceptor_pool.cc:254] collecting diagnostics on the listening RPC socket 0.0.0.0:46395 every 8 connection(s)
I20260927 18:37:57.963063 18014 acceptor_pool.cc:254] collecting diagnostics on the listening RPC socket 0.0.0.0:46395 every 8 connection(s)
I20260927 18:37:57.963364 17894 rpc-test.cc:488] Connecting to 0.0.0.0:46395
[       OK ] Parameters/TestRpc.TestConnectionKeepalive/SSL_TCP (1040 ms)
[ RUN      ] Parameters/TestRpc.TestClientConnectionMetrics/SSL_TCP
I20260927 18:37:59.020906 18038 acceptor_pool.cc:254] collecting diagnostics on the listening RPC socket 0.0.0.0:41617 every 8 connection(s)
I20260927 18:37:59.020946 18039 acceptor_pool.cc:254] collecting diagnostics on the listening RPC socket 0.0.0.0:41617 every 8 connection(s)
I20260927 18:37:59.021239 17894 rpc-test.cc:569] Connecting to 0.0.0.0:41617
[       OK ] Parameters/TestRpc.TestClientConnectionMetrics/SSL_TCP (14490 ms)
[ RUN      ] Parameters/TestRpc.TestCredentialsPolicy/SSL_TCP
I20260927 18:38:13.504530 18061 acceptor_pool.cc:254] collecting diagnostics on the listening RPC socket 0.0.0.0:40485 every 8 connection(s)
I20260927 18:38:13.504565 18062 acceptor_pool.cc:254] collecting diagnostics on the listening RPC socket 0.0.0.0:40485 every 8 connection(s)
I20260927 18:38:13.504900 17894 rpc-test.cc:700] Connecting to 0.0.0.0:40485
[       OK ] Parameters/TestRpc.TestCredentialsPolicy/SSL_TCP (47 ms)
[ RUN      ] Parameters/TestRpc.TestCallLongerThanKeepalive/SSL_TCP
I20260927 18:38:13.573791 18086 acceptor_pool.cc:254] collecting diagnostics on the listening RPC socket 0.0.0.0:38435 every 8 connection(s)
I20260927 18:38:13.573794 18087 acceptor_pool.cc:254] collecting diagnostics on the listening RPC socket 0.0.0.0:38435 every 8 connection(s)
I20260927 18:38:13.591236 18090 rpc-test-base.h:222] got call: sleep_micros: 3000000 deferred: true
I20260927 18:38:16.592217 18090 rpcz_store.cc:275] Call kudu.rpc.GenericCalculatorService.Sleep from 127.0.0.1:42834 (request call id 0) took 3001 ms. Trace:
I20260927 18:38:16.592367 18090 rpcz_store.cc:276] 0927 18:38:13.591144 (+     0us) service_pool.cc:170] Inserting onto call queue
0927 18:38:13.591200 (+    56us) service_pool.cc:227] Handling call
0927 18:38:16.592193 (+3000993us) inbound_call.cc:173] Queueing success response
Metrics: {}
[       OK ] Parameters/TestRpc.TestCallLongerThanKeepalive/SSL_TCP (3059 ms)
[ RUN      ] Parameters/TestRpc.TestRpcSidecar/SSL_TCP
I20260927 18:38:16.621383 18111 acceptor_pool.cc:254] collecting diagnostics on the listening RPC socket 0.0.0.0:42531 every 8 connection(s)
I20260927 18:38:16.621398 18112 acceptor_pool.cc:254] collecting diagnostics on the listening RPC socket 0.0.0.0:42531 every 8 connection(s)
[       OK ] Parameters/TestRpc.TestRpcSidecar/SSL_TCP (81 ms)
[ RUN      ] Parameters/TestRpc.TestRpcSidecarLimits/SSL_TCP
I20260927 18:38:18.307956 18136 acceptor_pool.cc:254] collecting diagnostics on the listening RPC socket 0.0.0.0:40381 every 8 connection(s)
I20260927 18:38:18.307996 18137 acceptor_pool.cc:254] collecting diagnostics on the listening RPC socket 0.0.0.0:40381 every 8 connection(s)
W20260927 18:38:18.324587 17894 serialization.cc:72] Serialized kudu.rpc_test.PushStringsRequestPB (2147483654 bytes) is larger than the maximum configured RPC message size (52428800 bytes). Sending anyway, but peer may reject the data.
W20260927 18:38:18.329006 18134 connection.cc:535] server connection from 127.0.0.1:37130 recv error: Network error: RPC frame had a length of 2147483714, but we only support messages up to 52428800 bytes long.
W20260927 18:38:18.329082 18134 connection.cc:158] shutting down server connection from 127.0.0.1:37130 with pending inbound data: 4/2147483714 bytes received; last active 0 ns ago: status Network error: RPC frame had a length of 2147483714, but we only support messages up to 52428800 bytes long.
W20260927 18:38:18.329391 18149 connection.cc:196] Error closing socket: Network error: TlsSocket::Close: Connection reset by peer
I20260927 18:38:18.340085 18161 acceptor_pool.cc:254] collecting diagnostics on the listening RPC socket 0.0.0.0:35943 every 8 connection(s)
I20260927 18:38:18.340107 18162 acceptor_pool.cc:254] collecting diagnostics on the listening RPC socket 0.0.0.0:35943 every 8 connection(s)
W20260927 18:38:22.597775 18160 connection.cc:577] server connection from 127.0.0.1:60894: received bad data: 'Corruption: Invalid packet: message had a length of 2147483710, but we only support messages up to 2147483647 bytes
'
[       OK ] Parameters/TestRpc.TestRpcSidecarLimits/SSL_TCP (5923 ms)
[ RUN      ] Parameters/TestRpc.TestCallTimeoutDoesntAffectNegotiation/SSL_TCP
I20260927 18:38:22.616475 18186 acceptor_pool.cc:254] collecting diagnostics on the listening RPC socket 0.0.0.0:38693 every 8 connection(s)
I20260927 18:38:22.616624 18187 acceptor_pool.cc:254] collecting diagnostics on the listening RPC socket 0.0.0.0:38693 every 8 connection(s)
W20260927 18:38:22.633111 18182 negotiation.cc:266] Injecting 500ms delay in negotiation
I20260927 18:38:22.683669 17894 rpc-test-base.h:595] status: Timed out: connection negotiation to 0.0.0.0:38693 for RPC Sleep timed out after 0.050s (ON_OUTBOUND_QUEUE), seconds elapsed: 0.0510799
[       OK ] Parameters/TestRpc.TestCallTimeoutDoesntAffectNegotiation/SSL_TCP (538 ms)
[ RUN      ] Parameters/TestRpc.TestRpcHandlerLatencyMetric/SSL_TCP
I20260927 18:38:23.157403 18212 acceptor_pool.cc:254] collecting diagnostics on the listening RPC socket 0.0.0.0:42209 every 8 connection(s)
I20260927 18:38:23.157375 18211 acceptor_pool.cc:254] collecting diagnostics on the listening RPC socket 0.0.0.0:42209 every 8 connection(s)
I20260927 18:38:23.219975 17894 rpc-test.cc:1236] Sleep() min lat: 20459
I20260927 18:38:23.220050 17894 rpc-test.cc:1237] Sleep() mean lat: 20459
I20260927 18:38:23.220079 17894 rpc-test.cc:1238] Sleep() max lat: 20459
I20260927 18:38:23.220093 17894 rpc-test.cc:1239] Sleep() #calls: 1
[       OK ] Parameters/TestRpc.TestRpcHandlerLatencyMetric/SSL_TCP (82 ms)
[ RUN      ] Parameters/TestRpc.TimedOutOnResponseMetricServiceQueue/SSL_TCP
I20260927 18:38:23.238332 18237 acceptor_pool.cc:254] collecting diagnostics on the listening RPC socket 0.0.0.0:44283 every 8 connection(s)
I20260927 18:38:23.238374 18238 acceptor_pool.cc:254] collecting diagnostics on the listening RPC socket 0.0.0.0:44283 every 8 connection(s)
W20260927 18:38:23.292641 18239 rpcz_store.cc:267] Call kudu.rpc_test.CalculatorService.Sleep from 127.0.0.1:55640 (request call id 2) took 20 ms (client timeout 20 ms). Trace:
W20260927 18:38:23.292775 18239 rpcz_store.cc:269] 0927 18:38:23.272189 (+     0us) service_pool.cc:170] Inserting onto call queue
0927 18:38:23.292580 (+ 20391us) service_pool.cc:214] Skipping call since client already timed out
0927 18:38:23.292623 (+    43us) inbound_call.cc:173] Queueing failure response
Metrics: {}
[       OK ] Parameters/TestRpc.TimedOutOnResponseMetricServiceQueue/SSL_TCP (72 ms)
[ RUN      ] Parameters/TestRpc.RpcPendingConnectionsMetric/SSL_TCP
I20260927 18:38:23.297716 18260 acceptor_pool.cc:254] collecting diagnostics on the listening RPC socket 0.0.0.0:39061 every 8 connection(s)
I20260927 18:38:23.297762 18261 acceptor_pool.cc:254] collecting diagnostics on the listening RPC socket 0.0.0.0:39061 every 8 connection(s)
W20260927 18:38:23.299299 18256 negotiation.cc:337] Failed RPC negotiation. Trace:
0927 18:38:23.298696 (+     0us) reactor.cc:625] Submitting negotiation task for server connection from 127.0.0.1:46070 (local address 127.0.0.1:39061)
0927 18:38:23.298859 (+   163us) server_negotiation.cc:206] Beginning negotiation
0927 18:38:23.298866 (+     7us) server_negotiation.cc:399] Waiting for connection header
0927 18:38:23.299007 (+   141us) negotiation.cc:327] Negotiation complete: Network error: Server connection negotiation failed: server connection from 127.0.0.1:46070: BlockingRecv error: recv got EOF from 127.0.0.1:46070 (error 108)
Metrics: {"server-negotiator.queue_time_us":47}
[       OK ] Parameters/TestRpc.RpcPendingConnectionsMetric/SSL_TCP (15 ms)
[ RUN      ] Parameters/TestRpc.TestRpcContextClientDeadline/SSL_TCP
I20260927 18:38:23.336141 18276 acceptor_pool.cc:254] collecting diagnostics on the listening RPC socket 0.0.0.0:36065 every 8 connection(s)
I20260927 18:38:23.336160 18277 acceptor_pool.cc:254] collecting diagnostics on the listening RPC socket 0.0.0.0:36065 every 8 connection(s)
[       OK ] Parameters/TestRpc.TestRpcContextClientDeadline/SSL_TCP (68 ms)
[ RUN      ] Parameters/TestRpc.TestApplicationFeatureFlagUnsupportedServer/SSL_TCP
I20260927 18:38:23.400849 18301 acceptor_pool.cc:254] collecting diagnostics on the listening RPC socket 0.0.0.0:33567 every 8 connection(s)
I20260927 18:38:23.400873 18302 acceptor_pool.cc:254] collecting diagnostics on the listening RPC socket 0.0.0.0:33567 every 8 connection(s)
[       OK ] Parameters/TestRpc.TestApplicationFeatureFlagUnsupportedServer/SSL_TCP (44 ms)
[ RUN      ] Parameters/TestRpc.TestCancellationAsync/SSL_TCP
I20260927 18:38:23.444914 18326 acceptor_pool.cc:254] collecting diagnostics on the listening RPC socket 0.0.0.0:41775 every 8 connection(s)
I20260927 18:38:23.445178 17894 rpc-test.cc:1716] Connecting to 0.0.0.0:41775
I20260927 18:38:23.446480 18327 acceptor_pool.cc:254] collecting diagnostics on the listening RPC socket 0.0.0.0:41775 every 8 connection(s)
I20260927 18:38:23.455183 17894 test_util.cc:268] Using random seed: 1092458426
I20260927 18:38:23.484759 18330 rpc-test-base.h:240] got call: sleep_micros: 500 pattern: 4294967295 num_repetitions: 2097152 sidecar_idx: 0
I20260927 18:38:23.508703 18330 rpc-test-base.h:240] got call: sleep_micros: 500 pattern: 4294967295 num_repetitions: 2097152 sidecar_idx: 0
I20260927 18:38:23.532538 18330 rpc-test-base.h:240] got call: sleep_micros: 500 pattern: 4294967295 num_repetitions: 2097152 sidecar_idx: 0
I20260927 18:38:23.557435 18330 rpc-test-base.h:240] got call: sleep_micros: 500 pattern: 4294967295 num_repetitions: 2097152 sidecar_idx: 0
I20260927 18:38:23.582327 18330 rpc-test-base.h:240] got call: sleep_micros: 500 pattern: 4294967295 num_repetitions: 2097152 sidecar_idx: 0
I20260927 18:38:23.608927 18330 rpc-test-base.h:240] got call: sleep_micros: 500 pattern: 4294967295 num_repetitions: 2097152 sidecar_idx: 0
I20260927 18:38:23.634105 18330 rpc-test-base.h:240] got call: sleep_micros: 500 pattern: 4294967295 num_repetitions: 2097152 sidecar_idx: 0
I20260927 18:38:23.659490 18330 rpc-test-base.h:240] got call: sleep_micros: 500 pattern: 4294967295 num_repetitions: 2097152 sidecar_idx: 0
W20260927 18:38:23.677645 18324 connection.cc:441] server connection from 127.0.0.1:41924 torn down before Call kudu.rpc.GenericCalculatorService.SleepWithSidecar from 127.0.0.1:41924 (request call id 9) could send its response
[       OK ] Parameters/TestRpc.TestCancellationAsync/SSL_TCP (256 ms)
[ RUN      ] Parameters/TestRpc.TestPerformanceBySocketType/SSL_TCP
I20260927 18:38:23.700356 18352 acceptor_pool.cc:254] collecting diagnostics on the listening RPC socket 0.0.0.0:42657 every 8 connection(s)
I20260927 18:38:23.700332 18351 acceptor_pool.cc:254] collecting diagnostics on the listening RPC socket 0.0.0.0:42657 every 8 connection(s)
I20260927 18:38:23.700663 17894 rpc-test.cc:1846] Connecting to 0.0.0.0:42657
I20260927 18:38:25.944998 17894 rpc-test.cc:1859] Sending 1024MB via ssl-enabled tcp socket: real 2.224s	user 2.329s	sys 1.579s
I20260927 18:38:28.232430 17894 rpc-test.cc:1859] Sending 1024MB via ssl-enabled tcp socket: real 2.287s	user 2.380s	sys 1.634s
I20260927 18:38:30.476038 17894 rpc-test.cc:1859] Sending 1024MB via ssl-enabled tcp socket: real 2.244s	user 2.402s	sys 1.578s
I20260927 18:38:32.726837 17894 rpc-test.cc:1859] Sending 1024MB via ssl-enabled tcp socket: real 2.251s	user 2.355s	sys 1.613s
I20260927 18:38:35.062041 17894 rpc-test.cc:1859] Sending 1024MB via ssl-enabled tcp socket: real 2.335s	user 2.456s	sys 1.660s
[       OK ] Parameters/TestRpc.TestPerformanceBySocketType/SSL_TCP (11385 ms)
[----------] 20 tests from Parameters/TestRpc (37259 ms total)

[----------] 1 test from Parameters/TestRpcSocketTxRxQueue
[ RUN      ] Parameters/TestRpcSocketTxRxQueue.OverCapacity/0
W20260927 18:38:35.334925 18377 negotiation.cc:337] Failed RPC negotiation. Trace:
0927 18:38:35.067770 (+     0us) reactor.cc:625] Submitting negotiation task for client connection to 0.0.0.0:44827 (local address 127.0.0.1:54482)
0927 18:38:35.067863 (+    93us) negotiation.cc:107] Waiting for socket to connect
0927 18:38:35.067875 (+    12us) client_negotiation.cc:174] Beginning negotiation
0927 18:38:35.067964 (+    89us) client_negotiation.cc:252] Sending NEGOTIATE NegotiatePB request
0927 18:38:35.334799 (+266835us) negotiation.cc:327] Negotiation complete: Network error: Client connection negotiation failed: client connection to 0.0.0.0:44827: BlockingRecv error: recv error from unknown peer: Transport endpoint is not connected (error 107)
Metrics: {"client-negotiator.queue_time_us":24}
W20260927 18:38:35.334916 18395 negotiation.cc:337] Failed RPC negotiation. Trace:
0927 18:38:35.070191 (+     0us) reactor.cc:625] Submitting negotiation task for client connection to 0.0.0.0:44827 (local address 127.0.0.1:54506)
0927 18:38:35.070333 (+   142us) negotiation.cc:107] Waiting for socket to connect
0927 18:38:35.070345 (+    12us) client_negotiation.cc:174] Beginning negotiation
0927 18:38:35.070448 (+   103us) client_negotiation.cc:252] Sending NEGOTIATE NegotiatePB request
0927 18:38:35.334754 (+264306us) negotiation.cc:327] Negotiation complete: Network error: Client connection negotiation failed: client connection to 0.0.0.0:44827: BlockingRecv error: recv error from unknown peer: Transport endpoint is not connected (error 107)
Metrics: {"client-negotiator.queue_time_us":49}
W20260927 18:38:35.335085 18404 negotiation.cc:337] Failed RPC negotiation. Trace:
0927 18:38:35.071402 (+     0us) reactor.cc:625] Submitting negotiation task for client connection to 0.0.0.0:44827 (local address 127.0.0.1:54522)
0927 18:38:35.071523 (+   121us) negotiation.cc:107] Waiting for socket to connect
0927 18:38:35.071535 (+    12us) client_negotiation.cc:174] Beginning negotiation
0927 18:38:35.071631 (+    96us) client_negotiation.cc:252] Sending NEGOTIATE NegotiatePB request
0927 18:38:35.335025 (+263394us) negotiation.cc:327] Negotiation complete: Network error: Client connection negotiation failed: client connection to 0.0.0.0:44827: BlockingRecv error: recv error from unknown peer: Transport endpoint is not connected (error 107)
Metrics: {"client-negotiator.queue_time_us":28}
W20260927 18:38:35.335269 18413 negotiation.cc:337] Failed RPC negotiation. Trace:
0927 18:38:35.072600 (+     0us) reactor.cc:625] Submitting negotiation task for client connection to 0.0.0.0:44827 (local address 127.0.0.1:54538)
0927 18:38:35.072714 (+   114us) negotiation.cc:107] Waiting for socket to connect
0927 18:38:35.072727 (+    13us) client_negotiation.cc:174] Beginning negotiation
0927 18:38:35.072803 (+    76us) client_negotiation.cc:252] Sending NEGOTIATE NegotiatePB request
0927 18:38:35.335150 (+262347us) negotiation.cc:327] Negotiation complete: Network error: Client connection negotiation failed: client connection to 0.0.0.0:44827: BlockingRecv error: recv error from unknown peer: Transport endpoint is not connected (error 107)
Metrics: {"client-negotiator.queue_time_us":25}
W20260927 18:38:35.334916 18386 negotiation.cc:337] Failed RPC negotiation. Trace:
0927 18:38:35.068901 (+     0us) reactor.cc:625] Submitting negotiation task for client connection to 0.0.0.0:44827 (local address 127.0.0.1:54492)
0927 18:38:35.069023 (+   122us) negotiation.cc:107] Waiting for socket to connect
0927 18:38:35.069038 (+    15us) client_negotiation.cc:174] Beginning negotiation
0927 18:38:35.069123 (+    85us) client_negotiation.cc:252] Sending NEGOTIATE NegotiatePB request
0927 18:38:35.334754 (+265631us) negotiation.cc:327] Negotiation complete: Network error: Client connection negotiation failed: client connection to 0.0.0.0:44827: BlockingRecv error: recv error from unknown peer: Transport endpoint is not connected (error 107)
Metrics: {"client-negotiator.queue_time_us":43}
W20260927 18:38:35.334945 18368 negotiation.cc:337] Failed RPC negotiation. Trace:
0927 18:38:35.066363 (+     0us) reactor.cc:625] Submitting negotiation task for client connection to 0.0.0.0:44827 (local address 127.0.0.1:54468)
0927 18:38:35.066512 (+   149us) negotiation.cc:107] Waiting for socket to connect
0927 18:38:35.066525 (+    13us) client_negotiation.cc:174] Beginning negotiation
0927 18:38:35.066617 (+    92us) client_negotiation.cc:252] Sending NEGOTIATE NegotiatePB request
0927 18:38:35.334799 (+268182us) negotiation.cc:327] Negotiation complete: Network error: Client connection negotiation failed: client connection to 0.0.0.0:44827: BlockingRecv error: recv error from unknown peer: Transport endpoint is not connected (error 107)
Metrics: {"client-negotiator.queue_time_us":55}
[       OK ] Parameters/TestRpcSocketTxRxQueue.OverCapacity/0 (1047 ms)
[----------] 1 test from Parameters/TestRpcSocketTxRxQueue (1047 ms total)

[----------] Global test environment tear-down
[==========] 21 tests from 2 test suites ran. (38306 ms total)
[  PASSED  ] 20 tests.
[  FAILED  ] 1 test, listed below:
[  FAILED  ] Parameters/TestRpc.TestCallWithChainCertAndChainCA/SSL_TCP, where GetParam() = (true, false)

 1 FAILED TEST