Diagnosed failure
Parameters/TestRpc.TestCallWithChainCertAndChainCA/SSL_TCP: /data0/somelongdirectorytoavoidrpathissues/src/kudu/src/kudu/rpc/rpc-test.cc:270: Failure
Failed
Bad status: Runtime error: could not verify certificate chain (error with cert: subject=CN = localhost, ST = sadfjas, C = AS, emailAddress = sdflkdsajf, O = lskdfjlsad, OU = sldfkja, issuer=C = AS, ST = ASDfkjdhf, L = lskdjf, O = saldfja, OU = skdjf, CN = localhost, emailAddress = sadjflkadsj): : certificate has expired
Google Test trace:
/data0/somelongdirectorytoavoidrpathissues/src/kudu/src/kudu/rpc/rpc-test.cc:267: Connecting to 0.0.0.0:33735
I20260924 14:27:22.430066 24180 test_util.cc:175] -----------------------------------------------
I20260924 14:27:22.430274 24180 test_util.cc:176] Had fatal failures, leaving test files at /tmp/dist-test-taskfi7D9G/test-tmp/rpc-test.5.Parameters_TestRpc.TestCallWithChainCertAndChainCA_SSL_TCP.1790260040954288-24180-0
Full log
Note: This is test shard 6 of 8.
[==========] Running 21 tests from 2 test suites.
[----------] Global test environment set-up.
[----------] 20 tests from Parameters/TestRpc
[ RUN ] Parameters/TestRpc.TestMessengerCreateDestroy/SSL_TCP
WARNING: Logging before InitGoogleLogging() is written to STDERR
I20260924 14:27:21.088397 24180 rpc-test.cc:169] started messenger TestCreateDestroy
[ OK ] Parameters/TestRpc.TestMessengerCreateDestroy/SSL_TCP (1256 ms)
[ RUN ] Parameters/TestRpc.TestNegotiationDeadlock/SSL_TCP
I20260924 14:27:22.308998 24202 acceptor_pool.cc:254] collecting diagnostics on the listening RPC socket 0.0.0.0:40573 every 8 connection(s)
I20260924 14:27:22.310724 24203 acceptor_pool.cc:254] collecting diagnostics on the listening RPC socket 0.0.0.0:40573 every 8 connection(s)
[ OK ] Parameters/TestRpc.TestNegotiationDeadlock/SSL_TCP (101 ms)
[ RUN ] Parameters/TestRpc.TestCallWithChainCertAndChainCA/SSL_TCP
I20260924 14:27:22.399178 24218 acceptor_pool.cc:254] collecting diagnostics on the listening RPC socket 0.0.0.0:33735 every 8 connection(s)
I20260924 14:27:22.401633 24219 acceptor_pool.cc:254] collecting diagnostics on the listening RPC socket 0.0.0.0:33735 every 8 connection(s)
/data0/somelongdirectorytoavoidrpathissues/src/kudu/src/kudu/rpc/rpc-test.cc:270: Failure
Failed
Bad status: Runtime error: could not verify certificate chain (error with cert: subject=CN = localhost, ST = sadfjas, C = AS, emailAddress = sdflkdsajf, O = lskdfjlsad, OU = sldfkja, issuer=C = AS, ST = ASDfkjdhf, L = lskdjf, O = saldfja, OU = skdjf, CN = localhost, emailAddress = sadjflkadsj): : certificate has expired
Google Test trace:
/data0/somelongdirectorytoavoidrpathissues/src/kudu/src/kudu/rpc/rpc-test.cc:267: Connecting to 0.0.0.0:33735
I20260924 14:27:22.430066 24180 test_util.cc:175] -----------------------------------------------
I20260924 14:27:22.430274 24180 test_util.cc:176] Had fatal failures, leaving test files at /tmp/dist-test-taskfi7D9G/test-tmp/rpc-test.5.Parameters_TestRpc.TestCallWithChainCertAndChainCA_SSL_TCP.1790260040954288-24180-0
[ FAILED ] Parameters/TestRpc.TestCallWithChainCertAndChainCA/SSL_TCP, where GetParam() = (true, false) (58 ms)
[ RUN ] Parameters/TestRpc.TestCallWithPasswordProtectedKey/SSL_TCP
I20260924 14:27:22.453258 24243 acceptor_pool.cc:254] collecting diagnostics on the listening RPC socket 0.0.0.0:39841 every 8 connection(s)
I20260924 14:27:22.454037 24244 acceptor_pool.cc:254] collecting diagnostics on the listening RPC socket 0.0.0.0:39841 every 8 connection(s)
[ OK ] Parameters/TestRpc.TestCallWithPasswordProtectedKey/SSL_TCP (81 ms)
[ RUN ] Parameters/TestRpc.TestCallToBadServer/SSL_TCP
I20260924 14:27:22.535995 24180 rpc-test.cc:394] Status: Network error: Client connection negotiation failed: client connection to 0.0.0.0:0: connect: Connection refused (error 111)
I20260924 14:27:22.537388 24180 rpc-test.cc:394] Status: Network error: Client connection negotiation failed: client connection to 0.0.0.0:0: connect: Connection refused (error 111)
I20260924 14:27:22.538739 24180 rpc-test.cc:394] Status: Network error: Client connection negotiation failed: client connection to 0.0.0.0:0: connect: Connection refused (error 111)
I20260924 14:27:22.539986 24180 rpc-test.cc:394] Status: Network error: Client connection negotiation failed: client connection to 0.0.0.0:0: connect: Connection refused (error 111)
I20260924 14:27:22.541307 24180 rpc-test.cc:394] Status: Network error: Client connection negotiation failed: client connection to 0.0.0.0:0: connect: Connection refused (error 111)
[ OK ] Parameters/TestRpc.TestCallToBadServer/SSL_TCP (32 ms)
[ RUN ] Parameters/TestRpc.TestWrongService/SSL_TCP
I20260924 14:27:22.578466 24278 acceptor_pool.cc:254] collecting diagnostics on the listening RPC socket 0.0.0.0:46765 every 8 connection(s)
I20260924 14:27:22.579285 24279 acceptor_pool.cc:254] collecting diagnostics on the listening RPC socket 0.0.0.0:46765 every 8 connection(s)
I20260924 14:27:22.609553 24275 messenger.cc:345] service WrongServiceName not registered on TestServer
[ OK ] Parameters/TestRpc.TestWrongService/SSL_TCP (73 ms)
[ RUN ] Parameters/TestRpc.TestConnectionKeepalive/SSL_TCP
I20260924 14:27:22.641912 24301 acceptor_pool.cc:254] collecting diagnostics on the listening RPC socket 0.0.0.0:43913 every 8 connection(s)
I20260924 14:27:22.642663 24302 acceptor_pool.cc:254] collecting diagnostics on the listening RPC socket 0.0.0.0:43913 every 8 connection(s)
I20260924 14:27:22.646190 24180 rpc-test.cc:488] Connecting to 0.0.0.0:43913
[ OK ] Parameters/TestRpc.TestConnectionKeepalive/SSL_TCP (1077 ms)
[ RUN ] Parameters/TestRpc.TestClientConnectionMetrics/SSL_TCP
I20260924 14:27:23.719967 24326 acceptor_pool.cc:254] collecting diagnostics on the listening RPC socket 0.0.0.0:33247 every 8 connection(s)
I20260924 14:27:23.720773 24327 acceptor_pool.cc:254] collecting diagnostics on the listening RPC socket 0.0.0.0:33247 every 8 connection(s)
I20260924 14:27:23.724081 24180 rpc-test.cc:569] Connecting to 0.0.0.0:33247
[ OK ] Parameters/TestRpc.TestClientConnectionMetrics/SSL_TCP (122243 ms)
[ RUN ] Parameters/TestRpc.TestCredentialsPolicy/SSL_TCP
I20260924 14:29:25.968691 24361 acceptor_pool.cc:254] collecting diagnostics on the listening RPC socket 0.0.0.0:41659 every 8 connection(s)
I20260924 14:29:25.969575 24362 acceptor_pool.cc:254] collecting diagnostics on the listening RPC socket 0.0.0.0:41659 every 8 connection(s)
I20260924 14:29:25.973467 24180 rpc-test.cc:700] Connecting to 0.0.0.0:41659
[ OK ] Parameters/TestRpc.TestCredentialsPolicy/SSL_TCP (99 ms)
[ RUN ] Parameters/TestRpc.TestCallLongerThanKeepalive/SSL_TCP
I20260924 14:29:26.068245 24386 acceptor_pool.cc:254] collecting diagnostics on the listening RPC socket 0.0.0.0:34503 every 8 connection(s)
I20260924 14:29:26.069096 24387 acceptor_pool.cc:254] collecting diagnostics on the listening RPC socket 0.0.0.0:34503 every 8 connection(s)
I20260924 14:29:26.098807 24390 rpc-test-base.h:222] got call: sleep_micros: 3000000 deferred: true
I20260924 14:29:29.103637 24390 rpcz_store.cc:275] Call kudu.rpc.GenericCalculatorService.Sleep from 127.0.0.1:42838 (request call id 0) took 3005 ms. Trace:
I20260924 14:29:29.104000 24390 rpcz_store.cc:276] 0924 14:29:26.098555 (+ 0us) service_pool.cc:170] Inserting onto call queue
0924 14:29:26.098659 (+ 104us) service_pool.cc:227] Handling call
0924 14:29:29.103578 (+3004919us) inbound_call.cc:173] Queueing success response
Metrics: {}
[ OK ] Parameters/TestRpc.TestCallLongerThanKeepalive/SSL_TCP (3074 ms)
[ RUN ] Parameters/TestRpc.TestRpcSidecar/SSL_TCP
I20260924 14:29:29.164980 24411 acceptor_pool.cc:254] collecting diagnostics on the listening RPC socket 0.0.0.0:46565 every 8 connection(s)
I20260924 14:29:29.165695 24412 acceptor_pool.cc:254] collecting diagnostics on the listening RPC socket 0.0.0.0:46565 every 8 connection(s)
[ OK ] Parameters/TestRpc.TestRpcSidecar/SSL_TCP (548 ms)
[ RUN ] Parameters/TestRpc.TestRpcSidecarLimits/SSL_TCP
I20260924 14:29:49.749313 24438 acceptor_pool.cc:254] collecting diagnostics on the listening RPC socket 0.0.0.0:41503 every 8 connection(s)
I20260924 14:29:49.750159 24439 acceptor_pool.cc:254] collecting diagnostics on the listening RPC socket 0.0.0.0:41503 every 8 connection(s)
W20260924 14:29:49.770707 24180 serialization.cc:72] Serialized kudu.rpc_test.PushStringsRequestPB (2147483654 bytes) is larger than the maximum configured RPC message size (52428800 bytes). Sending anyway, but peer may reject the data.
W20260924 14:29:49.782241 24435 connection.cc:535] server connection from 127.0.0.1:53966 recv error: Network error: RPC frame had a length of 2147483714, but we only support messages up to 52428800 bytes long.
W20260924 14:29:49.782584 24435 connection.cc:158] shutting down server connection from 127.0.0.1:53966 with pending inbound data: 4/2147483714 bytes received; last active 0 ns ago: status Network error: RPC frame had a length of 2147483714, but we only support messages up to 52428800 bytes long.
W20260924 14:29:49.783464 24451 connection.cc:698] client connection to 0.0.0.0:41503 send error: Network error: failed to write to TLS socket: Connection reset by peer
W20260924 14:29:49.784197 24451 connection.cc:196] Error closing socket: Network error: TlsSocket::Close: Success
[ OK ] Parameters/TestRpc.TestRpcSidecarLimits/SSL_TCP (20934 ms)
[ RUN ] Parameters/TestRpc.TestCallTimeoutDoesntAffectNegotiation/SSL_TCP
I20260924 14:29:50.616405 24463 acceptor_pool.cc:254] collecting diagnostics on the listening RPC socket 0.0.0.0:40415 every 8 connection(s)
I20260924 14:29:50.617027 24464 acceptor_pool.cc:254] collecting diagnostics on the listening RPC socket 0.0.0.0:40415 every 8 connection(s)
W20260924 14:29:50.643769 24459 negotiation.cc:266] Injecting 500ms delay in negotiation
I20260924 14:29:50.693259 24180 rpc-test-base.h:595] status: Timed out: connection negotiation to 0.0.0.0:40415 for RPC Sleep timed out after 0.050s (ON_OUTBOUND_QUEUE), seconds elapsed: 0.0506163
[ OK ] Parameters/TestRpc.TestCallTimeoutDoesntAffectNegotiation/SSL_TCP (564 ms)
[ RUN ] Parameters/TestRpc.TestRpcHandlerLatencyMetric/SSL_TCP
I20260924 14:29:51.189046 24488 acceptor_pool.cc:254] collecting diagnostics on the listening RPC socket 0.0.0.0:33315 every 8 connection(s)
I20260924 14:29:51.189769 24489 acceptor_pool.cc:254] collecting diagnostics on the listening RPC socket 0.0.0.0:33315 every 8 connection(s)
I20260924 14:29:51.263414 24180 rpc-test.cc:1236] Sleep() min lat: 21769
I20260924 14:29:51.263610 24180 rpc-test.cc:1237] Sleep() mean lat: 21769
I20260924 14:29:51.263739 24180 rpc-test.cc:1238] Sleep() max lat: 21769
I20260924 14:29:51.263890 24180 rpc-test.cc:1239] Sleep() #calls: 1
[ OK ] Parameters/TestRpc.TestRpcHandlerLatencyMetric/SSL_TCP (109 ms)
[ RUN ] Parameters/TestRpc.TimedOutOnResponseMetricServiceQueue/SSL_TCP
I20260924 14:29:51.290797 24514 acceptor_pool.cc:254] collecting diagnostics on the listening RPC socket 0.0.0.0:41105 every 8 connection(s)
I20260924 14:29:51.291580 24515 acceptor_pool.cc:254] collecting diagnostics on the listening RPC socket 0.0.0.0:41105 every 8 connection(s)
W20260924 14:29:51.373430 24516 rpcz_store.cc:267] Call kudu.rpc_test.CalculatorService.Sleep from 127.0.0.1:40246 (request call id 2) took 20 ms (client timeout 20 ms). Trace:
W20260924 14:29:51.373867 24516 rpcz_store.cc:269] 0924 14:29:51.352814 (+ 0us) service_pool.cc:170] Inserting onto call queue
0924 14:29:51.373243 (+ 20429us) service_pool.cc:214] Skipping call since client already timed out
0924 14:29:51.373364 (+ 121us) inbound_call.cc:173] Queueing failure response
Metrics: {}
[ OK ] Parameters/TestRpc.TimedOutOnResponseMetricServiceQueue/SSL_TCP (109 ms)
[ RUN ] Parameters/TestRpc.RpcPendingConnectionsMetric/SSL_TCP
I20260924 14:29:51.391733 24537 acceptor_pool.cc:254] collecting diagnostics on the listening RPC socket 0.0.0.0:37617 every 8 connection(s)
I20260924 14:29:51.392566 24538 acceptor_pool.cc:254] collecting diagnostics on the listening RPC socket 0.0.0.0:37617 every 8 connection(s)
W20260924 14:29:51.398072 24533 negotiation.cc:337] Failed RPC negotiation. Trace:
0924 14:29:51.396778 (+ 0us) reactor.cc:625] Submitting negotiation task for server connection from 127.0.0.1:37382 (local address 127.0.0.1:37617)
0924 14:29:51.397180 (+ 402us) server_negotiation.cc:206] Beginning negotiation
0924 14:29:51.397198 (+ 18us) server_negotiation.cc:399] Waiting for connection header
0924 14:29:51.397442 (+ 244us) negotiation.cc:327] Negotiation complete: Network error: Server connection negotiation failed: server connection from 127.0.0.1:37382: BlockingRecv error: recv got EOF from 127.0.0.1:37382 (error 108)
Metrics: {"server-negotiator.queue_time_us":98}
[ OK ] Parameters/TestRpc.RpcPendingConnectionsMetric/SSL_TCP (31 ms)
[ RUN ] Parameters/TestRpc.TestRpcContextClientDeadline/SSL_TCP
I20260924 14:29:51.443156 24553 acceptor_pool.cc:254] collecting diagnostics on the listening RPC socket 0.0.0.0:45177 every 8 connection(s)
I20260924 14:29:51.443905 24554 acceptor_pool.cc:254] collecting diagnostics on the listening RPC socket 0.0.0.0:45177 every 8 connection(s)
[ OK ] Parameters/TestRpc.TestRpcContextClientDeadline/SSL_TCP (108 ms)
[ RUN ] Parameters/TestRpc.TestApplicationFeatureFlagUnsupportedServer/SSL_TCP
I20260924 14:29:51.541971 24578 acceptor_pool.cc:254] collecting diagnostics on the listening RPC socket 0.0.0.0:36159 every 8 connection(s)
I20260924 14:29:51.542745 24579 acceptor_pool.cc:254] collecting diagnostics on the listening RPC socket 0.0.0.0:36159 every 8 connection(s)
[ OK ] Parameters/TestRpc.TestApplicationFeatureFlagUnsupportedServer/SSL_TCP (78 ms)
[ RUN ] Parameters/TestRpc.TestCancellationAsync/SSL_TCP
I20260924 14:29:51.625306 24604 acceptor_pool.cc:254] collecting diagnostics on the listening RPC socket 0.0.0.0:38243 every 8 connection(s)
I20260924 14:29:51.626101 24605 acceptor_pool.cc:254] collecting diagnostics on the listening RPC socket 0.0.0.0:38243 every 8 connection(s)
I20260924 14:29:51.629405 24180 rpc-test.cc:1716] Connecting to 0.0.0.0:38243
I20260924 14:29:51.653359 24180 test_util.cc:268] Using random seed: 1858563542
I20260924 14:29:51.890772 24608 rpc-test-base.h:240] got call: sleep_micros: 500 pattern: 4294967295 num_repetitions: 2097152 sidecar_idx: 0
I20260924 14:29:52.075647 24607 rpc-test-base.h:240] got call: sleep_micros: 500 pattern: 4294967295 num_repetitions: 2097152 sidecar_idx: 0
I20260924 14:29:52.257690 24608 rpc-test-base.h:240] got call: sleep_micros: 500 pattern: 4294967295 num_repetitions: 2097152 sidecar_idx: 0
W20260924 14:29:52.358285 24617 outbound_call.cc:322] RPC callback for RPC call kudu.rpc.GenericCalculatorService.SleepWithSidecar -> {remote=0.0.0.0:38243 (localhost), user_credentials={real_user=slave}} blocked reactor thread for 46434.7us
I20260924 14:29:52.454785 24607 rpc-test-base.h:240] got call: sleep_micros: 500 pattern: 4294967295 num_repetitions: 2097152 sidecar_idx: 0
I20260924 14:29:52.636888 24608 rpc-test-base.h:240] got call: sleep_micros: 500 pattern: 4294967295 num_repetitions: 2097152 sidecar_idx: 0
I20260924 14:29:52.821163 24607 rpc-test-base.h:240] got call: sleep_micros: 500 pattern: 4294967295 num_repetitions: 2097152 sidecar_idx: 0
I20260924 14:29:53.012566 24608 rpc-test-base.h:240] got call: sleep_micros: 500 pattern: 4294967295 num_repetitions: 2097152 sidecar_idx: 0
I20260924 14:29:53.199399 24607 rpc-test-base.h:240] got call: sleep_micros: 500 pattern: 4294967295 num_repetitions: 2097152 sidecar_idx: 0
W20260924 14:29:53.364957 24602 connection.cc:196] Error closing socket: Network error: TlsSocket::Close: Broken pipe
W20260924 14:29:53.369158 24602 connection.cc:441] server connection from 127.0.0.1:59506 torn down before Call kudu.rpc.GenericCalculatorService.SleepWithSidecar from 127.0.0.1:59506 (request call id 8) could send its response
[ OK ] Parameters/TestRpc.TestCancellationAsync/SSL_TCP (1780 ms)
[ RUN ] Parameters/TestRpc.TestPerformanceBySocketType/SSL_TCP
I20260924 14:29:53.494498 24629 acceptor_pool.cc:254] collecting diagnostics on the listening RPC socket 0.0.0.0:36025 every 8 connection(s)
I20260924 14:29:53.495368 24630 acceptor_pool.cc:254] collecting diagnostics on the listening RPC socket 0.0.0.0:36025 every 8 connection(s)
I20260924 14:29:53.498744 24180 rpc-test.cc:1846] Connecting to 0.0.0.0:36025
I20260924 14:30:13.776628 24180 rpc-test.cc:1859] Sending 1024MB via ssl-enabled tcp socket: real 20.253s user 17.393s sys 11.529s
I20260924 14:30:33.612546 24180 rpc-test.cc:1859] Sending 1024MB via ssl-enabled tcp socket: real 19.835s user 16.727s sys 11.369s
I20260924 14:30:53.685232 24180 rpc-test.cc:1859] Sending 1024MB via ssl-enabled tcp socket: real 20.072s user 17.182s sys 11.248s
I20260924 14:31:13.695489 24180 rpc-test.cc:1859] Sending 1024MB via ssl-enabled tcp socket: real 20.010s user 17.157s sys 11.296s
I20260924 14:31:33.694730 24180 rpc-test.cc:1859] Sending 1024MB via ssl-enabled tcp socket: real 19.999s user 16.991s sys 11.351s
[ OK ] Parameters/TestRpc.TestPerformanceBySocketType/SSL_TCP (100335 ms)
[----------] 20 tests from Parameters/TestRpc (252703 ms total)
[----------] 1 test from Parameters/TestRpcSocketTxRxQueue
[ RUN ] Parameters/TestRpcSocketTxRxQueue.OverCapacity/0
W20260924 14:31:34.171231 24665 negotiation.cc:337] Failed RPC negotiation. Trace:
0924 14:31:33.737923 (+ 0us) reactor.cc:625] Submitting negotiation task for client connection to 0.0.0.0:42271 (local address 127.0.0.1:48806)
0924 14:31:33.738390 (+ 467us) negotiation.cc:107] Waiting for socket to connect
0924 14:31:33.738421 (+ 31us) client_negotiation.cc:174] Beginning negotiation
0924 14:31:33.738621 (+ 200us) client_negotiation.cc:252] Sending NEGOTIATE NegotiatePB request
0924 14:31:34.168641 (+430020us) negotiation.cc:327] Negotiation complete: Network error: Client connection negotiation failed: client connection to 0.0.0.0:42271: BlockingRecv error: recv error from unknown peer: Transport endpoint is not connected (error 107)
Metrics: {"client-negotiator.queue_time_us":99}
W20260924 14:31:34.171310 24692 negotiation.cc:337] Failed RPC negotiation. Trace:
0924 14:31:33.771558 (+ 0us) reactor.cc:625] Submitting negotiation task for client connection to 0.0.0.0:42271 (local address 127.0.0.1:48838)
0924 14:31:33.772224 (+ 666us) negotiation.cc:107] Waiting for socket to connect
0924 14:31:33.772291 (+ 67us) client_negotiation.cc:174] Beginning negotiation
0924 14:31:33.772584 (+ 293us) client_negotiation.cc:252] Sending NEGOTIATE NegotiatePB request
0924 14:31:34.169178 (+396594us) negotiation.cc:327] Negotiation complete: Network error: Client connection negotiation failed: client connection to 0.0.0.0:42271: BlockingRecv error: recv error from unknown peer: Transport endpoint is not connected (error 107)
Metrics: {"client-negotiator.queue_time_us":167}
W20260924 14:31:34.171603 24674 negotiation.cc:337] Failed RPC negotiation. Trace:
0924 14:31:33.745548 (+ 0us) reactor.cc:625] Submitting negotiation task for client connection to 0.0.0.0:42271 (local address 127.0.0.1:48814)
0924 14:31:33.746162 (+ 614us) negotiation.cc:107] Waiting for socket to connect
0924 14:31:33.746192 (+ 30us) client_negotiation.cc:174] Beginning negotiation
0924 14:31:33.746519 (+ 327us) client_negotiation.cc:252] Sending NEGOTIATE NegotiatePB request
0924 14:31:34.168606 (+422087us) negotiation.cc:327] Negotiation complete: Network error: Client connection negotiation failed: client connection to 0.0.0.0:42271: BlockingRecv error: recv error from unknown peer: Transport endpoint is not connected (error 107)
Metrics: {"client-negotiator.queue_time_us":183}
W20260924 14:31:34.173691 24683 negotiation.cc:337] Failed RPC negotiation. Trace:
0924 14:31:33.758482 (+ 0us) reactor.cc:625] Submitting negotiation task for client connection to 0.0.0.0:42271 (local address 127.0.0.1:48824)
0924 14:31:33.759130 (+ 648us) negotiation.cc:107] Waiting for socket to connect
0924 14:31:33.759167 (+ 37us) client_negotiation.cc:174] Beginning negotiation
0924 14:31:33.759580 (+ 413us) client_negotiation.cc:252] Sending NEGOTIATE NegotiatePB request
0924 14:31:34.168606 (+409026us) negotiation.cc:327] Negotiation complete: Network error: Client connection negotiation failed: client connection to 0.0.0.0:42271: BlockingRecv error: recv error from unknown peer: Transport endpoint is not connected (error 107)
Metrics: {"client-negotiator.queue_time_us":170}
W20260924 14:31:34.173974 24656 negotiation.cc:337] Failed RPC negotiation. Trace:
0924 14:31:33.730680 (+ 0us) reactor.cc:625] Submitting negotiation task for client connection to 0.0.0.0:42271 (local address 127.0.0.1:48794)
0924 14:31:33.731402 (+ 722us) negotiation.cc:107] Waiting for socket to connect
0924 14:31:33.731446 (+ 44us) client_negotiation.cc:174] Beginning negotiation
0924 14:31:33.731947 (+ 501us) client_negotiation.cc:252] Sending NEGOTIATE NegotiatePB request
0924 14:31:34.168645 (+436698us) negotiation.cc:327] Negotiation complete: Network error: Client connection negotiation failed: client connection to 0.0.0.0:42271: BlockingRecv error: recv error from unknown peer: Transport endpoint is not connected (error 107)
Metrics: {"client-negotiator.queue_time_us":151}
W20260924 14:31:34.174574 24701 negotiation.cc:337] Failed RPC negotiation. Trace:
0924 14:31:33.784257 (+ 0us) reactor.cc:625] Submitting negotiation task for client connection to 0.0.0.0:42271 (local address 127.0.0.1:48844)
0924 14:31:33.784910 (+ 653us) negotiation.cc:107] Waiting for socket to connect
0924 14:31:33.784944 (+ 34us) client_negotiation.cc:174] Beginning negotiation
0924 14:31:33.785221 (+ 277us) client_negotiation.cc:252] Sending NEGOTIATE NegotiatePB request
0924 14:31:34.169758 (+384537us) negotiation.cc:327] Negotiation complete: Network error: Client connection negotiation failed: client connection to 0.0.0.0:42271: BlockingRecv error: recv error from unknown peer: Transport endpoint is not connected (error 107)
Metrics: {"client-negotiator.queue_time_us":157}
[ OK ] Parameters/TestRpcSocketTxRxQueue.OverCapacity/0 (1261 ms)
[----------] 1 test from Parameters/TestRpcSocketTxRxQueue (1262 ms total)
[----------] Global test environment tear-down
[==========] 21 tests from 2 test suites ran. (253966 ms total)
[ PASSED ] 20 tests.
[ FAILED ] 1 test, listed below:
[ FAILED ] Parameters/TestRpc.TestCallWithChainCertAndChainCA/SSL_TCP, where GetParam() = (true, false)
1 FAILED TEST