Diagnosed failure
Parameters/TestRpc.TestCallWithChainCertAndChainCA/SSL_UnixSocket: /data0/somelongdirectorytoavoidrpathissues/src/kudu/src/kudu/rpc/rpc-test.cc:270: Failure
Failed
Bad status: Runtime error: could not verify certificate chain (error with cert: subject=CN = localhost, ST = sadfjas, C = AS, emailAddress = sdflkdsajf, O = lskdfjlsad, OU = sldfkja, issuer=C = AS, ST = ASDfkjdhf, L = lskdjf, O = saldfja, OU = skdjf, CN = localhost, emailAddress = sadjflkadsj): : certificate has expired
Google Test trace:
/data0/somelongdirectorytoavoidrpathissues/src/kudu/src/kudu/rpc/rpc-test.cc:267: Connecting to unix:/tmp/dist-test-taskBegavv/test-tmp/rpc-test-bc2f5834611e48708a97bf2f7a9547ab.sock
I20260926 03:37:00.068184 379 test_util.cc:175] -----------------------------------------------
I20260926 03:37:00.068259 379 test_util.cc:176] Had fatal failures, leaving test files at /tmp/dist-test-taskBegavv/test-tmp/rpc-test.6.Parameters_TestRpc.TestCallWithChainCertAndChainCA_SSL_UnixSocket.1790393819943120-379-0
Full log
Note: This is test shard 7 of 8.
[==========] Running 21 tests from 2 test suites.
[----------] Global test environment set-up.
[----------] 20 tests from Parameters/TestRpc
[ RUN ] Parameters/TestRpc.TestMessengerCreateDestroy/SSL_UnixSocket
WARNING: Logging before InitGoogleLogging() is written to STDERR
I20260926 03:36:59.995405 379 rpc-test.cc:169] started messenger TestCreateDestroy
[ OK ] Parameters/TestRpc.TestMessengerCreateDestroy/SSL_UnixSocket (36 ms)
[ RUN ] Parameters/TestRpc.TestNegotiationDeadlock/SSL_UnixSocket
I20260926 03:37:00.013134 399 acceptor_pool.cc:254] collecting diagnostics on the listening RPC socket unix:/tmp/dist-test-taskBegavv/test-tmp/rpc-test-d1a30ed9df3e48ec80ba6b73bc347c42.sock every 8 connection(s)
I20260926 03:37:00.013444 400 acceptor_pool.cc:254] collecting diagnostics on the listening RPC socket unix:/tmp/dist-test-taskBegavv/test-tmp/rpc-test-d1a30ed9df3e48ec80ba6b73bc347c42.sock every 8 connection(s)
[ OK ] Parameters/TestRpc.TestNegotiationDeadlock/SSL_UnixSocket (33 ms)
[ RUN ] Parameters/TestRpc.TestCallWithChainCertAndChainCA/SSL_UnixSocket
I20260926 03:37:00.056538 415 acceptor_pool.cc:254] collecting diagnostics on the listening RPC socket unix:/tmp/dist-test-taskBegavv/test-tmp/rpc-test-bc2f5834611e48708a97bf2f7a9547ab.sock every 8 connection(s)
I20260926 03:37:00.057035 416 acceptor_pool.cc:254] collecting diagnostics on the listening RPC socket unix:/tmp/dist-test-taskBegavv/test-tmp/rpc-test-bc2f5834611e48708a97bf2f7a9547ab.sock every 8 connection(s)
/data0/somelongdirectorytoavoidrpathissues/src/kudu/src/kudu/rpc/rpc-test.cc:270: Failure
Failed
Bad status: Runtime error: could not verify certificate chain (error with cert: subject=CN = localhost, ST = sadfjas, C = AS, emailAddress = sdflkdsajf, O = lskdfjlsad, OU = sldfkja, issuer=C = AS, ST = ASDfkjdhf, L = lskdjf, O = saldfja, OU = skdjf, CN = localhost, emailAddress = sadjflkadsj): : certificate has expired
Google Test trace:
/data0/somelongdirectorytoavoidrpathissues/src/kudu/src/kudu/rpc/rpc-test.cc:267: Connecting to unix:/tmp/dist-test-taskBegavv/test-tmp/rpc-test-bc2f5834611e48708a97bf2f7a9547ab.sock
I20260926 03:37:00.068184 379 test_util.cc:175] -----------------------------------------------
I20260926 03:37:00.068259 379 test_util.cc:176] Had fatal failures, leaving test files at /tmp/dist-test-taskBegavv/test-tmp/rpc-test.6.Parameters_TestRpc.TestCallWithChainCertAndChainCA_SSL_UnixSocket.1790393819943120-379-0
[ FAILED ] Parameters/TestRpc.TestCallWithChainCertAndChainCA/SSL_UnixSocket, where GetParam() = (true, true) (36 ms)
[ RUN ] Parameters/TestRpc.TestCallWithPasswordProtectedKey/SSL_UnixSocket
I20260926 03:37:00.081935 440 acceptor_pool.cc:254] collecting diagnostics on the listening RPC socket unix:/tmp/dist-test-taskBegavv/test-tmp/rpc-test-f0fdeafb5c70457aa9bd896b71b65719.sock every 8 connection(s)
I20260926 03:37:00.082206 441 acceptor_pool.cc:254] collecting diagnostics on the listening RPC socket unix:/tmp/dist-test-taskBegavv/test-tmp/rpc-test-f0fdeafb5c70457aa9bd896b71b65719.sock every 8 connection(s)
W20260926 03:37:00.111773 437 connection.cc:196] Error closing socket: Network error: TlsSocket::Close: Broken pipe
[ OK ] Parameters/TestRpc.TestCallWithPasswordProtectedKey/SSL_UnixSocket (47 ms)
[ RUN ] Parameters/TestRpc.TestCallToBadServer/SSL_UnixSocket
I20260926 03:37:00.131656 379 rpc-test.cc:394] Status: Network error: Client connection negotiation failed: client connection to 0.0.0.0:0: connect: Connection refused (error 111)
I20260926 03:37:00.132256 379 rpc-test.cc:394] Status: Network error: Client connection negotiation failed: client connection to 0.0.0.0:0: connect: Connection refused (error 111)
I20260926 03:37:00.132786 379 rpc-test.cc:394] Status: Network error: Client connection negotiation failed: client connection to 0.0.0.0:0: connect: Connection refused (error 111)
I20260926 03:37:00.133261 379 rpc-test.cc:394] Status: Network error: Client connection negotiation failed: client connection to 0.0.0.0:0: connect: Connection refused (error 111)
I20260926 03:37:00.133742 379 rpc-test.cc:394] Status: Network error: Client connection negotiation failed: client connection to 0.0.0.0:0: connect: Connection refused (error 111)
[ OK ] Parameters/TestRpc.TestCallToBadServer/SSL_UnixSocket (19 ms)
[ RUN ] Parameters/TestRpc.TestWrongService/SSL_UnixSocket
I20260926 03:37:00.145534 475 acceptor_pool.cc:254] collecting diagnostics on the listening RPC socket unix:/tmp/dist-test-taskBegavv/test-tmp/rpc-test-0591ae58f0a344e0ad1c23efde68fef2.sock every 8 connection(s)
I20260926 03:37:00.145772 476 acceptor_pool.cc:254] collecting diagnostics on the listening RPC socket unix:/tmp/dist-test-taskBegavv/test-tmp/rpc-test-0591ae58f0a344e0ad1c23efde68fef2.sock every 8 connection(s)
I20260926 03:37:00.164597 472 messenger.cc:345] service WrongServiceName not registered on TestServer
W20260926 03:37:00.166133 472 connection.cc:196] Error closing socket: Network error: TlsSocket::Close: Broken pipe
[ OK ] Parameters/TestRpc.TestWrongService/SSL_UnixSocket (34 ms)
[ RUN ] Parameters/TestRpc.TestConnectionKeepalive/SSL_UnixSocket
I20260926 03:37:00.178637 498 acceptor_pool.cc:254] collecting diagnostics on the listening RPC socket unix:/tmp/dist-test-taskBegavv/test-tmp/rpc-test-01163af71b3b4979aca8b4d974f3a0cc.sock every 8 connection(s)
I20260926 03:37:00.178843 499 acceptor_pool.cc:254] collecting diagnostics on the listening RPC socket unix:/tmp/dist-test-taskBegavv/test-tmp/rpc-test-01163af71b3b4979aca8b4d974f3a0cc.sock every 8 connection(s)
I20260926 03:37:00.179649 379 rpc-test.cc:488] Connecting to unix:/tmp/dist-test-taskBegavv/test-tmp/rpc-test-01163af71b3b4979aca8b4d974f3a0cc.sock
W20260926 03:37:00.671334 511 connection.cc:196] Error closing socket: Network error: TlsSocket::Close: Broken pipe
[ OK ] Parameters/TestRpc.TestConnectionKeepalive/SSL_UnixSocket (1042 ms)
[ RUN ] Parameters/TestRpc.TestClientConnectionMetrics/SSL_UnixSocket
I20260926 03:37:01.231707 523 acceptor_pool.cc:254] collecting diagnostics on the listening RPC socket unix:/tmp/dist-test-taskBegavv/test-tmp/rpc-test-cc49178aafc34153b09bb144d1d35157.sock every 8 connection(s)
I20260926 03:37:01.231925 524 acceptor_pool.cc:254] collecting diagnostics on the listening RPC socket unix:/tmp/dist-test-taskBegavv/test-tmp/rpc-test-cc49178aafc34153b09bb144d1d35157.sock every 8 connection(s)
I20260926 03:37:01.232849 379 rpc-test.cc:569] Connecting to unix:/tmp/dist-test-taskBegavv/test-tmp/rpc-test-cc49178aafc34153b09bb144d1d35157.sock
W20260926 03:37:21.899119 520 connection.cc:196] Error closing socket: Network error: TlsSocket::Close: Broken pipe
[ OK ] Parameters/TestRpc.TestClientConnectionMetrics/SSL_UnixSocket (20692 ms)
[ RUN ] Parameters/TestRpc.TestCredentialsPolicy/SSL_UnixSocket
I20260926 03:37:21.922209 546 acceptor_pool.cc:254] collecting diagnostics on the listening RPC socket unix:/tmp/dist-test-taskBegavv/test-tmp/rpc-test-057273bdf534463aba9c055a6a1ec906.sock every 8 connection(s)
I20260926 03:37:21.922391 547 acceptor_pool.cc:254] collecting diagnostics on the listening RPC socket unix:/tmp/dist-test-taskBegavv/test-tmp/rpc-test-057273bdf534463aba9c055a6a1ec906.sock every 8 connection(s)
I20260926 03:37:21.923297 379 rpc-test.cc:700] Connecting to unix:/tmp/dist-test-taskBegavv/test-tmp/rpc-test-057273bdf534463aba9c055a6a1ec906.sock
W20260926 03:37:21.944082 545 connection.cc:196] Error closing socket: Network error: TlsSocket::Close: Broken pipe
[ OK ] Parameters/TestRpc.TestCredentialsPolicy/SSL_UnixSocket (48 ms)
[ RUN ] Parameters/TestRpc.TestCallLongerThanKeepalive/SSL_UnixSocket
I20260926 03:37:21.969712 571 acceptor_pool.cc:254] collecting diagnostics on the listening RPC socket unix:/tmp/dist-test-taskBegavv/test-tmp/rpc-test-ee881bee142b43d684cb9cd35948be48.sock every 8 connection(s)
I20260926 03:37:21.969959 572 acceptor_pool.cc:254] collecting diagnostics on the listening RPC socket unix:/tmp/dist-test-taskBegavv/test-tmp/rpc-test-ee881bee142b43d684cb9cd35948be48.sock every 8 connection(s)
I20260926 03:37:21.982906 575 rpc-test-base.h:222] got call: sleep_micros: 3000000 deferred: true
I20260926 03:37:24.984459 575 rpcz_store.cc:275] Call kudu.rpc.GenericCalculatorService.Sleep from unix:<unnamed> (request call id 0) took 3001 ms. Trace:
I20260926 03:37:24.984632 575 rpcz_store.cc:276] 0926 03:37:21.982812 (+ 0us) service_pool.cc:170] Inserting onto call queue
0926 03:37:21.982866 (+ 54us) service_pool.cc:227] Handling call
0926 03:37:24.984418 (+3001552us) inbound_call.cc:173] Queueing success response
Metrics: {}
[ OK ] Parameters/TestRpc.TestCallLongerThanKeepalive/SSL_UnixSocket (3037 ms)
[ RUN ] Parameters/TestRpc.TestRpcSidecar/SSL_UnixSocket
I20260926 03:37:25.007493 596 acceptor_pool.cc:254] collecting diagnostics on the listening RPC socket unix:/tmp/dist-test-taskBegavv/test-tmp/rpc-test-99e071815c8b4474a09904ffc6f6c069.sock every 8 connection(s)
I20260926 03:37:25.007731 597 acceptor_pool.cc:254] collecting diagnostics on the listening RPC socket unix:/tmp/dist-test-taskBegavv/test-tmp/rpc-test-99e071815c8b4474a09904ffc6f6c069.sock every 8 connection(s)
W20260926 03:37:25.092628 593 connection.cc:196] Error closing socket: Network error: TlsSocket::Close: Broken pipe
[ OK ] Parameters/TestRpc.TestRpcSidecar/SSL_UnixSocket (105 ms)
[ RUN ] Parameters/TestRpc.TestRpcSidecarLimits/SSL_UnixSocket
I20260926 03:37:27.153412 621 acceptor_pool.cc:254] collecting diagnostics on the listening RPC socket unix:/tmp/dist-test-taskBegavv/test-tmp/rpc-test-6ad8728895b644bdbcc127bd1f48da20.sock every 8 connection(s)
I20260926 03:37:27.153699 622 acceptor_pool.cc:254] collecting diagnostics on the listening RPC socket unix:/tmp/dist-test-taskBegavv/test-tmp/rpc-test-6ad8728895b644bdbcc127bd1f48da20.sock every 8 connection(s)
W20260926 03:37:27.167729 379 serialization.cc:72] Serialized kudu.rpc_test.PushStringsRequestPB (2147483654 bytes) is larger than the maximum configured RPC message size (52428800 bytes). Sending anyway, but peer may reject the data.
W20260926 03:37:27.173602 618 connection.cc:535] server connection from unix:<unnamed> recv error: Network error: RPC frame had a length of 2147483714, but we only support messages up to 52428800 bytes long.
W20260926 03:37:27.174165 618 connection.cc:158] shutting down server connection from unix:<unnamed> with pending inbound data: 4/2147483714 bytes received; last active 0 ns ago: status Network error: RPC frame had a length of 2147483714, but we only support messages up to 52428800 bytes long.
W20260926 03:37:27.174597 634 connection.cc:196] Error closing socket: Network error: TlsSocket::Close: Broken pipe
I20260926 03:37:27.195835 646 acceptor_pool.cc:254] collecting diagnostics on the listening RPC socket unix:/tmp/dist-test-taskBegavv/test-tmp/rpc-test-6ad8728895b644bdbcc127bd1f48da20.sock every 8 connection(s)
I20260926 03:37:27.196139 647 acceptor_pool.cc:254] collecting diagnostics on the listening RPC socket unix:/tmp/dist-test-taskBegavv/test-tmp/rpc-test-6ad8728895b644bdbcc127bd1f48da20.sock every 8 connection(s)
W20260926 03:37:32.723080 643 connection.cc:577] server connection from unix:<unnamed>: received bad data: 'Corruption: Invalid packet: message had a length of 2147483710, but we only support messages up to 2147483647 bytes
'
W20260926 03:37:32.723655 659 connection.cc:196] Error closing socket: Network error: TlsSocket::Close: Broken pipe
[ OK ] Parameters/TestRpc.TestRpcSidecarLimits/SSL_UnixSocket (8097 ms)
[ RUN ] Parameters/TestRpc.TestCallTimeoutDoesntAffectNegotiation/SSL_UnixSocket
I20260926 03:37:33.229880 671 acceptor_pool.cc:254] collecting diagnostics on the listening RPC socket unix:/tmp/dist-test-taskBegavv/test-tmp/rpc-test-279afe73e2f54189bc38b7300559d2c4.sock every 8 connection(s)
I20260926 03:37:33.230098 672 acceptor_pool.cc:254] collecting diagnostics on the listening RPC socket unix:/tmp/dist-test-taskBegavv/test-tmp/rpc-test-279afe73e2f54189bc38b7300559d2c4.sock every 8 connection(s)
W20260926 03:37:33.251497 667 negotiation.cc:266] Injecting 500ms delay in negotiation
I20260926 03:37:33.301942 379 rpc-test-base.h:595] status: Timed out: connection negotiation to unix:/tmp/dist-test-taskBegavv/test-tmp/rpc-test-279afe73e2f54189bc38b7300559d2c4.sock for RPC Sleep timed out after 0.050s (ON_OUTBOUND_QUEUE), seconds elapsed: 0.0509852
W20260926 03:37:33.758104 668 connection.cc:196] Error closing socket: Network error: TlsSocket::Close: Broken pipe
[ OK ] Parameters/TestRpc.TestCallTimeoutDoesntAffectNegotiation/SSL_UnixSocket (567 ms)
[ RUN ] Parameters/TestRpc.TestRpcHandlerLatencyMetric/SSL_UnixSocket
I20260926 03:37:33.771837 696 acceptor_pool.cc:254] collecting diagnostics on the listening RPC socket unix:/tmp/dist-test-taskBegavv/test-tmp/rpc-test-872c8cfb1a9148a39b7a4efa36020158.sock every 8 connection(s)
I20260926 03:37:33.772213 697 acceptor_pool.cc:254] collecting diagnostics on the listening RPC socket unix:/tmp/dist-test-taskBegavv/test-tmp/rpc-test-872c8cfb1a9148a39b7a4efa36020158.sock every 8 connection(s)
I20260926 03:37:33.825907 379 rpc-test.cc:1236] Sleep() min lat: 20545
I20260926 03:37:33.826000 379 rpc-test.cc:1237] Sleep() mean lat: 20545
I20260926 03:37:33.826067 379 rpc-test.cc:1238] Sleep() max lat: 20545
I20260926 03:37:33.826104 379 rpc-test.cc:1239] Sleep() #calls: 1
W20260926 03:37:33.827425 693 connection.cc:196] Error closing socket: Network error: TlsSocket::Close: Broken pipe
[ OK ] Parameters/TestRpc.TestRpcHandlerLatencyMetric/SSL_UnixSocket (69 ms)
[ RUN ] Parameters/TestRpc.TimedOutOnResponseMetricServiceQueue/SSL_UnixSocket
I20260926 03:37:33.846065 722 acceptor_pool.cc:254] collecting diagnostics on the listening RPC socket unix:/tmp/dist-test-taskBegavv/test-tmp/rpc-test-c2c16a5b20a44d19b6098688a8abc65f.sock every 8 connection(s)
I20260926 03:37:33.846287 723 acceptor_pool.cc:254] collecting diagnostics on the listening RPC socket unix:/tmp/dist-test-taskBegavv/test-tmp/rpc-test-c2c16a5b20a44d19b6098688a8abc65f.sock every 8 connection(s)
W20260926 03:37:33.925733 724 rpcz_store.cc:267] Call kudu.rpc_test.CalculatorService.Sleep from unix:<unnamed> (request call id 2) took 20 ms (client timeout 20 ms). Trace:
W20260926 03:37:33.925882 724 rpcz_store.cc:269] 0926 03:37:33.905440 (+ 0us) service_pool.cc:170] Inserting onto call queue
0926 03:37:33.925674 (+ 20234us) service_pool.cc:214] Skipping call since client already timed out
0926 03:37:33.925718 (+ 44us) inbound_call.cc:173] Queueing failure response
Metrics: {}
[ OK ] Parameters/TestRpc.TimedOutOnResponseMetricServiceQueue/SSL_UnixSocket (98 ms)
[ RUN ] Parameters/TestRpc.RpcPendingConnectionsMetric/SSL_UnixSocket
I20260926 03:37:33.934576 745 acceptor_pool.cc:254] collecting diagnostics on the listening RPC socket 0.0.0.0:36189 every 8 connection(s)
I20260926 03:37:33.934857 746 acceptor_pool.cc:254] collecting diagnostics on the listening RPC socket 0.0.0.0:36189 every 8 connection(s)
W20260926 03:37:33.944977 741 negotiation.cc:337] Failed RPC negotiation. Trace:
0926 03:37:33.944144 (+ 0us) reactor.cc:625] Submitting negotiation task for server connection from 127.0.0.1:44672 (local address 127.0.0.1:36189)
0926 03:37:33.944362 (+ 218us) server_negotiation.cc:206] Beginning negotiation
0926 03:37:33.944370 (+ 8us) server_negotiation.cc:399] Waiting for connection header
0926 03:37:33.944554 (+ 184us) negotiation.cc:327] Negotiation complete: Network error: Server connection negotiation failed: server connection from 127.0.0.1:44672: BlockingRecv error: recv got EOF from 127.0.0.1:44672 (error 108)
Metrics: {"server-negotiator.queue_time_us":56}
[ OK ] Parameters/TestRpc.RpcPendingConnectionsMetric/SSL_UnixSocket (26 ms)
[ RUN ] Parameters/TestRpc.TestRpcContextClientDeadline/SSL_UnixSocket
I20260926 03:37:33.972520 761 acceptor_pool.cc:254] collecting diagnostics on the listening RPC socket unix:/tmp/dist-test-taskBegavv/test-tmp/rpc-test-c49b96c045954f85a6b62359326f988b.sock every 8 connection(s)
I20260926 03:37:33.972738 762 acceptor_pool.cc:254] collecting diagnostics on the listening RPC socket unix:/tmp/dist-test-taskBegavv/test-tmp/rpc-test-c49b96c045954f85a6b62359326f988b.sock every 8 connection(s)
[ OK ] Parameters/TestRpc.TestRpcContextClientDeadline/SSL_UnixSocket (64 ms)
[ RUN ] Parameters/TestRpc.TestApplicationFeatureFlagUnsupportedServer/SSL_UnixSocket
I20260926 03:37:34.043355 786 acceptor_pool.cc:254] collecting diagnostics on the listening RPC socket unix:/tmp/dist-test-taskBegavv/test-tmp/rpc-test-4bc2f82f5e4f4a7fb68aa53a84239f56.sock every 8 connection(s)
I20260926 03:37:34.043630 787 acceptor_pool.cc:254] collecting diagnostics on the listening RPC socket unix:/tmp/dist-test-taskBegavv/test-tmp/rpc-test-4bc2f82f5e4f4a7fb68aa53a84239f56.sock every 8 connection(s)
[ OK ] Parameters/TestRpc.TestApplicationFeatureFlagUnsupportedServer/SSL_UnixSocket (50 ms)
[ RUN ] Parameters/TestRpc.TestCancellationAsync/SSL_UnixSocket
I20260926 03:37:34.083326 811 acceptor_pool.cc:254] collecting diagnostics on the listening RPC socket unix:/tmp/dist-test-taskBegavv/test-tmp/rpc-test-643330b8e2ae44f9acd92260a8519b20.sock every 8 connection(s)
I20260926 03:37:34.083562 812 acceptor_pool.cc:254] collecting diagnostics on the listening RPC socket unix:/tmp/dist-test-taskBegavv/test-tmp/rpc-test-643330b8e2ae44f9acd92260a8519b20.sock every 8 connection(s)
I20260926 03:37:34.084408 379 rpc-test.cc:1716] Connecting to unix:/tmp/dist-test-taskBegavv/test-tmp/rpc-test-643330b8e2ae44f9acd92260a8519b20.sock
I20260926 03:37:34.100245 379 test_util.cc:268] Using random seed: -1917943035
I20260926 03:37:34.134428 815 rpc-test-base.h:240] got call: sleep_micros: 500 pattern: 4294967295 num_repetitions: 2097152 sidecar_idx: 0
I20260926 03:37:34.161257 814 rpc-test-base.h:240] got call: sleep_micros: 500 pattern: 4294967295 num_repetitions: 2097152 sidecar_idx: 0
I20260926 03:37:34.188812 813 rpc-test-base.h:240] got call: sleep_micros: 500 pattern: 4294967295 num_repetitions: 2097152 sidecar_idx: 0
I20260926 03:37:34.217049 815 rpc-test-base.h:240] got call: sleep_micros: 500 pattern: 4294967295 num_repetitions: 2097152 sidecar_idx: 0
I20260926 03:37:34.250438 814 rpc-test-base.h:240] got call: sleep_micros: 500 pattern: 4294967295 num_repetitions: 2097152 sidecar_idx: 0
I20260926 03:37:34.284127 815 rpc-test-base.h:240] got call: sleep_micros: 500 pattern: 4294967295 num_repetitions: 2097152 sidecar_idx: 0
W20260926 03:37:34.286054 808 connection.cc:196] Error closing socket: Network error: TlsSocket::Close: Broken pipe
W20260926 03:37:34.307034 808 connection.cc:441] server connection from unix:<unnamed> torn down before Call kudu.rpc.GenericCalculatorService.SleepWithSidecar from unix:<unnamed> (request call id 8) could send its response
W20260926 03:37:34.326872 808 connection.cc:441] server connection from unix:<unnamed> torn down before Call kudu.rpc.GenericCalculatorService.SleepWithSidecar from unix:<unnamed> (request call id 9) could send its response
[ OK ] Parameters/TestRpc.TestCancellationAsync/SSL_UnixSocket (257 ms)
[ RUN ] Parameters/TestRpc.TestPerformanceBySocketType/SSL_UnixSocket
I20260926 03:37:34.346104 836 acceptor_pool.cc:254] collecting diagnostics on the listening RPC socket unix:/tmp/dist-test-taskBegavv/test-tmp/rpc-test-ce5ff9894b8a4c728a4383979a2a7c4e.sock every 8 connection(s)
I20260926 03:37:34.346320 837 acceptor_pool.cc:254] collecting diagnostics on the listening RPC socket unix:/tmp/dist-test-taskBegavv/test-tmp/rpc-test-ce5ff9894b8a4c728a4383979a2a7c4e.sock every 8 connection(s)
I20260926 03:37:34.347225 379 rpc-test.cc:1846] Connecting to unix:/tmp/dist-test-taskBegavv/test-tmp/rpc-test-ce5ff9894b8a4c728a4383979a2a7c4e.sock
I20260926 03:37:37.215087 379 rpc-test.cc:1859] Sending 1024MB via ssl-enabled unix socket: real 2.837s user 2.790s sys 2.029s
I20260926 03:37:40.304821 379 rpc-test.cc:1859] Sending 1024MB via ssl-enabled unix socket: real 3.090s user 3.107s sys 2.174s
I20260926 03:37:43.325956 379 rpc-test.cc:1859] Sending 1024MB via ssl-enabled unix socket: real 3.021s user 2.906s sys 2.230s
I20260926 03:37:46.271863 379 rpc-test.cc:1859] Sending 1024MB via ssl-enabled unix socket: real 2.946s user 2.871s sys 2.138s
I20260926 03:37:49.305085 379 rpc-test.cc:1859] Sending 1024MB via ssl-enabled unix socket: real 3.033s user 2.998s sys 2.188s
W20260926 03:37:49.307981 833 connection.cc:196] Error closing socket: Network error: TlsSocket::Close: Broken pipe
[ OK ] Parameters/TestRpc.TestPerformanceBySocketType/SSL_UnixSocket (14985 ms)
[----------] 20 tests from Parameters/TestRpc (49353 ms total)
[----------] 1 test from Parameters/TestRpcSocketTxRxQueue
[ RUN ] Parameters/TestRpcSocketTxRxQueue.AcceptorRxQueueSizeMetric/0
I20260926 03:37:49.326329 861 acceptor_pool.cc:254] collecting diagnostics on the listening RPC socket 0.0.0.0:43211 every 1 connection(s)
I20260926 03:37:49.326603 862 acceptor_pool.cc:254] collecting diagnostics on the listening RPC socket 0.0.0.0:43211 every 1 connection(s)
W20260926 03:37:49.328238 857 negotiation.cc:337] Failed RPC negotiation. Trace:
0926 03:37:49.327859 (+ 0us) reactor.cc:625] Submitting negotiation task for server connection from 127.0.0.1:41046 (local address 127.0.0.1:43211)
0926 03:37:49.327995 (+ 136us) server_negotiation.cc:206] Beginning negotiation
0926 03:37:49.327999 (+ 4us) server_negotiation.cc:399] Waiting for connection header
0926 03:37:49.328113 (+ 114us) negotiation.cc:327] Negotiation complete: Network error: Server connection negotiation failed: server connection from 127.0.0.1:41046: BlockingRecv error: recv got EOF from 127.0.0.1:41046 (error 108)
Metrics: {"server-negotiator.queue_time_us":43}
[ OK ] Parameters/TestRpcSocketTxRxQueue.AcceptorRxQueueSizeMetric/0 (16 ms)
[----------] 1 test from Parameters/TestRpcSocketTxRxQueue (16 ms total)
[----------] Global test environment tear-down
[==========] 21 tests from 2 test suites ran. (49370 ms total)
[ PASSED ] 20 tests.
[ FAILED ] 1 test, listed below:
[ FAILED ] Parameters/TestRpc.TestCallWithChainCertAndChainCA/SSL_UnixSocket, where GetParam() = (true, true)
1 FAILED TEST